{"text_format":"1","workbook":"xlsx","n_sheets":2,"sheets":["Main Page","Tables"],"not_rendered":{"charts":0,"images":0,"macros":1,"external_links":0,"defined_names":8,"comments":0,"pivot_tables":0},"unopened":[],"bounds":{"document_bytes":16777216,"sheet_cells":100000,"rows_first":2000,"rows_last":500,"rows_between":2000,"halvings":0,"cell_chars":16384,"cell_head_chars":4096},"cells_cut":0,"cells_raw":0,"read":"whole","date_system":"1900"}

{"sheet":"Main Page","index":0,"n_rows":305,"n_cols":17,"rows_kept":305,"cut":false,"hidden":false,"merged":[[4,13,4,15],[5,13,5,15],[6,13,6,15],[4,4,4,5],[2,4,2,5],[8,4,8,5],[6,4,6,5],[47,0,48,9],[45,0,45,3],[26,7,28,7],[20,7,22,7],[23,7,25,7],[26,9,28,9],[20,9,22,9],[23,9,25,9],[26,8,28,8],[20,8,22,8],[23,8,25,8],[14,8,16,8],[32,7,34,7],[32,8,34,8],[38,7,40,8],[17,9,19,9],[35,7,37,7],[35,8,37,8],[35,9,37,9],[38,9,40,9],[32,9,34,9],[12,1,13,1],[12,0,13,0],[29,7,31,7],[29,8,31,8],[29,9,31,9],[12,7,12,9],[12,5,13,5],[12,4,13,4],[12,3,13,3],[12,2,13,2],[14,7,16,7],[17,7,19,7],[17,8,19,8],[14,9,16,9],[16,11,17,14],[19,11,23,14],[16,15,17,15],[20,15,22,15],[10,4,10,5]]}
[]
[]
["Month:",null,null,null,"2017-01-01"]
[]
["Employee Code:",null,null,null,{"$f":"VLOOKUP(E7,Table2[],3,0)","v":12100001},null,null,null,null,null,null,null,3,"عدد الأسماء المطلوبين"]
[null,null,null,null,null,null,null,null,null,null,null,null,"الكل","الاسم المطلوب طباعته",null,null,"الكل"]
["Staff Name:",null,null,null,{"$f":"INDEX(Tables!$B$3:$B$1000,$M$7)","v":"Median Ali"},null,null,null,null,null,null,null,1,"رقم الاسم الذي ستتم طباعته",null,null,1]
[null,null,null,null,null,null,null,null,null,null,null,null,"إلى رقم",null,"طباعة من رقم",null,{"$f":"IF(OR(Q7=$M$5,Q7=\"\"),\"\",Q7+1)","v":2}]
["Staff Position:",null,null,null,{"$f":"VLOOKUP(E7,Table2[],4,0)","v":"Physician"},null,null,null,null,null,null,null,null,null,null,null,3]
[null,null,null,null,null,null,null,null,null,null,null,null,null,null,null,null,""]
["Staff Field Location:",null,null,null,{"$f":"VLOOKUP(E7,Table2[],5,0)","v":"alp01"},null,null,null,null,null,null,null,null,null,null,null,""]
[null,null,null,null,null,null,null,null,null,null,null,null,null,null,null,null,""]
["Pay Period Day","Day","Date","Start Time","Finish Time","Hours Worked",null,"LDR",null,null,null,null,null,null,null,null,""]
[null,null,null,null,null,null,null,"Grant code","End Date","% to Charge",null,null,null,null,"المطلوب",null,""]
[1,{"$f":"TEXT(C15,\"[$-809]ddd;@\")","v":"ddd"},{"$f":"E3","v":"2017-01-01"},{"$f":"IF(OR(TEXT($C15,\"[$-809]ddd;@\")=\"FRI\",TEXT($C15,\"[$-809]ddd;@\")=\"FRI\"),\"0:00\",\"09:00\")","v":"09:00"},{"$f":"IF(OR(TEXT($C15,\"[$-809]ddd;@\")=\"FRI\",TEXT($C15,\"[$-809]ddd;@\")=\"FRI\"),\"0:00\",\"17:00\")","v":"17:00"},{"$f":"IF(OR(TEXT($C15,\"[$-809]ddd;@\")=\"FRI\",TEXT($C15,\"[$-809]ddd;@\")=\"FRI\"),\"0:00:00\",E15-D15)","v":"08:00:00"},null,"w01","2018-03-31",{"$f":"VLOOKUP(E7,Table2[],7,0)","v":0},null,null,null,null,null,null,""]
[2,{"$f":"TEXT(C16,\"[$-809]ddd;@\")","v":"ddd"},{"$f":"C15+1","v":"2017-01-02"},{"$f":"IF(OR(TEXT($C16,\"[$-809]ddd;@\")=\"FRI\",TEXT($C16,\"[$-809]ddd;@\")=\"FRI\"),\"0:00\",\"09:00\")","v":"09:00"},{"$f":"IF(OR(TEXT($C16,\"[$-809]ddd;@\")=\"FRI\",TEXT($C16,\"[$-809]ddd;@\")=\"FRI\"),\"0:00\",\"17:00\")","v":"17:00"},{"$f":"IF(OR(TEXT($C16,\"[$-809]ddd;@\")=\"FRI\",TEXT($C16,\"[$-809]ddd;@\")=\"FRI\"),\"0:00:00\",E16-D16)","v":"08:00:00"},null,null,null,null,null,null,null,null,null,null,""]
[3,{"$f":"TEXT(C17,\"[$-809]ddd;@\")","v":"ddd"},{"$f":"C16+1","v":"2017-01-03"},{"$f":"IF(OR(TEXT($C17,\"[$-809]ddd;@\")=\"FRI\",TEXT($C17,\"[$-809]ddd;@\")=\"FRI\"),\"0:00\",\"00:00\")","v":"00:00"},"00:00","00:00:00",null,null,null,null,null," إمكانية الطباعة من رقم            الى رقم",null,null,null,1,""]
[4,"ddd","2017-01-04","00:00","00:00","00:00:00",null,"H2","2017-12-30",{"$f":"VLOOKUP(E7,Table2[],8,0)","v":0},null,null,null,null,null,null,""]
[5,"ddd","2017-01-05","00:00","00:00","00:00:00",null,null,null,null,null,null,null,null,null,null,""]
[6,"ddd","2017-01-06","00:00","00:00","00:00:00",null,null,null,null,null,"عند احتيار الشهر هناك مشكلة في الأيام يظهر اول يوم من الشهر الذي يليه ان كان الهر 30 يوم",null,null,null,null,""]
[7,"ddd","2017-01-07",{"$f":"IF(OR(TEXT($C21,\"[$-809]ddd;@\")=\"FRI\",TEXT($C21,\"[$-809]ddd;@\")=\"FRI\"),\"0:00\",\"09:00\")","v":"09:00"},{"$f":"IF(OR(TEXT($C21,\"[$-809]ddd;@\")=\"FRI\",TEXT($C21,\"[$-809]ddd;@\")=\"FRI\"),\"0:00\",\"17:00\")","v":"17:00"},"08:00:00",null,"U3","2018-04-30",{"$f":"VLOOKUP(E7,Table2[],9,0)","v":0},null,null,null,null,null,2,""]
[8,"ddd","2017-01-08",{"$f":"IF(OR(TEXT($C22,\"[$-809]ddd;@\")=\"FRI\",TEXT($C22,\"[$-809]ddd;@\")=\"FRI\"),\"0:00\",\"09:00\")","v":"09:00"},{"$f":"IF(OR(TEXT($C22,\"[$-809]ddd;@\")=\"FRI\",TEXT($C22,\"[$-809]ddd;@\")=\"FRI\"),\"0:00\",\"17:00\")","v":"17:00"},"08:00:00",null,null,null,null,null,null,null,null,null,null,""]
[9,"ddd","2017-01-09","09:00","17:00","08:00:00",null,null,null,null,null,null,null,null,null,null,""]
[10,"ddd","2017-01-10",{"$f":"IF(OR(TEXT($C24,\"[$-809]ddd;@\")=\"FRI\",TEXT($C24,\"[$-809]ddd;@\")=\"FRI\"),\"0:00\",\"00:00\")","v":"00:00"},"00:00","00:00:00",null,"I4","2018-09-30",{"$f":"VLOOKUP(E7,Table2[],10,0)","v":0},null,null,null,null,null,null,""]
[11,"ddd","2017-01-11","00:00","00:00","00:00:00",null,null,null,null,null,null,null,null,null,null,""]
[12,"ddd","2017-01-12","00:00","00:00","00:00:00",null,null,null,null,null,null,null,null,null,null,""]
[13,"ddd","2017-01-13","00:00","00:00","00:00:00",null,"R5","2018-12-31",{"$f":"VLOOKUP(E7,Table2[],11,0)","v":1},null,null,null,null,null,null,""]
[14,"ddd","2017-01-14",{"$f":"IF(OR(TEXT($C28,\"[$-809]ddd;@\")=\"FRI\",TEXT($C28,\"[$-809]ddd;@\")=\"FRI\"),\"0:00\",\"09:00\")","v":"09:00"},{"$f":"IF(OR(TEXT($C28,\"[$-809]ddd;@\")=\"FRI\",TEXT($C28,\"[$-809]ddd;@\")=\"FRI\"),\"0:00\",\"17:00\")","v":"17:00"},"08:00:00",null,null,null,null,null,null,null,null,null,null,""]
[15,"ddd","2017-01-15",{"$f":"IF(OR(TEXT($C29,\"[$-809]ddd;@\")=\"FRI\",TEXT($C29,\"[$-809]ddd;@\")=\"FRI\"),\"0:00\",\"09:00\")","v":"09:00"},{"$f":"IF(OR(TEXT($C29,\"[$-809]ddd;@\")=\"FRI\",TEXT($C29,\"[$-809]ddd;@\")=\"FRI\"),\"0:00\",\"17:00\")","v":"17:00"},"08:00:00",null,null,null,null,null,null,null,null,null,null,""]
[16,"ddd","2017-01-16","09:00","17:00","08:00:00",null,"B6","2018-12-31",{"$f":"VLOOKUP(E7,Table2[],12,0)","v":0},null,null,null,null,null,null,""]
[17,"ddd","2017-01-17",{"$f":"IF(OR(TEXT($C31,\"[$-809]ddd;@\")=\"FRI\",TEXT($C31,\"[$-809]ddd;@\")=\"FRI\"),\"0:00\",\"00:00\")","v":"00:00"},"00:00","00:00:00",null,null,null,null,null,null,null,null,null,null,""]
[18,"ddd","2017-01-18","00:00","00:00","00:00:00",null,null,null,null,null,null,null,null,null,null,""]
[19,"ddd","2017-01-19","00:00","00:00","00:00:00",null,"D7","2018-08-31",{"$f":"VLOOKUP(E7,Table2[],13,0)","v":0},null,null,null,null,null,null,""]
[20,"ddd","2017-01-20","00:00","00:00","00:00:00",null,null,null,null,null,null,null,null,null,null,""]
[21,"ddd","2017-01-21",{"$f":"IF(OR(TEXT($C35,\"[$-809]ddd;@\")=\"FRI\",TEXT($C35,\"[$-809]ddd;@\")=\"FRI\"),\"0:00\",\"09:00\")","v":"09:00"},{"$f":"IF(OR(TEXT($C35,\"[$-809]ddd;@\")=\"FRI\",TEXT($C35,\"[$-809]ddd;@\")=\"FRI\"),\"0:00\",\"17:00\")","v":"17:00"},"08:00:00",null,null,null,null,null,null,null,null,null,null,""]
[22,"ddd","2017-01-22",{"$f":"IF(OR(TEXT($C36,\"[$-809]ddd;@\")=\"FRI\",TEXT($C36,\"[$-809]ddd;@\")=\"FRI\"),\"0:00\",\"09:00\")","v":"09:00"},{"$f":"IF(OR(TEXT($C36,\"[$-809]ddd;@\")=\"FRI\",TEXT($C36,\"[$-809]ddd;@\")=\"FRI\"),\"0:00\",\"17:00\")","v":"17:00"},"08:00:00",null,"S8","2018-06-20",{"$f":"VLOOKUP(E7,Table2[],14,0)","v":0},null,null,null,null,null,null,""]
[23,"ddd","2017-01-23","09:00","17:00","08:00:00",null,null,null,null,null,null,null,null,"+",null,""]
[24,"ddd","2017-01-24",{"$f":"IF(OR(TEXT($C38,\"[$-809]ddd;@\")=\"FRI\",TEXT($C38,\"[$-809]ddd;@\")=\"FRI\"),\"0:00\",\"00:00\")","v":"00:00"},"00:00","00:00:00",null,null,null,null,null,null,null,null,null,null,""]
[25,"ddd","2017-01-25","00:00","00:00","00:00:00",null,"TOTAL MUST BE PAID 100%",null,{"$f":"SUM(J15:J38)","v":1},null,null,null,null,null,null,""]
[26,"ddd","2017-01-26","00:00","00:00","00:00:00",null,null,null,null,null,null,null,null,null,null,""]
[27,"ddd","2017-01-27","00:00","00:00","00:00:00",null,null,null,null,null,null,null,null,null,null,""]
[{"$f":"IF($B42=\"\",\"\",$A41+1)","v":28},{"$f":"IF($C42=\"\",\"\",TEXT(C42,\"[$-809]ddd;@\"))","v":"ddd"},{"$f":"IF($C41=\"\",\"\",IF(MONTH($C41+1)<>MONTH($E$3),\"\",$C41+1))","v":"2017-01-28"},{"$f":"IF($C42=\"\",\"\",IF(OR(TEXT($C42,\"[$-809]ddd;@\")=\"FRI\",TEXT($C42,\"[$-809]ddd;@\")=\"FRI\"),\"0:00\",\"09:00\"))","v":"09:00"},{"$f":"IF($C42=\"\",\"\",IF(OR(TEXT($C42,\"[$-809]ddd;@\")=\"FRI\",TEXT($C42,\"[$-809]ddd;@\")=\"FRI\"),\"0:00\",\"17:00\"))","v":"17:00"},{"$f":"IF($C42=\"\",\"\",IF(OR(TEXT($C42,\"[$-809]ddd;@\")=\"FRI\",TEXT($C42,\"[$-809]ddd;@\")=\"FRI\"),\"0:00:00\",E42-D42))","v":"08:00:00"},null,null,null,null,null,null,null,null,null,null,""]
[{"$f":"IF($B43=\"\",\"\",$A42+1)","v":29},{"$f":"IF($C43=\"\",\"\",TEXT(C43,\"[$-809]ddd;@\"))","v":"ddd"},{"$f":"IF($C42=\"\",\"\",IF(MONTH($C42+1)<>MONTH($E$3),\"\",$C42+1))","v":"2017-01-29"},{"$f":"IF($C43=\"\",\"\",IF(OR(TEXT($C43,\"[$-809]ddd;@\")=\"FRI\",TEXT($C43,\"[$-809]ddd;@\")=\"FRI\"),\"0:00\",\"09:00\"))","v":"09:00"},{"$f":"IF($C43=\"\",\"\",IF(OR(TEXT($C43,\"[$-809]ddd;@\")=\"FRI\",TEXT($C43,\"[$-809]ddd;@\")=\"FRI\"),\"0:00\",\"17:00\"))","v":"17:00"},{"$f":"IF($C43=\"\",\"\",IF(OR(TEXT($C43,\"[$-809]ddd;@\")=\"FRI\",TEXT($C43,\"[$-809]ddd;@\")=\"FRI\"),\"0:00:00\",E43-D43))","v":"08:00:00"},null,null,null,null,null,null,null,null,null,null,""]
[30,"ddd","2017-01-30","09:00","17:00","08:00:00",null,null,null,null,null,null,null,null,null,null,""]
[31,"ddd","2017-01-31","09:00","17:00","08:00:00",null,null,null,null,null,null,null,null,null,null,""]
["Total Hours Worked",null,null,null,null,{"$f":"SUM(F15:F45)","v":5},null,null,null,null,null,null,null,null,null,null,""]
[null,null,null,null,null,null,null,null,null,null,null,null,null,null,null,null,""]
["The signatures on this time sheet attests to the fact that the percentage allocation to grant agreements is a reasonable and true estimation of the time and effort dedicatdto each project for the period being reported.",null,null,null,null,null,null,null,null,null,null,null,null,null,null,null,""]
[null,null,null,null,null,null,null,null,null,null,null,null,null,null,null,null,""]
[null,null,null,null,null,null,null,null,null,null,null,null,null,null,null,null,""]
["Employee Signature",null,null,null,null,null,null,null,"Supervisor Signature",null,null,null,null,null,null,null,""]
[null,null,null,null,null,null,null,null,null,null,null,null,null,null,null,null,""]
[null,null,null,null,null,null,null,null,null,null,null,null,null,null,null,null,""]
[null,null,null,null,null,null,null,null,null,null,null,null,null,null,null,null,""]
[null,null,null,null,null,null,null,null,null,null,null,null,null,null,null,null,""]
[null,null,null,null,null,null,null,null,null,null,null,null,null,null,null,null,""]
[null,null,null,null,null,null,null,null,null,null,null,null,null,null,null,null,""]
[null,null,null,null,null,null,null,null,null,null,null,null,null,null,null,null,""]
[null,null,null,null,null,null,null,null,null,null,null,null,null,null,null,null,""]
[null,null,null,null,null,null,null,null,null,null,null,null,null,null,null,null,""]
[{"$f":"E7","v":"Median Ali"},null,null,null,null,null,null,null,{"$f":"VLOOKUP(E7,Table2[],6,0)","v":"Dr.ahmad"},null,null,null,null,null,null,null,""]
[null,null,null,null,null,null,null,null,null,null,null,null,null,null,null,null,""]
[null,null,null,null,null,null,null,null,null,null,null,null,null,null,null,null,""]
[null,null,null,null,null,null,null,null,null,null,null,null,null,null,null,null,""]
[null,null,null,null,null,null,null,null,null,null,null,null,null,null,null,null,""]
[null,null,null,null,null,null,null,null,null,null,null,null,null,null,null,null,""]
[null,null,null,null,null,null,null,null,null,null,null,null,null,null,null,null,""]
[null,null,null,null,null,null,null,null,null,null,null,null,null,null,null,null,""]
[null,null,null,null,null,null,null,null,null,null,null,null,null,null,null,null,""]
[null,null,null,null,null,null,null,null,null,null,null,null,null,null,null,null,""]
[null,null,null,null,null,null,null,null,null,null,null,null,null,null,null,null,""]
[null,null,null,null,null,null,null,null,null,null,null,null,null,null,null,null,{"$f":"IF(OR(Q71=$M$5,Q71=\"\"),\"\",Q71+1)","v":""}]
[null,null,null,null,null,null,null,null,null,null,null,null,null,null,null,null,""]
[null,null,null,null,null,null,null,null,null,null,null,null,null,null,null,null,""]
[null,null,null,null,null,null,null,null,null,null,null,null,null,null,null,null,""]
[null,null,null,null,null,null,null,null,null,null,null,null,null,null,null,null,""]
[null,null,null,null,null,null,null,null,null,null,null,null,null,null,null,null,""]
[null,null,null,null,null,null,null,null,null,null,null,null,null,null,null,null,""]
[null,null,null,null,null,null,null,null,null,null,null,null,null,null,null,null,""]
[null,null,null,null,null,null,null,null,null,null,null,null,null,null,null,null,""]
[null,null,null,null,null,null,null,null,null,null,null,null,null,null,null,null,""]
[null,null,null,null,null,null,null,null,null,null,null,null,null,null,null,null,""]
[null,null,null,null,null,null,null,null,null,null,null,null,null,null,null,null,""]
[null,null,null,null,null,null,null,null,null,null,null,null,null,null,null,null,""]
[null,null,null,null,null,null,null,null,null,null,null,null,null,null,null,null,""]
[null,null,null,null,null,null,null,null,null,null,null,null,null,null,null,null,""]
[null,null,null,null,null,null,null,null,null,null,null,null,null,null,null,null,""]
[null,null,null,null,null,null,null,null,null,null,null,null,null,null,null,null,""]
[null,null,null,null,null,null,null,null,null,null,null,null,null,null,null,null,""]
[null,null,null,null,null,null,null,null,null,null,null,null,null,null,null,null,""]
[null,null,null,null,null,null,null,null,null,null,null,null,null,null,null,null,""]
[null,null,null,null,null,null,null,null,null,null,null,null,null,null,null,null,""]
[null,null,null,null,null,null,null,null,null,null,null,null,null,null,null,null,""]
[null,null,null,null,null,null,null,null,null,null,null,null,null,null,null,null,""]
[null,null,null,null,null,null,null,null,null,null,null,null,null,null,null,null,""]
[null,null,null,null,null,null,null,null,null,null,null,null,null,null,null,null,""]
[null,null,null,null,null,null,null,null,null,null,null,null,null,null,null,null,""]
[null,null,null,null,null,null,null,null,null,null,null,null,null,null,null,null,""]
[null,null,null,null,null,null,null,null,null,null,null,null,null,null,null,null,""]
[null,null,null,null,null,null,null,null,null,null,null,null,null,null,null,null,""]
[null,null,null,null,null,null,null,null,null,null,null,null,null,null,null,null,""]
[null,null,null,null,null,null,null,null,null,null,null,null,null,null,null,null,""]
[null,null,null,null,null,null,null,null,null,null,null,null,null,null,null,null,""]
[null,null,null,null,null,null,null,null,null,null,null,null,null,null,null,null,""]
[null,null,null,null,null,null,null,null,null,null,null,null,null,null,null,null,""]
[null,null,null,null,null,null,null,null,null,null,null,null,null,null,null,null,""]
[null,null,null,null,null,null,null,null,null,null,null,null,null,null,null,null,""]
[null,null,null,null,null,null,null,null,null,null,null,null,null,null,null,null,""]
[null,null,null,null,null,null,null,null,null,null,null,null,null,null,null,null,""]
[null,null,null,null,null,null,null,null,null,null,null,null,null,null,null,null,""]
[null,null,null,null,null,null,null,null,null,null,null,null,null,null,null,null,""]
[null,null,null,null,null,null,null,null,null,null,null,null,null,null,null,null,""]
[null,null,null,null,null,null,null,null,null,null,null,null,null,null,null,null,""]
[null,null,null,null,null,null,null,null,null,null,null,null,null,null,null,null,""]
[null,null,null,null,null,null,null,null,null,null,null,null,null,null,null,null,""]
[null,null,null,null,null,null,null,null,null,null,null,null,null,null,null,null,""]
[null,null,null,null,null,null,null,null,null,null,null,null,null,null,null,null,""]
[null,null,null,null,null,null,null,null,null,null,null,null,null,null,null,null,""]
[null,null,null,null,null,null,null,null,null,null,null,null,null,null,null,null,""]
[null,null,null,null,null,null,null,null,null,null,null,null,null,null,null,null,""]
{"$rows_left_out":186}
{"sheet":"Tables","index":1,"n_rows":36,"n_cols":17,"rows_kept":36,"cut":false,"hidden":false,"merged":[]}
[]
["Project Code","Staff Name","no","Employe ID Number","Staff Position","Staff Field Location:","Supervisor","w01","H02","U03","I04","R05","B06","Q07","S08",null,"Month"]
["qaz01522221500","Median Ali",1,12100001,"Physician","alp01","Dr.ahmad",null,null,null,null,1,null,null,null,null,"2017-01-01"]
["qaz01522221500","Mohammad Halil",2,12187520,"nurse","alp01","Dr.ahmad",null,null,null,null,1,null,null,null,null,"2017-02-01"]
["qaz01522221500","Ebraheem Al Mousa",3,12187524,"drive","ed02","Dr.ahmad",null,null,null,null,1,null,null,null,null,"2017-03-01"]
[null,null,null,null,null,null,null,null,null,null,null,null,null,null,null,null,"2017-04-01"]
[null,null,null,null,null,null,null,null,null,null,null,null,null,null,null,null,"2017-05-01"]
[null,null,null,null,null,null,null,null,null,null,null,null,null,null,null,null,"2017-06-01"]
[null,null,null,null,null,null,null,null,null,null,null,null,null,null,null,null,"2017-07-01"]
[null,null,null,null,null,null,null,null,null,null,null,null,null,null,null,null,"2017-08-01"]
[null,null,null,null,null,null,null,null,null,null,null,null,null,null,null,null,"2017-09-01"]
[null,null,null,null,null,null,null,null,null,null,null,null,null,null,null,null,"2017-10-01"]
[null,null,null,null,null,null,null,null,null,null,null,null,null,null,null,null,"2017-11-01"]
[null,null,null,null,null,null,null,null,null,null,null,null,null,null,null,null,"2017-12-01"]
[null,null,null,null,null,null,null,null,null,null,null,null,null,null,null,null,"2018-01-01"]
[null,null,null,null,null,null,null,null,null,null,null,null,null,null,null,null,"2018-02-01"]
[null,null,null,null,null,null,null,null,null,null,null,null,null,null,null,null,"2018-03-01"]
[null,null,null,null,null,null,null,null,null,null,null,null,null,null,null,null,"2018-04-01"]
[null,null,null,null,null,null,null,null,null,null,null,null,null,null,null,null,"2018-05-01"]
[null,null,null,null,null,null,null,null,null,null,null,null,null,null,null,null,"2018-06-01"]
[null,null,null,null,null,null,null,null,null,null,null,null,null,null,null,null,"2018-07-01"]
[null,null,null,null,null,null,null,null,null,null,null,null,null,null,null,null,"2018-08-01"]
[null,null,null,null,null,null,null,null,null,null,null,null,null,null,null,null,"2018-09-01"]
[null,null,null,null,null,null,null,null,null,null,null,null,null,null,null,null,"2018-10-01"]
[null,null,null,null,null,null,null,null,null,null,null,null,null,null,null,null,"2018-11-01"]
[null,null,null,null,null,null,null,null,null,null,null,null,null,null,null,null,"2018-12-01"]
[null,null,null,null,null,null,null,null,null,null,null,null,null,null,null,null,"2019-01-01"]
[null,null,null,null,null,null,null,null,null,null,null,null,null,null,null,null,"2019-02-01"]
[null,null,null,null,null,null,null,null,null,null,null,null,null,null,null,null,"2019-03-01"]
[null,null,null,null,null,null,null,null,null,null,null,null,null,null,null,null,"2019-04-01"]
[null,null,null,null,null,null,null,null,null,null,null,null,null,null,null,null,"2019-05-01"]
[null,null,null,null,null,null,null,null,null,null,null,null,null,null,null,null,"2019-06-01"]
[null,null,null,null,null,null,null,null,null,null,null,null,null,null,null,null,"2019-07-01"]
[null,null,null,null,null,null,null,null,null,null,null,null,null,null,null,null,"2019-08-01"]
[null,null,null,null,null,null,null,null,null,null,null,null,null,null,null,null,"2019-09-01"]
[null,null,null,null,null,null,null,null,null,null,null,null,null,null,null,null,"2019-10-01"]