{"text_format":"1","workbook":"xlsx","n_sheets":3,"sheets":["FEB","Preparation","Signatur"],"not_rendered":{"charts":0,"images":0,"macros":1,"external_links":1,"defined_names":6,"comments":0,"pivot_tables":0},"unopened":[],"bounds":{"document_bytes":16777216,"sheet_cells":100000,"rows_first":2000,"rows_last":500,"rows_between":2000,"halvings":0,"cell_chars":16384,"cell_head_chars":4096},"cells_cut":0,"cells_raw":0,"read":"whole","date_system":"1900"}

{"sheet":"FEB","index":0,"n_rows":225,"n_cols":32,"rows_kept":225,"cut":false,"hidden":false,"merged":[[69,25,69,26],[69,21,69,22],[72,15,72,17]]}
["S","PRN","Name","Tittle","2018-02-01","2018-02-02","2018-02-03","2018-02-04","2018-02-05","2018-02-06","2018-02-07","2018-02-08","2018-02-09","2018-02-10","2018-02-11","2018-02-12","2018-02-13","2018-02-14","2018-02-15","2018-02-16","2018-02-17","2018-02-18","2018-02-19","2018-02-20","2018-02-21","2018-02-22","2018-02-23","2018-02-24","2018-02-25","2018-02-26","2018-02-27","2018-02-28"]
[1,1405500,"MOHAMMED 1","DUTY","H","H","R","R","R","M","M","M","M","M","M","R","R","R","A","A","A","A","A","A","R","R","R","H","H","H","H","H"]
[2,1405501,"MOHAMMED 2","ASST","H","H","R","R","R","M","M","M","M","M","M","R","R","R","A","A","A","A","A","A","R","R","R","H","H","H","H","H"]
[3,1405502,"MOHAMMED 3","SUP","H","H","R","R","R","M","M","M","M","M","M","R","R","R","A","A","A","A","A","A","R","R","R","H","H","H","H","H"]
[4,1405503,"MOHAMMED 4","SUP","H","H","R","R","R","M","M","M","M","M","M","R","R","R","A","A","A","A","A","A","R","R","R","H","H","H","H","H"]
[5,1405504,"MOHAMMED 5","SUP","H","H","R","R","R","M","M","M","M","M","M","R","R","R","A","A","A","A","A","A","R","R","R","H","H","H","H","H"]
[6,1405505,"MOHAMMED 6","SUP","H","H","R","R","R","M","M","M","M","M","V","R","R","R","A","A","A","A","A","A","R","R","R","H","H","H","H","H"]
[7,1405506,"MOHAMMED 7","TOC","H","H","R","R","R","M","M","M","M","M","M","R","R","R","A","A","A","A","A","A","R","R","R","H","H","H","H","H"]
[8,1405507,"MOHAMMED 8","TOC","V","V","R","R","R","M","M","M","M","M","M","R","R","R","A","A","A","A","A","A","R","R","R","H","H","H","H","H"]
[9,1405508,"MOHAMMED 9","OFFICE","H","H","R","R","R","M","M","M","M","M","M","R","R","R","A","A","A","A","A","A","R","R","R","H","H","H","H","H"]
[10,1405509,"MOHAMMED 10","PLAZA","H","H","R","R","R","M","M","M","M","M","M","R","R","R","A","A","A","A","A","A","R","R","R","H","H","H","H","H"]
[11,1405510,"MOHAMMED 11","DOC","H","H","R","R","R","M","M","M","M","M","M","R","R","R","A","A","A","A","A","A","R","R","R","H","H","H","H","H"]
[12,1405511,"MOHAMMED 12","Agent","H","H","R","R","R","M","M","M","M","M","M","R","R","R","A","A","A","A","A","A","R","R","R","H","H","H","H","H"]
[13,1405512,"MOHAMMED 13","Agent","H","H","R","R","R","M","M","M","M","M","M","R","R","R","A","A","A","A","A","A","R","R","R","H","H","H","H","H"]
[14,1405513,"MOHAMMED 14","Agent","H","H","R","R","R","M","M","M","M","M","M","R","R","R","A","A","A","A","A","A","R","R","R","H","H","H","H","H"]
[15,1405514,"MOHAMMED 15","Agent","H","H","R","R","R","M","M","M","M","M","M","R","R","R","A","A","A","A","A","A","R","R","R","H","H","H","H","H"]
[16,1405515,"MOHAMMED 16","Agent","H","H","R","R","R","M","M","M","M","M","M","R","R","R","A","A","A","A","A","A","R","R","R","H","H","H","H","H"]
[17,1405516,"MOHAMMED 17","Agent","H","H","R","R","R","M","M","M","M","M","M","R","R","R","A","A","A","A","A","A","R","R","R","H","H","H","H","H"]
[18,1405517,"MOHAMMED 18","Agent","H","H","R","R","R","M","M","M","M","M","M","R","R","R","A","A","A","A","A","A","R","R","R","H","H","H","H","H"]
[19,1405518,"MOHAMMED 19","Agent","H","H","R","R","R","M","M","M","M","M","M","R","R","R","A","A","A","A","A","A","R","R","R","H","H","H","H","H"]
[20,1405519,"MOHAMMED 20","Agent","H","H","R","R","R","M","M","M","M","M","M","R","R","R","A","A","A","A","A","A","R","R","R","H","H","H","H","H"]
[21,1405520,"MOHAMMED 21","Agent","H","H","R","R","R","M","M","V","M","M","M","R","R","R","A","A","A","A","A","V","R","R","R","H","H","H","H","H"]
[22,1405521,"MOHAMMED 22","Agent","V","V","R","R","R","V","V","V","V","V","V","V","V","V","V","V","V","V","V","V","V","V","V","V","V","V","V","V"]
[23,1405522,"MOHAMMED 23","Agent","H","H","R","R","R","M","M","M","M","M","M","R","R","R","A","A","A","A","A","A","R","R","R","H","H","H","H","H"]
[24,1405523,"MOHAMMED 24","Agent","H","H","R","R","R","M","M","M","M","V","V","R","R","R","A","A","A","A","A","A","R","R","R","H","H","H","H","H"]
[25,1405524,"MOHAMMED 25","Agent","H","H","R","R","R","M","M","M","M","M","M","R","R","R","A","A","A","A","A","A","R","R","R","H","H","H","H","H"]
[26,1405525,"MOHAMMED 26","Agent","H","H","R","R","R","M","M","M","M","M","M","R","R","R","A","A","A","A","A","A","R","R","R","H","H","H","H","H"]
[27,1405526,"MOHAMMED 27","Agent","H","H","R","R","R","M","V","M","M","M","M","R","R","R","A","A","A","A","A","A","R","R","R","H","H","H","H","H"]
[28,1405527,"MOHAMMED 28","Agent","H","H","R","R","R","M","M","M","M","M","M","R","R","R","A","A","A","A","A","A","R","R","R","H","H","H","H","H"]
[29,1405528,"MOHAMMED 29","Agent","H","H","R","R","R","V","V","M","V","V","M","R","R","R","A","A","A","A","A","A","R","R","R","H","H","H","H","H"]
[30,1405529,"MOHAMMED 30","Agent","H","H","R","R","R","M","M","M","M","M","M","R","R","R","A","A","A","A","A","A","R","R","R","H","H","H","H","H"]
[31,1405530,"MOHAMMED 31","Agent","H","H","R","R","R","M","M","M","M","M","M","R","R","R","A","A","A","A","A","A","R","R","R","H","H","H","H","H"]
[1,1405531,"MOHAMMED 32","DUTY","R","R","A","A","A","A","A","A","R","R","R","H","H","H","H","H","H","R","R","R","H","H","H","H","H","H","R","R"]
[2,1405532,"MOHAMMED 33","ASST","R","R","A","A","A","A","A","A","R","R","R","H","H","H","H","H","H","R","R","R","M","M","M","M","M","M","R","R"]
[3,1405533,"MOHAMMED 34","SUP","R","R","A","A","A","A","A","A","R","R","R","H","H","H","H","H","H","R","R","R","A","A","A","A","A","A","R","R"]
[4,1405534,"MOHAMMED 35","SUP","R","R","A","A","A","A","A","A","R","R","R","H","H","H","H","H","H","R","R","R","H","H","H","H","H","H","R","R"]
[5,1405535,"MOHAMMED 36","SUP","R","R","A","A","A","A","A","A","R","R","R","H","H","H","H","H","H","R","R","R","M","M","M","M","M","M","R","R"]
[6,1405536,"MOHAMMED 37","SUP","R","R","A","A","A","A","A","A","R","R","R","H","H","H","H","H","H","R","R","R","A","A","A","A","A","A","R","R"]
[7,1405537,"MOHAMMED 38","TOC","R","R","A","A","A","A","A","A","R","R","R","H","H","H","H","H","H","R","R","R","H","H","H","H","H","H","R","R"]
[8,1405538,"MOHAMMED 39","TOC","R","R","A","A","V","V","V","V","R","R","R","H","H","H","H","H","H","R","R","R","M","M","M","M","M","M","R","R"]
[9,1405539,"MOHAMMED 40","OFFICE","R","R","A","A","A","A","A","A","R","R","R","H","H","H","H","H","H","R","R","R","A","A","A","A","A","A","R","R"]
[10,1405540,"MOHAMMED 41","PLAZA","R","R","A","A","A","A","A","A","R","R","R","H","H","H","H","H","H","R","R","R","H","H","H","H","H","H","R","R"]
[11,1405541,"MOHAMMED 42","DOC","R","R","A","A","A","A","A","A","R","R","R","H","H","H","H","H","H","R","R","R","M","M","M","M","M","M","R","R"]
[12,1405542,"MOHAMMED 43","Agent","R","R","A","A","A","A","A","A","R","R","R","H","H","H","H","H","H","R","R","R","A","A","A","A","A","A","V","V"]
[13,1405543,"MOHAMMED 44","Agent","R","R","A","A","A","A","A","A","R","R","R","H","H","H","H","H","H","R","R","R","H","H","H","H","H","H","V","V"]
[14,1405544,"MOHAMMED 45","Agent","R","R","A","A","A","A","A","A","R","R","R","H","H","H","H","H","H","R","R","R","M","M","M","M","M","M","R","R"]
[15,1405545,"MOHAMMED 46","Agent","R","R","V","V","V","V","V","V","R","R","R","H","H","H","H","H","H","R","R","R","A","A","A","A","A","A","R","R"]
[16,1405546,"MOHAMMED 47","Agent","R","R","A","A","A","A","A","A","R","R","R","H","H","H","H","H","H","R","R","R","H","H","H","H","H","H","R","R"]
[17,1405547,"MOHAMMED 48","Agent","R","R","A","A","A","A","A","A","R","R","R","H","H","H","H","H","H","R","R","R","M","M","M","M","M","M","R","R"]
[18,1405548,"MOHAMMED 49","Agent","R","R","A","A","A","A","A","A","R","R","R","H","H","H","H","H","H","R","R","R","A","A","A","A","A","A","R","R"]
[19,1405549,"MOHAMMED 50","Agent","R","R","A","A","A","A","A","A","R","R","R","H","H","H","H","H","H","R","R","R","H","H","H","H","H","H","R","R"]
[20,1405550,"MOHAMMED 51","Agent","R","R","A","A","A","A","A","A","R","R","R","H","H","H","H","H","H","R","R","R","M","M","M","M","M","M","R","R"]
[21,1405551,"MOHAMMED 52","Agent","R","R","A","A","A","A","A","A","R","R","R","H","H","H","H","H","H","R","R","R","A","A","A","A","A","A","R","R"]
[22,1405552,"MOHAMMED 53","Agent","R","R","A","A","A","A","A","A","R","R","R","V","V","H","H","H","H","R","R","R","H","H","H","H","H","H","R","R"]
[23,1405553,"MOHAMMED 54","Agent","R","R","A","A","A","A","A","A","R","R","R","H","H","H","H","H","H","R","R","R","M","M","M","M","M","M","R","R"]
[24,1405554,"MOHAMMED 55","Agent","R","R","A","A","A","A","A","A","R","R","R","H","H","H","H","H","H","R","R","R","A","A","A","A","A","A","R","R"]
[25,1405555,"MOHAMMED 56","Agent","R","R","A","A","A","A","A","A","R","R","R","H","H","H","H","H","H","R","R","R","H","H","H","H","H","H","R","R"]
[26,1405556,"MOHAMMED 57","Agent","R","R","A","A","A","A","A","A","R","R","R","H","H","H","H","H","H","R","R","R","M","M","M","M","M","M","R","R"]
[27,1405557,"MOHAMMED 58","Agent","R","R","A","A","A","A","A","A","R","R","R","H","H","H","H","H","H","R","R","R","A","A","A","A","A","A","R","R"]
[28,1405558,"MOHAMMED 59","Agent","R","R","A","A","A","A","A","A","R","R","R","H","H","H","H","H","H","R","R","R","H","H","H","H","H","H","R","R"]
[29,1405559,"MOHAMMED 60","Agent","R","R","A","A","A","A","A","A","R","R","R","H","H","H","H","H","H","R","R","R","M","M","M","M","M","M","R","R"]
[30,1405560,"MOHAMMED 61","Agent","R","R","A","A","A","A","A","A","R","R","R","H","V","H","H","H","H","R","R","R","A","A","A","A","A","A","R","R"]
[31,1405561,"MOHAMMED 62","Agent","R","R","A","A","A","A","A","A","R","R","R","H","H","H","H","H","H","R","R","R","H","H","H","H","H","H","R","R"]
[32,1405562,"MOHAMMED 63","Agent","R","R","A","A","A","A","A","A","R","R","R","H","H","H","H","H","H","R","R","R","M","M","M","M","M","M","R","R"]
[1,1405563,"MOHAMMED 64","DUTY","M","M","M","M","M","R","R","R","A","A","A","A","A","A","R","R","R","H","H","H","H","H","H","R","R","R","M","M"]
[2,1405564,"MOHAMMED 65","ASST","M","M","M","M","M","R","R","R","A","A","A","A","A","A","R","R","R","V","V","V","V","V","V","R","R","R","A","A"]
[3,1405565,"MOHAMMED 66","SUP","M","M","M","M","M","R","R","R","A","A","A","A","A","A","R","R","R","H","H","H","H","H","H","R","R","R","H","H"]
[4,1405566,"MOHAMMED 67","SUP","M","M","M","M","M","R","R","R","A","A","A","A","A","A","R","R","R","H","H","H","H","H","H","R","R","R","M","M"]
[5,1405567,"MOHAMMED 68","SUP","M","M","M","M","M","R","R","R","A","A","A","A","A","A","R","R","R","H","H","H","H","H","H","R","R","R","A","A"]
[6,1405568,"MOHAMMED 69","SUP","M","M","M","M","M","R","R","R","A","A","A","A","A","A","R","R","R","V",null,"H","H","V",null,"R","R","R","H","H"]
[7,1405569,"MOHAMMED 70","TOC","M","M","M","M","V","R","R","R","A","V","V","V","V","V","R","R","R","H","H","H","H","H","H","R","R","R","M","M"]
[8,1405570,"MOHAMMED 71","TOC","M","M","M","M","M","R","R","R","A","A","A","A","A","A","R","R","R","H","H","H","H","H","H","R","R","R","A","A"]
[9,1405571,"MOHAMMED 72","OFFICE","M","M","M","M","M","R","R","R","A","A","A","V",null,null,"R","R","R","H","H","H","H","H","H","R","R","R","H","H"]
[10,1405572,"MOHAMMED 73","PLAZA","M","M","M","M","M","R","R","R","A","A","A","A","A","A","R","R","R","H","H","H","H","H","H","R","R","R","M","M"]
[11,1405573,"MOHAMMED 74","DOC","M","M","M","M","M","R","R","R","A","A","A","A","A","A","R","R","R","H","H","H","H","H","H","R","R","R","A","A"]
[12,1405574,"MOHAMMED 75","Agent","M","M","M","M","M","R","R","R","A","A","V","V","V","V","R","R","R","H","H","H","H","H","H","R","R","R","H","H"]
[13,1405575,"MOHAMMED 76","Agent","M","M","M","M","M","R","R","R","A","A","V","A","A","A","R","R","R","H","H","H","H","H","H","R","R","R","M","M"]
[14,1405576,"MOHAMMED 77","Agent","M","M","M","M","M","R","R","R","A","A","A","A","A","A","R","R","R","H","H","H","H","H","H","R","R","R","A","A"]
[15,1405577,"MOHAMMED 78","Agent","V","V","V","V","V","R","R","R","A","A","A","A","A","A","R","R","R","H","H","H","H","H","H","R","R","R","H","H"]
[16,1405578,"MOHAMMED 79","Agent","M","M","M","M","M","R","R","R","A","A","A","A","A","A","R","R","R","H","H","H","H","H","H","R","R","R","M","M"]
[17,1405579,"MOHAMMED 80","Agent","M","M","M","M","M","R","R","R","A","A","A","A","A","A","R","R","R","H","H","H","H","H","H","R","R","R","A","A"]
[18,1405580,"MOHAMMED 81","Agent","M","M","M","M","M","R","R","R","A","A","A","A","A","A","R","R","R","H","H","H","H","H","H","R","R","R","H","H"]
[19,1405581,"MOHAMMED 82","Agent","M","M","M","M","M","R","R","R","A","A","A","A","A","A","R","R","R","H","H","H","H","H","H","R","R","R","M","M"]
[20,1405582,"MOHAMMED 83","Agent","M","M","M","M","M","R","R","R","A","A","A","A","A","A","R","R","R","H","H","H","H","H","H","R","R","R","A","A"]
[21,1405583,"MOHAMMED 84","Agent","M","M","M","M","M","R","R","R","A","A","A","A","A","A","R","R","R","H","H","H","H","H","H","R","R","R","H","H"]
[22,1405584,"MOHAMMED 85","Agent","M","M","M","M","M","R","R","R","A","A","A","A","A","A","R","R","R","H","H","H","H","H","H","R","R","R","M","M"]
[23,1405585,"MOHAMMED 86","Agent","M","M","M","M","M","R","R","R","A","A","A","A","A","A","R","R","R","H","H","H","H","H","H","R","R","R","A","A"]
[24,1405586,"MOHAMMED 87","Agent","M","M","M","M","M","R","R","R","A","A","A","A","A","A","R","R","R","H","H","H","H","H","H","R","R","R","H","H"]
[25,1405587,"MOHAMMED 88","Agent","M","M","M","M","M","R","R","R","A","A","A","A","A","A","R","R","R","H","H","H","H","H","H","R","R","R","M","M"]
[26,1405588,"MOHAMMED 89","Agent","M","M","M","M","M","R","R","R","A","A","A","A","A","A","R","R","R","H","H","H","H","H","H","R","R","R","A","A"]
[27,1405589,"MOHAMMED 90","Agent","M","M","M","M","M","R","R","R","A","A","A","A","A","A","R","R","R","H","H","H","H","H","H","R","R","R","H","H"]
[28,1405590,"MOHAMMED 91","Agent","M","M","M","M","M","R","R","R","A","A","A","A","A","A","R","R","R","H","H","H","H","H","H","R","R","R","M","M"]
[29,1405591,"MOHAMMED 92","Agent","M","M","M","M","M","R","R","R","A","A","A","A","A","A","R","R","R","H","H","H","H","H","H","R","R","R","A","A"]
[30,1405592,"MOHAMMED 93","Agent","M","M","M","M","M","R","R","R","A","A","A","A","A","A","R","R","R","H","H","H","H","H","H","R","R","R","H","H"]
[31,1405593,"MOHAMMED 94","Agent","M","M","M","M","M","R","R","R","A","A","A","A","A","A","R","R","R","H","H","H","H","H","H","R","R","R","M","M"]
[1,1405594,"MOHAMMED 95","DUTY","R","R","M","M","M","M","M","M","R","R","R","M","M","M","M","M","M","R","R","R","A","A","A","A","A","A","R","R"]
[2,1405595,"MOHAMMED 96","ASST","R","R","A","A","A","A","A","A","R","R","R","M","M","M","M","M","M","R","R","R","A","A","A","A","A","A","R","R"]
[3,1405596,"MOHAMMED 97","SUP","R","R","H","H","H","H","H","H","R","R","R","M","M","M","M","M","M","R","R","R","A","A","A","A","A","A","R","R"]
[4,1405597,"MOHAMMED 98","SUP","R","R","M","M","M","M","M","M","R","R","R","M","M","M","M","M","M","R","R","R","V","A","A","A","A","A","R","R"]
[5,1405598,"MOHAMMED 99","SUP","R","R","A","A","A","A","A","A","R","R","R","M","M","M","M","M","M","R","R","R","A","A","A","A","A","A","R","R"]
[6,1405599,"MOHAMMED 100","SUP","R","R","H","H","H","H","H","H","R","R","R","M","M","M","M","M","M","R","R","R","A","A","A","A","A","A","R","R"]
[7,1405600,"MOHAMMED 101","TOC","R","R","M","M","M","M","M","M","R","R","R","M","M","M","M","M","M","R","R","R","A","A","A","A","A","A","R","R"]
[8,1405601,"MOHAMMED 102","OFFICE","R","R","A","A","A","A","A","A","R","R","R","M","M","M","M","M","M","R","R","R","A","A","A","A","A","A","R","R"]
[9,1405602,"MOHAMMED 103","PLAZA","R","R","H","H","H","H","H","H","R","R","R","M","M","M","M","M","M","R","R","R","A","A","A","A","A","A","R","R"]
[10,1405603,"MOHAMMED 104","DOC","R","R","M","M","M","M","M","M","R","R","R","M","M","V","V","V","V","R","R","R","A","A","A","A","A","A","R","R"]
[11,1405604,"MOHAMMED 105","Agent","R","R","A","A","A","A","A","A","R","R","R","V","V","V","V","V","V","R","R","R","A","A","A","A","A","A","R","R"]
[12,1405605,"MOHAMMED 106","Agent","R","R","H","H","H","H","H","H","R","R","R","M","M","M","M","M","M","R","R","R","A","A","A","A","A","A","R","R"]
[13,1405606,"MOHAMMED 107","Agent","R","R","M","M","M","M","M","M","R","R","R","M","M","M","M","M","M","R","R","R","A","A","A","A","V","V","R","R"]
[14,1405607,"MOHAMMED 108","Agent","R","R","A","A","A","A","A","A","R","R","R","V","V","V","V","V","V","R","R","R","A","A","A","A","A","A","R","R"]
[15,1405608,"MOHAMMED 109","Agent","R","R","H","H","H","H","H","H","R","R","R","M","M","M","M","M","M","R","R","R","A","A","A","A","A","A","R","R"]
[16,1405609,"MOHAMMED 110","Agent","R","R","M","M","M","M","M","M","R","R","R","M","M","M","M","M","M","R","R","R","A","A","A","A","A","A","R","R"]
[17,1405610,"MOHAMMED 111","Agent","R","R","A","A","A","A","A","A","R","R","R","M","M","M","M","M","M","R","R","R","V","V","V","V","V","V","R","R"]
[18,1405611,"MOHAMMED 112","Agent","R","R","H","H","H","H","H","H","R","R","R","M","M","M","M","M","M","R","R","R","A","A","A","A","A","A","R","R"]
[19,1405612,"MOHAMMED 113","Agent","R","R","M","M","M","M","M","M","R","R","R","V","V","M","M","M","M","R","R","R","V","V","V","V","V","V","R","R"]
[20,1405613,"MOHAMMED 114","Agent","R","R","A","A","A","A","A","A","R","R","R","M","M","M","M","M","M","R","R","R","A","A","A","A","A","A","R","R"]
[21,1405614,"MOHAMMED 115","Agent","R","R","H","H","H","H","H","H","R","R","R","M","M","M","M","M","M","R","R","R","A","A","A","A","A","A","R","R"]
[22,1405615,"MOHAMMED 116","Agent","R","R","M","M","M","M","M","M","R","R","R","M","M","M","M","M","M","R","R","R","A","A","A","A","A","A","R","R"]
[23,1405616,"MOHAMMED 117","Agent","R","R","A","A","A","A","A","A","R","R","R","M","M","M","M","M","M","R","R","R","A","A","A","A","A","A","R","R"]
[24,1405617,"MOHAMMED 118","Agent","R","R","H","H","H","H","H","H","R","R","R","M","M","M","M","M","M","R","R","R","A","A","A","A","A","A","R","R"]
[25,1405618,"MOHAMMED 119","Agent","R","R","M","M","M","M","M","M","R","R","R","M","M","M","M","M","M","R","R","R","A","A","A","A","A","A","R","R"]
[26,1405619,"MOHAMMED 120","Agent","R","R","A","A","A","A","A","A","R","R","R","M","M","M","M","M","M","R","R","R","A","A","A","A","A","A","R","R"]
[27,1405620,"MOHAMMED 121","Agent","R","R","H","H","H","H","H","H","R","R","R","M","M","M","M","M","M","R","R","R","A","A","A","A","A","A","R","R"]
[28,1405621,"MOHAMMED 122","Agent","R","R","M","M","M","M","M","M","R","R","R","M","M","M","M","M","M","R","R","R","A","A","A","A","A","A","R","R"]
[29,1405622,"MOHAMMED 123","Agent","R","R","A","A","A","A","A","A","R","R","R","M","M","M","M","M","M","R","R","R","A","A","A","A","A","A","R","R"]
[30,1405623,"MOHAMMED 124","Agent","R","R","H","H","H","H","H","H","R","R","R","M","M","M","M","M","M","R","R","R","A","A","A","A","A","A","R","R"]
[31,1405624,"MOHAMMED 125","Agent","R","R","M","M","M","M","M","M","R","R","R","M","V","M","M","M","M","R","R","R","A","A","A","A","A","A","R","R"]
[1,1405625,"MOHAMMED 126","DUTY","A","A","R","R","R","H","H","H","H","H","H","R","R","R","M","M","M","M","M","M","R","R","R","M","M","M","M","M"]
[2,1405626,"MOHAMMED 127","ASST","A","A","R","R","R","H","H","H","H","H","H","R","R","R","A","A","A","A","A","A","R","R","R","M","M","M","M","M"]
[3,1405627,"MOHAMMED 128","SUP","A","A","R","R","R","H","H","H","H","H","H","R","R","R","H","H","H","H","H","H","R","R","R","M","M","M","M","M"]
[4,1405628,"MOHAMMED 129","SUP","A","V","R","R","R","H","H","H","H","H","V","R","R","R","M","M","M","M","M","M","R","R","R","M","M","M","M","M"]
[5,1405629,"MOHAMMED 130","SUP","A","A","R","R","R","H","H","H","H","H","H","R","R","R","A","A","A","A","A","A","R","R","R","M","M","M","M","M"]
[6,1405630,"MOHAMMED 131","SUP","A","A","R","R","R","H","H","H","H","H","H","R","R","R","H","H","H","H","H","H","R","R","R","M","M","M","M","M"]
[7,1405631,"MOHAMMED 132","TOC","A","A","R","R","R","H","H","H","H","H","H","R","R","R","M","M","M","M","M","M","R","R","R","M","M","M","M","M"]
[8,1405632,"MOHAMMED 133","TOC","A","A","R","R","R","H","H","H","H","H","H","R","R","R","A","A","A","A","A","A","R","R","R","M","M","M","M","M"]
[9,1405633,"MOHAMMED 134","OFFICE","A","A","R","R","R","H","H","H","H","H","H","R","R","R","H","H","H","H","H","H","R","R","R","M","M","M","M","M"]
[10,1405634,"MOHAMMED 135","PLAZA","A","A","R","R","R","H","H","H","H","H","H","R","R","R","M","M","M","M","M","M","R","R","R","M","M","M","M","M"]
[11,1405635,"MOHAMMED 136","DOC","A","A","R","R","R","H","H","H","H","V","V","R","R","R","A","A","A","A","A","A","R","R","R","M","M","M","M","M"]
[12,1405636,"MOHAMMED 137","Agent","A","A","R","R","R","H","H","H","H","H","H","R","R","R","H","H","H","H","H","H","R","R","R","M","M","M","M","M"]
[13,1405637,"MOHAMMED 138","Agent","A","A","R","R","R","H","H","H","H","H","H","R","R","R","M","M","M","M","M","M","R","R","R","M","M","M","M","M"]
[14,1405638,"MOHAMMED 139","Agent","A","A","R","R","R","H","H","H","H","H","H","R","R","R","A","A","A","A","A","A","R","R","R","M","M","M","M","M"]
[15,1405639,"MOHAMMED 140","Agent","A","A","R","R","R","H","H","H","H","H","H","R","R","R","H","H","H","H","H","H","R","R","R","V","V","V","V","V"]
[16,1405640,"MOHAMMED 141","Agent","A","A","R","R","R","H","H","H","H","H","H","R","R","R","M","M","M","M","M","M","R","R","R","M","M","M","M","M"]
[17,1405641,"MOHAMMED 142","Agent","A","A","R","R","R","H","H","H","H","H","H","R","R","R","A","A","A","A","A","A","R","R","R","M","M","M","M","M"]
[18,1405642,"MOHAMMED 143","Agent","A","A","R","R","R","H","H","H","H","H","H","R","R","R","H","H","H","H","H","H","R","R","R","M","M","M","M","M"]
[19,1405643,"MOHAMMED 144","Agent","A","A","R","R","R","H","H","H","H","H","H","R","R","R","M","M","M","M","M","M","R","R","R","M","M","M","M","M"]
[20,1405644,"MOHAMMED 145","Agent","A","A","R","R","R","V","V","V","H","H","H","R","R","R","A","A","A","A","A","A","R","R","R","M","M","M","M","M"]
[21,1405645,"MOHAMMED 146","Agent","A","A","R","R","R","H","H","H","H","H","H","R","R","R","H","H","H","H","H","H","R","R","R","M","M","M","M","M"]
[22,1405646,"MOHAMMED 147","Agent","A","A","R","R","R","H","H","H","H","H","H","R","R","R","M","M","M","M","M","M","R","R","R","M","M","M","M","M"]
[23,1405647,"MOHAMMED 148","Agent","A","A","R","R","R","H","H","H","H","H","V","R","R","R","A","A","A","A","A","A","R","R","R","M","M","M","M","M"]
[24,1405648,"MOHAMMED 149","Agent","A","A","R","R","R","H","H","H","H","H","H","R","R","R","H","H","H","H","H","H","R","R","R","M","M","M","M","M"]
[25,1405649,"MOHAMMED 150","Agent","A","A","R","R","R","H","H","H","H","H","H","R","R","R","M","M","M","M","M","M","R","R","R","M","M","M","M","M"]
[26,1405650,"MOHAMMED 151","Agent","A","A","R","R","R","H","H","H","H","H","H","R","R","R","A","A","A","A","A","A","R","R","R","M","M","M","M","M"]
[27,1405651,"MOHAMMED 152","Agent","A","A","R","R","R","H","H","H","H","H","V","R","R","R","H","H","H","H","H","H","R","R","R","M","M","M","M","M"]
[28,1405652,"MOHAMMED 153","Agent","A","A","R","R","R","H","H","H","H","H","H","R","R","R","M","M","M","M","M","M","R","R","R","M","M","M","M","M"]
[29,1405653,"MOHAMMED 154","Agent","A","A","R","R","R","H","H","H","H","H","H","R","R","R","A","A","A","A","A","A","R","R","R","M","M","M","M","M"]
[30,1405654,"MOHAMMED 155","Agent","A","A","R","R","R","H","H","H","H","H","H","R","R","R","H","H","H","H","H","H","R","R","R","M","M","M","M","M"]
[31,1405655,"MOHAMMED 156","Agent","A","A","R","R","R","H","H","H","H","H","H","R","R","R","M","M","M","M","M","M","R","R","R","M","M","M","M","M"]
[1,1405656,"MOHAMMED 157","DUTY","V","V","V","V","V","R","R","R","H","H","H","H","H","H","R","R","R","M","M","M","M","M","M","R","R","R","A","A"]
[2,1405657,"MOHAMMED 158","ASST","H","H","H","H","H","R","R","R","M","M","M","M","M","M","R","R","R","M","M","M","M","M","M","R","R","R","A","A"]
[3,1405658,"MOHAMMED 159","SUP","H","H","H","H","H","R","R","R","A","A","A","A","A","A","R","R","R","M","M","M","M","M","M","R","R","R","A","A"]
[4,1405659,"MOHAMMED 160","SUP","H","H","H","H","H","R","R","R","H","H","H","H","H","H","R","R","R","M","M","M","M","V","V","R","R","R","A","A"]
[5,1405660,"MOHAMMED 161","SUP","H","H","H","H","H","R","R","R","M","M","M","M","M","M","R","R","R","M","M","M","M","V","V","R","R","R","A","A"]
[6,1405661,"MOHAMMED 162","SUP","H","H","H","H","H","R","R","R","A","A","A","A","A","A","R","R","R","M","M","M","M","M","M","R","R","R","A","A"]
[7,1405662,"MOHAMMED 163","TOC","H","H","H","H","H","R","R","R","H","H","H","H","H","H","R","R","R","M","M","M","M","M","M","R","R","R","A","A"]
[8,1405663,"MOHAMMED 164","OFFICE","H","H","H","H","H","R","R","R","M","M","M","M","M","M","R","R","R","M","M","M","M","M","M","R","R","R","A","A"]
[9,1405664,"MOHAMMED 165","PLAZA","H","H","H","H","H","R","R","R","A","A","A","A","A","A","R","R","R","M","M","M","M","M","M","R","R","R","A","A"]
[10,1405665,"MOHAMMED 166","DOC","H","H","H","H","H","R","R","R","H","H","H","H","H","H","R","R","R","M","M","M","V","V","V","R","R","R","A","A"]
[11,1405666,"MOHAMMED 167","Agent","H","H","H","H","H","R","R","R","M","M","M","M","M","M","R","R","R","M","M","M","M","M","M","R","R","R","A","A"]
[12,1405667,"MOHAMMED 168","Agent","H","H","H","H","H","R","R","R","A","A","A","A","A","A","R","R","R","M","M","M","M","M","M","R","R","R","A","A"]
[13,1405668,"MOHAMMED 169","Agent","H","H","H","H","H","R","R","R","H","H","H","H","H","H","R","R","R","M","V","M","M","M","M","R","R","R","A","A"]
[14,1405669,"MOHAMMED 170","Agent","H","H","H","H","H","R","R","R","M","M","M","M","M","M","R","R","R","M","M","M","M","M","M","R","R","R","A","A"]
[15,1405670,"MOHAMMED 171","Agent","H","H","H","H","H","R","R","R","A","A","A","A","A","A","R","R","R","M","M","M","M","M","M","R","R","R","A","A"]
[16,1405671,"MOHAMMED 172","Agent","H","H","H","H","H","R","R","R","H","H","H","H","H","H","R","R","R","M","M","M","M","M","M","R","R","R","A","A"]
[17,1405672,"MOHAMMED 173","Agent","H","H","H","H","H","R","R","R","M","M","M","M","M","M","R","R","R","M","M","M","M","M","M","R","R","R","A","A"]
[18,1405673,"MOHAMMED 174","Agent","H","H","H","H","H","R","R","R","A","A","A","A","A","A","R","R","R","M","M","M","M","M","M","R","R","R","A","A"]
[19,1405674,"MOHAMMED 175","Agent","H","H","H","H","H","R","R","R","H","H","H","H","H","H","R","R","R","V","V","V","V","V","V","R","R","R","A","A"]
[20,1405675,"MOHAMMED 176","Agent","H","H","H","H","H","R","R","R","M","M","M","M","M","M","R","R","R","M","M","M","M","M","M","R","R","R","A","A"]
[21,1405676,"MOHAMMED 177","Agent","H","H","H","H","H","R","R","R","A","A","A","A","A","A","R","R","R","M","M","M","M","M","M","R","R","R","A","A"]
[22,1405677,"MOHAMMED 178","Agent","H","H","H","H","H","R","R","R","H","H","H","H","H","H","R","R","R","M","M","M","M","M","M","R","R","R","A","A"]
[23,1405678,"MOHAMMED 179","Agent","H","H","H","H","H","R","R","R","M","M","M","M","M","M","R","R","R","M","M","M","M","M","M","R","R","R","A","A"]
[24,1405679,"MOHAMMED 180","Agent","H","H","H","H","H","R","R","R","A","A","A","A","A","A","R","R","R","M","M","M","M","M","M","R","R","R","A","A"]
[25,1405680,"MOHAMMED 181","Agent","H","H","H","H","H","R","R","R","H","H","H","H","H","H","R","R","R","V","V","V","V","V","V","R","R","R","A","A"]
[26,1405681,"MOHAMMED 182","Agent","H","H","H","H","H","R","R","R","M","M","M","M","M","M","R","R","R","M","M","M","M","M","M","R","R","R","A","A"]
[27,1405682,"MOHAMMED 183","Agent","H","H","H","H","H","R","R","R","A","A","A","A","A","A","R","R","R","M","M","M","M","M","M","R","R","R","A","A"]
[28,1405683,"MOHAMMED 184","Agent","H","H","H","H","H","R","R","R","H","H","H","H","H","H","R","R","R","M","M","M","M","M","M","R","R","R","A","A"]
[29,1405684,"MOHAMMED 185","Agent","H","H","H","H","H","R","R","R","M","M","M","M","M","M","R","R","R","M","M","M","M","M","M","R","R","R","A","A"]
[30,1405685,"MOHAMMED 186","Agent","H","H","H","H","H","R","R","R","A","A","A","A","A","A","R","R","R","M","M","M","M","M","M","R","R","R","A","A"]
[31,1405686,"MOHAMMED 187","Agent","H","H","H","H","H","R","R","R","H","H","H","H","H","H","R","R","R","M","V","M","M","M","M","R","R","R","A","A"]
[32,1405687,"MOHAMMED 188","Agent","H","H","H","H","H","R","R","R","M","M","M","M","M","M","R","R","R","M","M","M","M","M","M","R","R","R","A","A"]
[33,1405688,"MOHAMMED 189","Agent","H","H","H","H","H","R","R","R","A","A","A","A","A","A","R","R","R","M","M","M","M","M","M","R","R","V","V","V"]
[null,1405689,"MOHAMMED 190"]
[1,1405690,"MOHAMMED 191","TOC","C","R","R","R","M","M","M","M","M","M","R","R","R","A","A","A","A","A","A","R","R","R","C","C","C","C","C","C"]
[2,1405691,"MOHAMMED 192","TOC","R","A","A","A","A","A","A","R","R","R","A","A","A","A","A","A","R","R","R","C","C","C","C","C","C","R","R","R"]
[3,1405692,"MOHAMMED 193","TOC","R","C","C","C","C","C","C","R","R","R","M","M","M","M","M","M","R","R","R","A","A","A","A","A","A","R","R","R"]
[4,1405693,"MOHAMMED 194","TOC","A","R","R","R","A","A","A","A","A","A","R","R","R","C","C","C","C","C","C","R","R","R","M","M","M","M","M","M"]
[5,1405694,"MOHAMMED 195","TOC","M","M","M","M","R","R","R","C","C","C","C","C","C","R","R","R","M","M","M","M","M","M","R","R","R","A","A","A"]
[6,1405695,"MOHAMMED 196","SUP","R","A","A","A","A","A","A","R","R","R","C","C","C","C","C","C","R","R","R","A","A","A","A","A","A","R","R","R"]
[7,1405696,"MOHAMMED 197","SUP","A","R","R","R","C","C","C","C","C","C","R","R","R","A","A","A","A","A","A","R","R","R","C","C","C","C","C","C"]
[8,1405697,"MOHAMMED 198","CK IN","R","A","A","A","A","A","A","R","R","R","C","C","C","C","C","V","R","R","R","A","A","A","A","A","A","R","R","R"]
[9,1405698,"MOHAMMED 199","CK IN","A","R","R","R","C","C","C","C","C","C","R","R","R","A","A","A","A","A","A","R","R","R","C","C","C","C","C","C"]
[10,1405699,"MOHAMMED 200","CK IN","R","C","C","C","C","C","C","R","R","R","A","A","A","A","A","A","R","R","R","C","C","C","C","C","C","R","R","R"]
[11,1405700,"MOHAMMED 201","CK IN","C","C","C","R","R","R","A","A","A","A","A","A","R","R","R","C","C","C","C","C","C","R","R","R","A","A","A","A"]
[12,1405701,"MOHAMMED 202","CK IN","A","A","A","R","R","R","C","C","C","C","C","C","R","R","R","A","A","A","A","A","A","R","R","R","C","C","C","C"]
[13,1405702,"MOHAMMED 203","CK IN","A","A","A","A","R","R","R","C","C","C","C","C","C","R","R","R","A","A","A","A","A","A","R","R","R","C","C","C"]
[14,1405703,"MOHAMMED 204","SUP","A","A","A","A","A","A","R","R","R","C","C","V","V","V","V","R","R","R","A","A","A","A","A","A","R","R","R","C"]
[15,1405704,"MOHAMMED 205","Brd","A","A","A","A","A","A","R","R","R","C","C","C","C","C","C","R","R","R","C","C","C","C","C","C","R","R","R","A"]
[16,1405705,"MOHAMMED 206","CK IN","R","A","A","A","A","A","A","R","R","R","C","C","C","C","C","C","R","R","R","A","A","A","A","A","A","R","R","R"]
[17,1405706,"MOHAMMED 207","SUP","C","C","C","R","R","R","A","A","A","A","A","A","R","R","R","C","C","C","C","C","C","R","R","R","A","A","A","A"]
[18,1405707,"MOHAMMED 208","CK IN","R","R","R","C","C","C","C","C","C","R","R","R","A","A","A","A","A","A","R","R","R","C","C","C","C","C","C","R"]
[19,1405708,"MOHAMMED 209","Brd","C","C","C","R","R","R","A","A","A","A","A","A","R","R","R","C","C","C","C","C","C","R","R","R","A","A","A","A"]
[20,1405709,"MOHAMMED 210","SUP","M","M","M","M","R","R","R","M","M","M","M","M","V","R","R","R","V","V","V","V","M","M","R","R","R","M","M","M"]
[21,1405710,"MOHAMMED 211","Arr","M","R","R","R","M","M","M","M","M","M","R","R","R","V","V","V","V","V","V","V","V","V","V","V","V","V","V","V"]
[22,1405711,"MOHAMMED 212","Arr","M","R","R","R","M","M","M","M","M","M","R","R","R","M","M","M","M","M","M","R","R","R","M","M","M","M","M","M"]
[1,1405712,"MOHAMMED 213","Agent","M","M","R","R","M","M","M","M","M","R","R","M","M","M","M","M","M","R","R","M","M","M","M","M","M","R","R","M"]
[2,1405713,"MOHAMMED 214","Agent","R","R","A","A","A","A","A","A","R","R","R","A","A","A","A","A","A","R","R","R","A","A","A","A","A","A","R","R"]
[3,1405714,"MOHAMMED 215","Agent","R","R","M","M","M","M","M","M","R","R","R","M","M","M","M","M","M","R","R","R","M","M","M","M","M","M","R","R"]
[]
[]
[null,"M","0600-1430"]
[null,"A","1400-2230"]
[null,"H","2200-0630"]
[null,"A+","1200+2030"]
[null,"H+","2000+0430"]
[null,"R","DAY OFF"]
[null,"C","1700-0130"]

{"sheet":"Preparation","index":1,"n_rows":216,"n_cols":11,"rows_kept":216,"cut":false,"hidden":false,"merged":[]}
["SHIFT","H","Enter the Shift",null,null,"2018-02-01",null,null,null,"2018-02-01","M"]
[null,"PRN","NAME","TITTEL",null,null,null,null,null,"2018-02-03","H"]
[null,{"$f":"IFERROR(INDEX(FEB!B$2:B$216,SMALL(IF(INDEX(FEB!$E$2:$AF$216,,MATCH($F$1,FEB!$E$1:$AJ$1,0))=$B$1,ROW(FEB!$J$2:$AI$216)-ROW(FEB!$J$2)+1),ROWS(B$3:B3))),\"\")","v":1405500},{"$f":"IFERROR(INDEX(FEB!C$2:C$216,SMALL(IF(INDEX(FEB!$E$2:$AF$216,,MATCH($F$1,FEB!$E$1:$AJ$1,0))=$B$1,ROW(FEB!$J$2:$AI$216)-ROW(FEB!$J$2)+1),ROWS(C$3:C3))),\"\")","v":"MOHAMMED 1"},{"$f":"IFERROR(INDEX(FEB!D$2:D$216,SMALL(IF(INDEX(FEB!$E$2:$AF$216,,MATCH($F$1,FEB!$E$1:$AJ$1,0))=$B$1,ROW(FEB!$J$2:$AI$216)-ROW(FEB!$J$2)+1),ROWS(D$3:D3))),\"\")","v":"DUTY"},null,null,null,null,null,"2018-02-04"]
[null,{"$f":"IFERROR(INDEX(FEB!B$2:B$216,SMALL(IF(INDEX(FEB!$E$2:$AF$216,,MATCH($F$1,FEB!$E$1:$AJ$1,0))=$B$1,ROW(FEB!$J$2:$AI$216)-ROW(FEB!$J$2)+1),ROWS(B$3:B4))),\"\")","v":1405501},{"$f":"IFERROR(INDEX(FEB!C$2:C$216,SMALL(IF(INDEX(FEB!$E$2:$AF$216,,MATCH($F$1,FEB!$E$1:$AJ$1,0))=$B$1,ROW(FEB!$J$2:$AI$216)-ROW(FEB!$J$2)+1),ROWS(C$3:C4))),\"\")","v":"MOHAMMED 2"},{"$f":"IFERROR(INDEX(FEB!D$2:D$216,SMALL(IF(INDEX(FEB!$E$2:$AF$216,,MATCH($F$1,FEB!$E$1:$AJ$1,0))=$B$1,ROW(FEB!$J$2:$AI$216)-ROW(FEB!$J$2)+1),ROWS(D$3:D4))),\"\")","v":"ASST"},null,"Enter the date",null,null,null,"2018-02-05"]
[null,{"$f":"IFERROR(INDEX(FEB!B$2:B$216,SMALL(IF(INDEX(FEB!$E$2:$AF$216,,MATCH($F$1,FEB!$E$1:$AJ$1,0))=$B$1,ROW(FEB!$J$2:$AI$216)-ROW(FEB!$J$2)+1),ROWS(B$3:B5))),\"\")","v":1405502},{"$f":"IFERROR(INDEX(FEB!C$2:C$216,SMALL(IF(INDEX(FEB!$E$2:$AF$216,,MATCH($F$1,FEB!$E$1:$AJ$1,0))=$B$1,ROW(FEB!$J$2:$AI$216)-ROW(FEB!$J$2)+1),ROWS(C$3:C5))),\"\")","v":"MOHAMMED 3"},{"$f":"IFERROR(INDEX(FEB!D$2:D$216,SMALL(IF(INDEX(FEB!$E$2:$AF$216,,MATCH($F$1,FEB!$E$1:$AJ$1,0))=$B$1,ROW(FEB!$J$2:$AI$216)-ROW(FEB!$J$2)+1),ROWS(D$3:D5))),\"\")","v":"SUP"},null,null,null,null,null,"2018-02-06"]
[null,{"$f":"IFERROR(INDEX(FEB!B$2:B$216,SMALL(IF(INDEX(FEB!$E$2:$AF$216,,MATCH($F$1,FEB!$E$1:$AJ$1,0))=$B$1,ROW(FEB!$J$2:$AI$216)-ROW(FEB!$J$2)+1),ROWS(B$3:B6))),\"\")","v":1405503},{"$f":"IFERROR(INDEX(FEB!C$2:C$216,SMALL(IF(INDEX(FEB!$E$2:$AF$216,,MATCH($F$1,FEB!$E$1:$AJ$1,0))=$B$1,ROW(FEB!$J$2:$AI$216)-ROW(FEB!$J$2)+1),ROWS(C$3:C6))),\"\")","v":"MOHAMMED 4"},{"$f":"IFERROR(INDEX(FEB!D$2:D$216,SMALL(IF(INDEX(FEB!$E$2:$AF$216,,MATCH($F$1,FEB!$E$1:$AJ$1,0))=$B$1,ROW(FEB!$J$2:$AI$216)-ROW(FEB!$J$2)+1),ROWS(D$3:D6))),\"\")","v":"SUP"},null,null,null,null,null,"2018-02-07"]
[null,{"$f":"IFERROR(INDEX(FEB!B$2:B$216,SMALL(IF(INDEX(FEB!$E$2:$AF$216,,MATCH($F$1,FEB!$E$1:$AJ$1,0))=$B$1,ROW(FEB!$J$2:$AI$216)-ROW(FEB!$J$2)+1),ROWS(B$3:B7))),\"\")","v":1405504},{"$f":"IFERROR(INDEX(FEB!C$2:C$216,SMALL(IF(INDEX(FEB!$E$2:$AF$216,,MATCH($F$1,FEB!$E$1:$AJ$1,0))=$B$1,ROW(FEB!$J$2:$AI$216)-ROW(FEB!$J$2)+1),ROWS(C$3:C7))),\"\")","v":"MOHAMMED 5"},{"$f":"IFERROR(INDEX(FEB!D$2:D$216,SMALL(IF(INDEX(FEB!$E$2:$AF$216,,MATCH($F$1,FEB!$E$1:$AJ$1,0))=$B$1,ROW(FEB!$J$2:$AI$216)-ROW(FEB!$J$2)+1),ROWS(D$3:D7))),\"\")","v":"SUP"},null,null,null,null,null,"2018-02-08"]
[null,{"$f":"IFERROR(INDEX(FEB!B$2:B$216,SMALL(IF(INDEX(FEB!$E$2:$AF$216,,MATCH($F$1,FEB!$E$1:$AJ$1,0))=$B$1,ROW(FEB!$J$2:$AI$216)-ROW(FEB!$J$2)+1),ROWS(B$3:B8))),\"\")","v":1405505},{"$f":"IFERROR(INDEX(FEB!C$2:C$216,SMALL(IF(INDEX(FEB!$E$2:$AF$216,,MATCH($F$1,FEB!$E$1:$AJ$1,0))=$B$1,ROW(FEB!$J$2:$AI$216)-ROW(FEB!$J$2)+1),ROWS(C$3:C8))),\"\")","v":"MOHAMMED 6"},{"$f":"IFERROR(INDEX(FEB!D$2:D$216,SMALL(IF(INDEX(FEB!$E$2:$AF$216,,MATCH($F$1,FEB!$E$1:$AJ$1,0))=$B$1,ROW(FEB!$J$2:$AI$216)-ROW(FEB!$J$2)+1),ROWS(D$3:D8))),\"\")","v":"SUP"},null,null,null,null,null,"2018-02-09"]
[null,{"$f":"IFERROR(INDEX(FEB!B$2:B$216,SMALL(IF(INDEX(FEB!$E$2:$AF$216,,MATCH($F$1,FEB!$E$1:$AJ$1,0))=$B$1,ROW(FEB!$J$2:$AI$216)-ROW(FEB!$J$2)+1),ROWS(B$3:B9))),\"\")","v":1405506},{"$f":"IFERROR(INDEX(FEB!C$2:C$216,SMALL(IF(INDEX(FEB!$E$2:$AF$216,,MATCH($F$1,FEB!$E$1:$AJ$1,0))=$B$1,ROW(FEB!$J$2:$AI$216)-ROW(FEB!$J$2)+1),ROWS(C$3:C9))),\"\")","v":"MOHAMMED 7"},{"$f":"IFERROR(INDEX(FEB!D$2:D$216,SMALL(IF(INDEX(FEB!$E$2:$AF$216,,MATCH($F$1,FEB!$E$1:$AJ$1,0))=$B$1,ROW(FEB!$J$2:$AI$216)-ROW(FEB!$J$2)+1),ROWS(D$3:D9))),\"\")","v":"TOC"},null,null,null,null,null,"2018-02-10"]
[null,{"$f":"IFERROR(INDEX(FEB!B$2:B$216,SMALL(IF(INDEX(FEB!$E$2:$AF$216,,MATCH($F$1,FEB!$E$1:$AJ$1,0))=$B$1,ROW(FEB!$J$2:$AI$216)-ROW(FEB!$J$2)+1),ROWS(B$3:B10))),\"\")","v":1405508},{"$f":"IFERROR(INDEX(FEB!C$2:C$216,SMALL(IF(INDEX(FEB!$E$2:$AF$216,,MATCH($F$1,FEB!$E$1:$AJ$1,0))=$B$1,ROW(FEB!$J$2:$AI$216)-ROW(FEB!$J$2)+1),ROWS(C$3:C10))),\"\")","v":"MOHAMMED 9"},{"$f":"IFERROR(INDEX(FEB!D$2:D$216,SMALL(IF(INDEX(FEB!$E$2:$AF$216,,MATCH($F$1,FEB!$E$1:$AJ$1,0))=$B$1,ROW(FEB!$J$2:$AI$216)-ROW(FEB!$J$2)+1),ROWS(D$3:D10))),\"\")","v":"OFFICE"},null,null,null,null,null,"2018-02-11"]
[null,{"$f":"IFERROR(INDEX(FEB!B$2:B$216,SMALL(IF(INDEX(FEB!$E$2:$AF$216,,MATCH($F$1,FEB!$E$1:$AJ$1,0))=$B$1,ROW(FEB!$J$2:$AI$216)-ROW(FEB!$J$2)+1),ROWS(B$3:B11))),\"\")","v":1405509},{"$f":"IFERROR(INDEX(FEB!C$2:C$216,SMALL(IF(INDEX(FEB!$E$2:$AF$216,,MATCH($F$1,FEB!$E$1:$AJ$1,0))=$B$1,ROW(FEB!$J$2:$AI$216)-ROW(FEB!$J$2)+1),ROWS(C$3:C11))),\"\")","v":"MOHAMMED 10"},{"$f":"IFERROR(INDEX(FEB!D$2:D$216,SMALL(IF(INDEX(FEB!$E$2:$AF$216,,MATCH($F$1,FEB!$E$1:$AJ$1,0))=$B$1,ROW(FEB!$J$2:$AI$216)-ROW(FEB!$J$2)+1),ROWS(D$3:D11))),\"\")","v":"PLAZA"},null,null,null,null,null,"2018-02-12"]
[null,{"$f":"IFERROR(INDEX(FEB!B$2:B$216,SMALL(IF(INDEX(FEB!$E$2:$AF$216,,MATCH($F$1,FEB!$E$1:$AJ$1,0))=$B$1,ROW(FEB!$J$2:$AI$216)-ROW(FEB!$J$2)+1),ROWS(B$3:B12))),\"\")","v":1405510},{"$f":"IFERROR(INDEX(FEB!C$2:C$216,SMALL(IF(INDEX(FEB!$E$2:$AF$216,,MATCH($F$1,FEB!$E$1:$AJ$1,0))=$B$1,ROW(FEB!$J$2:$AI$216)-ROW(FEB!$J$2)+1),ROWS(C$3:C12))),\"\")","v":"MOHAMMED 11"},{"$f":"IFERROR(INDEX(FEB!D$2:D$216,SMALL(IF(INDEX(FEB!$E$2:$AF$216,,MATCH($F$1,FEB!$E$1:$AJ$1,0))=$B$1,ROW(FEB!$J$2:$AI$216)-ROW(FEB!$J$2)+1),ROWS(D$3:D12))),\"\")","v":"DOC"},null,null,null,null,null,"2018-02-13"]
[null,{"$f":"IFERROR(INDEX(FEB!B$2:B$216,SMALL(IF(INDEX(FEB!$E$2:$AF$216,,MATCH($F$1,FEB!$E$1:$AJ$1,0))=$B$1,ROW(FEB!$J$2:$AI$216)-ROW(FEB!$J$2)+1),ROWS(B$3:B13))),\"\")","v":1405511},{"$f":"IFERROR(INDEX(FEB!C$2:C$216,SMALL(IF(INDEX(FEB!$E$2:$AF$216,,MATCH($F$1,FEB!$E$1:$AJ$1,0))=$B$1,ROW(FEB!$J$2:$AI$216)-ROW(FEB!$J$2)+1),ROWS(C$3:C13))),\"\")","v":"MOHAMMED 12"},{"$f":"IFERROR(INDEX(FEB!D$2:D$216,SMALL(IF(INDEX(FEB!$E$2:$AF$216,,MATCH($F$1,FEB!$E$1:$AJ$1,0))=$B$1,ROW(FEB!$J$2:$AI$216)-ROW(FEB!$J$2)+1),ROWS(D$3:D13))),\"\")","v":"Agent"},null,null,null,null,null,"2018-02-14"]
[null,{"$f":"IFERROR(INDEX(FEB!B$2:B$216,SMALL(IF(INDEX(FEB!$E$2:$AF$216,,MATCH($F$1,FEB!$E$1:$AJ$1,0))=$B$1,ROW(FEB!$J$2:$AI$216)-ROW(FEB!$J$2)+1),ROWS(B$3:B14))),\"\")","v":1405512},{"$f":"IFERROR(INDEX(FEB!C$2:C$216,SMALL(IF(INDEX(FEB!$E$2:$AF$216,,MATCH($F$1,FEB!$E$1:$AJ$1,0))=$B$1,ROW(FEB!$J$2:$AI$216)-ROW(FEB!$J$2)+1),ROWS(C$3:C14))),\"\")","v":"MOHAMMED 13"},{"$f":"IFERROR(INDEX(FEB!D$2:D$216,SMALL(IF(INDEX(FEB!$E$2:$AF$216,,MATCH($F$1,FEB!$E$1:$AJ$1,0))=$B$1,ROW(FEB!$J$2:$AI$216)-ROW(FEB!$J$2)+1),ROWS(D$3:D14))),\"\")","v":"Agent"},null,null,null,null,null,"2018-02-15"]
[null,{"$f":"IFERROR(INDEX(FEB!B$2:B$216,SMALL(IF(INDEX(FEB!$E$2:$AF$216,,MATCH($F$1,FEB!$E$1:$AJ$1,0))=$B$1,ROW(FEB!$J$2:$AI$216)-ROW(FEB!$J$2)+1),ROWS(B$3:B15))),\"\")","v":1405513},{"$f":"IFERROR(INDEX(FEB!C$2:C$216,SMALL(IF(INDEX(FEB!$E$2:$AF$216,,MATCH($F$1,FEB!$E$1:$AJ$1,0))=$B$1,ROW(FEB!$J$2:$AI$216)-ROW(FEB!$J$2)+1),ROWS(C$3:C15))),\"\")","v":"MOHAMMED 14"},{"$f":"IFERROR(INDEX(FEB!D$2:D$216,SMALL(IF(INDEX(FEB!$E$2:$AF$216,,MATCH($F$1,FEB!$E$1:$AJ$1,0))=$B$1,ROW(FEB!$J$2:$AI$216)-ROW(FEB!$J$2)+1),ROWS(D$3:D15))),\"\")","v":"Agent"},null,null,null,null,null,"2018-02-16"]
[null,{"$f":"IFERROR(INDEX(FEB!B$2:B$216,SMALL(IF(INDEX(FEB!$E$2:$AF$216,,MATCH($F$1,FEB!$E$1:$AJ$1,0))=$B$1,ROW(FEB!$J$2:$AI$216)-ROW(FEB!$J$2)+1),ROWS(B$3:B16))),\"\")","v":1405514},{"$f":"IFERROR(INDEX(FEB!C$2:C$216,SMALL(IF(INDEX(FEB!$E$2:$AF$216,,MATCH($F$1,FEB!$E$1:$AJ$1,0))=$B$1,ROW(FEB!$J$2:$AI$216)-ROW(FEB!$J$2)+1),ROWS(C$3:C16))),\"\")","v":"MOHAMMED 15"},{"$f":"IFERROR(INDEX(FEB!D$2:D$216,SMALL(IF(INDEX(FEB!$E$2:$AF$216,,MATCH($F$1,FEB!$E$1:$AJ$1,0))=$B$1,ROW(FEB!$J$2:$AI$216)-ROW(FEB!$J$2)+1),ROWS(D$3:D16))),\"\")","v":"Agent"},null,null,null,null,null,"2018-02-17"]
[null,{"$f":"IFERROR(INDEX(FEB!B$2:B$216,SMALL(IF(INDEX(FEB!$E$2:$AF$216,,MATCH($F$1,FEB!$E$1:$AJ$1,0))=$B$1,ROW(FEB!$J$2:$AI$216)-ROW(FEB!$J$2)+1),ROWS(B$3:B17))),\"\")","v":1405515},{"$f":"IFERROR(INDEX(FEB!C$2:C$216,SMALL(IF(INDEX(FEB!$E$2:$AF$216,,MATCH($F$1,FEB!$E$1:$AJ$1,0))=$B$1,ROW(FEB!$J$2:$AI$216)-ROW(FEB!$J$2)+1),ROWS(C$3:C17))),\"\")","v":"MOHAMMED 16"},{"$f":"IFERROR(INDEX(FEB!D$2:D$216,SMALL(IF(INDEX(FEB!$E$2:$AF$216,,MATCH($F$1,FEB!$E$1:$AJ$1,0))=$B$1,ROW(FEB!$J$2:$AI$216)-ROW(FEB!$J$2)+1),ROWS(D$3:D17))),\"\")","v":"Agent"},null,null,null,null,null,"2018-02-18"]
[null,{"$f":"IFERROR(INDEX(FEB!B$2:B$216,SMALL(IF(INDEX(FEB!$E$2:$AF$216,,MATCH($F$1,FEB!$E$1:$AJ$1,0))=$B$1,ROW(FEB!$J$2:$AI$216)-ROW(FEB!$J$2)+1),ROWS(B$3:B18))),\"\")","v":1405516},{"$f":"IFERROR(INDEX(FEB!C$2:C$216,SMALL(IF(INDEX(FEB!$E$2:$AF$216,,MATCH($F$1,FEB!$E$1:$AJ$1,0))=$B$1,ROW(FEB!$J$2:$AI$216)-ROW(FEB!$J$2)+1),ROWS(C$3:C18))),\"\")","v":"MOHAMMED 17"},{"$f":"IFERROR(INDEX(FEB!D$2:D$216,SMALL(IF(INDEX(FEB!$E$2:$AF$216,,MATCH($F$1,FEB!$E$1:$AJ$1,0))=$B$1,ROW(FEB!$J$2:$AI$216)-ROW(FEB!$J$2)+1),ROWS(D$3:D18))),\"\")","v":"Agent"},null,null,null,null,null,"2018-02-19"]
[null,{"$f":"IFERROR(INDEX(FEB!B$2:B$216,SMALL(IF(INDEX(FEB!$E$2:$AF$216,,MATCH($F$1,FEB!$E$1:$AJ$1,0))=$B$1,ROW(FEB!$J$2:$AI$216)-ROW(FEB!$J$2)+1),ROWS(B$3:B19))),\"\")","v":1405517},{"$f":"IFERROR(INDEX(FEB!C$2:C$216,SMALL(IF(INDEX(FEB!$E$2:$AF$216,,MATCH($F$1,FEB!$E$1:$AJ$1,0))=$B$1,ROW(FEB!$J$2:$AI$216)-ROW(FEB!$J$2)+1),ROWS(C$3:C19))),\"\")","v":"MOHAMMED 18"},{"$f":"IFERROR(INDEX(FEB!D$2:D$216,SMALL(IF(INDEX(FEB!$E$2:$AF$216,,MATCH($F$1,FEB!$E$1:$AJ$1,0))=$B$1,ROW(FEB!$J$2:$AI$216)-ROW(FEB!$J$2)+1),ROWS(D$3:D19))),\"\")","v":"Agent"},null,null,null,null,null,"2018-02-20"]
[null,{"$f":"IFERROR(INDEX(FEB!B$2:B$216,SMALL(IF(INDEX(FEB!$E$2:$AF$216,,MATCH($F$1,FEB!$E$1:$AJ$1,0))=$B$1,ROW(FEB!$J$2:$AI$216)-ROW(FEB!$J$2)+1),ROWS(B$3:B20))),\"\")","v":1405518},{"$f":"IFERROR(INDEX(FEB!C$2:C$216,SMALL(IF(INDEX(FEB!$E$2:$AF$216,,MATCH($F$1,FEB!$E$1:$AJ$1,0))=$B$1,ROW(FEB!$J$2:$AI$216)-ROW(FEB!$J$2)+1),ROWS(C$3:C20))),\"\")","v":"MOHAMMED 19"},{"$f":"IFERROR(INDEX(FEB!D$2:D$216,SMALL(IF(INDEX(FEB!$E$2:$AF$216,,MATCH($F$1,FEB!$E$1:$AJ$1,0))=$B$1,ROW(FEB!$J$2:$AI$216)-ROW(FEB!$J$2)+1),ROWS(D$3:D20))),\"\")","v":"Agent"},null,null,null,null,null,"2018-02-21"]
[null,{"$f":"IFERROR(INDEX(FEB!B$2:B$216,SMALL(IF(INDEX(FEB!$E$2:$AF$216,,MATCH($F$1,FEB!$E$1:$AJ$1,0))=$B$1,ROW(FEB!$J$2:$AI$216)-ROW(FEB!$J$2)+1),ROWS(B$3:B21))),\"\")","v":1405519},{"$f":"IFERROR(INDEX(FEB!C$2:C$216,SMALL(IF(INDEX(FEB!$E$2:$AF$216,,MATCH($F$1,FEB!$E$1:$AJ$1,0))=$B$1,ROW(FEB!$J$2:$AI$216)-ROW(FEB!$J$2)+1),ROWS(C$3:C21))),\"\")","v":"MOHAMMED 20"},{"$f":"IFERROR(INDEX(FEB!D$2:D$216,SMALL(IF(INDEX(FEB!$E$2:$AF$216,,MATCH($F$1,FEB!$E$1:$AJ$1,0))=$B$1,ROW(FEB!$J$2:$AI$216)-ROW(FEB!$J$2)+1),ROWS(D$3:D21))),\"\")","v":"Agent"},null,null,null,null,null,"2018-02-22"]
[null,{"$f":"IFERROR(INDEX(FEB!B$2:B$216,SMALL(IF(INDEX(FEB!$E$2:$AF$216,,MATCH($F$1,FEB!$E$1:$AJ$1,0))=$B$1,ROW(FEB!$J$2:$AI$216)-ROW(FEB!$J$2)+1),ROWS(B$3:B22))),\"\")","v":1405520},{"$f":"IFERROR(INDEX(FEB!C$2:C$216,SMALL(IF(INDEX(FEB!$E$2:$AF$216,,MATCH($F$1,FEB!$E$1:$AJ$1,0))=$B$1,ROW(FEB!$J$2:$AI$216)-ROW(FEB!$J$2)+1),ROWS(C$3:C22))),\"\")","v":"MOHAMMED 21"},{"$f":"IFERROR(INDEX(FEB!D$2:D$216,SMALL(IF(INDEX(FEB!$E$2:$AF$216,,MATCH($F$1,FEB!$E$1:$AJ$1,0))=$B$1,ROW(FEB!$J$2:$AI$216)-ROW(FEB!$J$2)+1),ROWS(D$3:D22))),\"\")","v":"Agent"},null,null,null,null,null,"2018-02-23"]
[null,{"$f":"IFERROR(INDEX(FEB!B$2:B$216,SMALL(IF(INDEX(FEB!$E$2:$AF$216,,MATCH($F$1,FEB!$E$1:$AJ$1,0))=$B$1,ROW(FEB!$J$2:$AI$216)-ROW(FEB!$J$2)+1),ROWS(B$3:B23))),\"\")","v":1405522},{"$f":"IFERROR(INDEX(FEB!C$2:C$216,SMALL(IF(INDEX(FEB!$E$2:$AF$216,,MATCH($F$1,FEB!$E$1:$AJ$1,0))=$B$1,ROW(FEB!$J$2:$AI$216)-ROW(FEB!$J$2)+1),ROWS(C$3:C23))),\"\")","v":"MOHAMMED 23"},{"$f":"IFERROR(INDEX(FEB!D$2:D$216,SMALL(IF(INDEX(FEB!$E$2:$AF$216,,MATCH($F$1,FEB!$E$1:$AJ$1,0))=$B$1,ROW(FEB!$J$2:$AI$216)-ROW(FEB!$J$2)+1),ROWS(D$3:D23))),\"\")","v":"Agent"},null,null,null,null,null,"2018-02-24"]
[null,{"$f":"IFERROR(INDEX(FEB!B$2:B$216,SMALL(IF(INDEX(FEB!$E$2:$AF$216,,MATCH($F$1,FEB!$E$1:$AJ$1,0))=$B$1,ROW(FEB!$J$2:$AI$216)-ROW(FEB!$J$2)+1),ROWS(B$3:B24))),\"\")","v":1405523},{"$f":"IFERROR(INDEX(FEB!C$2:C$216,SMALL(IF(INDEX(FEB!$E$2:$AF$216,,MATCH($F$1,FEB!$E$1:$AJ$1,0))=$B$1,ROW(FEB!$J$2:$AI$216)-ROW(FEB!$J$2)+1),ROWS(C$3:C24))),\"\")","v":"MOHAMMED 24"},{"$f":"IFERROR(INDEX(FEB!D$2:D$216,SMALL(IF(INDEX(FEB!$E$2:$AF$216,,MATCH($F$1,FEB!$E$1:$AJ$1,0))=$B$1,ROW(FEB!$J$2:$AI$216)-ROW(FEB!$J$2)+1),ROWS(D$3:D24))),\"\")","v":"Agent"},null,null,null,null,null,"2018-02-25"]
[null,{"$f":"IFERROR(INDEX(FEB!B$2:B$216,SMALL(IF(INDEX(FEB!$E$2:$AF$216,,MATCH($F$1,FEB!$E$1:$AJ$1,0))=$B$1,ROW(FEB!$J$2:$AI$216)-ROW(FEB!$J$2)+1),ROWS(B$3:B25))),\"\")","v":1405524},{"$f":"IFERROR(INDEX(FEB!C$2:C$216,SMALL(IF(INDEX(FEB!$E$2:$AF$216,,MATCH($F$1,FEB!$E$1:$AJ$1,0))=$B$1,ROW(FEB!$J$2:$AI$216)-ROW(FEB!$J$2)+1),ROWS(C$3:C25))),\"\")","v":"MOHAMMED 25"},{"$f":"IFERROR(INDEX(FEB!D$2:D$216,SMALL(IF(INDEX(FEB!$E$2:$AF$216,,MATCH($F$1,FEB!$E$1:$AJ$1,0))=$B$1,ROW(FEB!$J$2:$AI$216)-ROW(FEB!$J$2)+1),ROWS(D$3:D25))),\"\")","v":"Agent"},null,null,null,null,null,"2018-02-26"]
[null,{"$f":"IFERROR(INDEX(FEB!B$2:B$216,SMALL(IF(INDEX(FEB!$E$2:$AF$216,,MATCH($F$1,FEB!$E$1:$AJ$1,0))=$B$1,ROW(FEB!$J$2:$AI$216)-ROW(FEB!$J$2)+1),ROWS(B$3:B26))),\"\")","v":1405525},{"$f":"IFERROR(INDEX(FEB!C$2:C$216,SMALL(IF(INDEX(FEB!$E$2:$AF$216,,MATCH($F$1,FEB!$E$1:$AJ$1,0))=$B$1,ROW(FEB!$J$2:$AI$216)-ROW(FEB!$J$2)+1),ROWS(C$3:C26))),\"\")","v":"MOHAMMED 26"},{"$f":"IFERROR(INDEX(FEB!D$2:D$216,SMALL(IF(INDEX(FEB!$E$2:$AF$216,,MATCH($F$1,FEB!$E$1:$AJ$1,0))=$B$1,ROW(FEB!$J$2:$AI$216)-ROW(FEB!$J$2)+1),ROWS(D$3:D26))),\"\")","v":"Agent"},null,null,null,null,null,"2018-02-27"]
[null,{"$f":"IFERROR(INDEX(FEB!B$2:B$216,SMALL(IF(INDEX(FEB!$E$2:$AF$216,,MATCH($F$1,FEB!$E$1:$AJ$1,0))=$B$1,ROW(FEB!$J$2:$AI$216)-ROW(FEB!$J$2)+1),ROWS(B$3:B27))),\"\")","v":1405526},{"$f":"IFERROR(INDEX(FEB!C$2:C$216,SMALL(IF(INDEX(FEB!$E$2:$AF$216,,MATCH($F$1,FEB!$E$1:$AJ$1,0))=$B$1,ROW(FEB!$J$2:$AI$216)-ROW(FEB!$J$2)+1),ROWS(C$3:C27))),\"\")","v":"MOHAMMED 27"},{"$f":"IFERROR(INDEX(FEB!D$2:D$216,SMALL(IF(INDEX(FEB!$E$2:$AF$216,,MATCH($F$1,FEB!$E$1:$AJ$1,0))=$B$1,ROW(FEB!$J$2:$AI$216)-ROW(FEB!$J$2)+1),ROWS(D$3:D27))),\"\")","v":"Agent"},null,null,null,null,null,"2018-02-28"]
[null,{"$f":"IFERROR(INDEX(FEB!B$2:B$216,SMALL(IF(INDEX(FEB!$E$2:$AF$216,,MATCH($F$1,FEB!$E$1:$AJ$1,0))=$B$1,ROW(FEB!$J$2:$AI$216)-ROW(FEB!$J$2)+1),ROWS(B$3:B28))),\"\")","v":1405527},{"$f":"IFERROR(INDEX(FEB!C$2:C$216,SMALL(IF(INDEX(FEB!$E$2:$AF$216,,MATCH($F$1,FEB!$E$1:$AJ$1,0))=$B$1,ROW(FEB!$J$2:$AI$216)-ROW(FEB!$J$2)+1),ROWS(C$3:C28))),\"\")","v":"MOHAMMED 28"},{"$f":"IFERROR(INDEX(FEB!D$2:D$216,SMALL(IF(INDEX(FEB!$E$2:$AF$216,,MATCH($F$1,FEB!$E$1:$AJ$1,0))=$B$1,ROW(FEB!$J$2:$AI$216)-ROW(FEB!$J$2)+1),ROWS(D$3:D28))),\"\")","v":"Agent"}]
[null,{"$f":"IFERROR(INDEX(FEB!B$2:B$216,SMALL(IF(INDEX(FEB!$E$2:$AF$216,,MATCH($F$1,FEB!$E$1:$AJ$1,0))=$B$1,ROW(FEB!$J$2:$AI$216)-ROW(FEB!$J$2)+1),ROWS(B$3:B29))),\"\")","v":1405528},{"$f":"IFERROR(INDEX(FEB!C$2:C$216,SMALL(IF(INDEX(FEB!$E$2:$AF$216,,MATCH($F$1,FEB!$E$1:$AJ$1,0))=$B$1,ROW(FEB!$J$2:$AI$216)-ROW(FEB!$J$2)+1),ROWS(C$3:C29))),\"\")","v":"MOHAMMED 29"},{"$f":"IFERROR(INDEX(FEB!D$2:D$216,SMALL(IF(INDEX(FEB!$E$2:$AF$216,,MATCH($F$1,FEB!$E$1:$AJ$1,0))=$B$1,ROW(FEB!$J$2:$AI$216)-ROW(FEB!$J$2)+1),ROWS(D$3:D29))),\"\")","v":"Agent"}]
[null,{"$f":"IFERROR(INDEX(FEB!B$2:B$216,SMALL(IF(INDEX(FEB!$E$2:$AF$216,,MATCH($F$1,FEB!$E$1:$AJ$1,0))=$B$1,ROW(FEB!$J$2:$AI$216)-ROW(FEB!$J$2)+1),ROWS(B$3:B30))),\"\")","v":1405529},{"$f":"IFERROR(INDEX(FEB!C$2:C$216,SMALL(IF(INDEX(FEB!$E$2:$AF$216,,MATCH($F$1,FEB!$E$1:$AJ$1,0))=$B$1,ROW(FEB!$J$2:$AI$216)-ROW(FEB!$J$2)+1),ROWS(C$3:C30))),\"\")","v":"MOHAMMED 30"},{"$f":"IFERROR(INDEX(FEB!D$2:D$216,SMALL(IF(INDEX(FEB!$E$2:$AF$216,,MATCH($F$1,FEB!$E$1:$AJ$1,0))=$B$1,ROW(FEB!$J$2:$AI$216)-ROW(FEB!$J$2)+1),ROWS(D$3:D30))),\"\")","v":"Agent"}]
[null,{"$f":"IFERROR(INDEX(FEB!B$2:B$216,SMALL(IF(INDEX(FEB!$E$2:$AF$216,,MATCH($F$1,FEB!$E$1:$AJ$1,0))=$B$1,ROW(FEB!$J$2:$AI$216)-ROW(FEB!$J$2)+1),ROWS(B$3:B31))),\"\")","v":1405530},{"$f":"IFERROR(INDEX(FEB!C$2:C$216,SMALL(IF(INDEX(FEB!$E$2:$AF$216,,MATCH($F$1,FEB!$E$1:$AJ$1,0))=$B$1,ROW(FEB!$J$2:$AI$216)-ROW(FEB!$J$2)+1),ROWS(C$3:C31))),\"\")","v":"MOHAMMED 31"},{"$f":"IFERROR(INDEX(FEB!D$2:D$216,SMALL(IF(INDEX(FEB!$E$2:$AF$216,,MATCH($F$1,FEB!$E$1:$AJ$1,0))=$B$1,ROW(FEB!$J$2:$AI$216)-ROW(FEB!$J$2)+1),ROWS(D$3:D31))),\"\")","v":"Agent"}]
[null,{"$f":"IFERROR(INDEX(FEB!B$2:B$216,SMALL(IF(INDEX(FEB!$E$2:$AF$216,,MATCH($F$1,FEB!$E$1:$AJ$1,0))=$B$1,ROW(FEB!$J$2:$AI$216)-ROW(FEB!$J$2)+1),ROWS(B$3:B32))),\"\")","v":1405657},{"$f":"IFERROR(INDEX(FEB!C$2:C$216,SMALL(IF(INDEX(FEB!$E$2:$AF$216,,MATCH($F$1,FEB!$E$1:$AJ$1,0))=$B$1,ROW(FEB!$J$2:$AI$216)-ROW(FEB!$J$2)+1),ROWS(C$3:C32))),\"\")","v":"MOHAMMED 158"},{"$f":"IFERROR(INDEX(FEB!D$2:D$216,SMALL(IF(INDEX(FEB!$E$2:$AF$216,,MATCH($F$1,FEB!$E$1:$AJ$1,0))=$B$1,ROW(FEB!$J$2:$AI$216)-ROW(FEB!$J$2)+1),ROWS(D$3:D32))),\"\")","v":"ASST"}]
[null,{"$f":"IFERROR(INDEX(FEB!B$2:B$216,SMALL(IF(INDEX(FEB!$E$2:$AF$216,,MATCH($F$1,FEB!$E$1:$AJ$1,0))=$B$1,ROW(FEB!$J$2:$AI$216)-ROW(FEB!$J$2)+1),ROWS(B$3:B33))),\"\")","v":1405658},{"$f":"IFERROR(INDEX(FEB!C$2:C$216,SMALL(IF(INDEX(FEB!$E$2:$AF$216,,MATCH($F$1,FEB!$E$1:$AJ$1,0))=$B$1,ROW(FEB!$J$2:$AI$216)-ROW(FEB!$J$2)+1),ROWS(C$3:C33))),\"\")","v":"MOHAMMED 159"},{"$f":"IFERROR(INDEX(FEB!D$2:D$216,SMALL(IF(INDEX(FEB!$E$2:$AF$216,,MATCH($F$1,FEB!$E$1:$AJ$1,0))=$B$1,ROW(FEB!$J$2:$AI$216)-ROW(FEB!$J$2)+1),ROWS(D$3:D33))),\"\")","v":"SUP"}]
[null,{"$f":"IFERROR(INDEX(FEB!B$2:B$216,SMALL(IF(INDEX(FEB!$E$2:$AF$216,,MATCH($F$1,FEB!$E$1:$AJ$1,0))=$B$1,ROW(FEB!$J$2:$AI$216)-ROW(FEB!$J$2)+1),ROWS(B$3:B34))),\"\")","v":1405659},{"$f":"IFERROR(INDEX(FEB!C$2:C$216,SMALL(IF(INDEX(FEB!$E$2:$AF$216,,MATCH($F$1,FEB!$E$1:$AJ$1,0))=$B$1,ROW(FEB!$J$2:$AI$216)-ROW(FEB!$J$2)+1),ROWS(C$3:C34))),\"\")","v":"MOHAMMED 160"},{"$f":"IFERROR(INDEX(FEB!D$2:D$216,SMALL(IF(INDEX(FEB!$E$2:$AF$216,,MATCH($F$1,FEB!$E$1:$AJ$1,0))=$B$1,ROW(FEB!$J$2:$AI$216)-ROW(FEB!$J$2)+1),ROWS(D$3:D34))),\"\")","v":"SUP"}]
[null,{"$f":"IFERROR(INDEX(FEB!B$2:B$216,SMALL(IF(INDEX(FEB!$E$2:$AF$216,,MATCH($F$1,FEB!$E$1:$AJ$1,0))=$B$1,ROW(FEB!$J$2:$AI$216)-ROW(FEB!$J$2)+1),ROWS(B$3:B35))),\"\")","v":1405660},{"$f":"IFERROR(INDEX(FEB!C$2:C$216,SMALL(IF(INDEX(FEB!$E$2:$AF$216,,MATCH($F$1,FEB!$E$1:$AJ$1,0))=$B$1,ROW(FEB!$J$2:$AI$216)-ROW(FEB!$J$2)+1),ROWS(C$3:C35))),\"\")","v":"MOHAMMED 161"},{"$f":"IFERROR(INDEX(FEB!D$2:D$216,SMALL(IF(INDEX(FEB!$E$2:$AF$216,,MATCH($F$1,FEB!$E$1:$AJ$1,0))=$B$1,ROW(FEB!$J$2:$AI$216)-ROW(FEB!$J$2)+1),ROWS(D$3:D35))),\"\")","v":"SUP"}]
[null,{"$f":"IFERROR(INDEX(FEB!B$2:B$216,SMALL(IF(INDEX(FEB!$E$2:$AF$216,,MATCH($F$1,FEB!$E$1:$AJ$1,0))=$B$1,ROW(FEB!$J$2:$AI$216)-ROW(FEB!$J$2)+1),ROWS(B$3:B36))),\"\")","v":1405661},{"$f":"IFERROR(INDEX(FEB!C$2:C$216,SMALL(IF(INDEX(FEB!$E$2:$AF$216,,MATCH($F$1,FEB!$E$1:$AJ$1,0))=$B$1,ROW(FEB!$J$2:$AI$216)-ROW(FEB!$J$2)+1),ROWS(C$3:C36))),\"\")","v":"MOHAMMED 162"},{"$f":"IFERROR(INDEX(FEB!D$2:D$216,SMALL(IF(INDEX(FEB!$E$2:$AF$216,,MATCH($F$1,FEB!$E$1:$AJ$1,0))=$B$1,ROW(FEB!$J$2:$AI$216)-ROW(FEB!$J$2)+1),ROWS(D$3:D36))),\"\")","v":"SUP"}]
[null,{"$f":"IFERROR(INDEX(FEB!B$2:B$216,SMALL(IF(INDEX(FEB!$E$2:$AF$216,,MATCH($F$1,FEB!$E$1:$AJ$1,0))=$B$1,ROW(FEB!$J$2:$AI$216)-ROW(FEB!$J$2)+1),ROWS(B$3:B37))),\"\")","v":1405662},{"$f":"IFERROR(INDEX(FEB!C$2:C$216,SMALL(IF(INDEX(FEB!$E$2:$AF$216,,MATCH($F$1,FEB!$E$1:$AJ$1,0))=$B$1,ROW(FEB!$J$2:$AI$216)-ROW(FEB!$J$2)+1),ROWS(C$3:C37))),\"\")","v":"MOHAMMED 163"},{"$f":"IFERROR(INDEX(FEB!D$2:D$216,SMALL(IF(INDEX(FEB!$E$2:$AF$216,,MATCH($F$1,FEB!$E$1:$AJ$1,0))=$B$1,ROW(FEB!$J$2:$AI$216)-ROW(FEB!$J$2)+1),ROWS(D$3:D37))),\"\")","v":"TOC"}]
[null,{"$f":"IFERROR(INDEX(FEB!B$2:B$216,SMALL(IF(INDEX(FEB!$E$2:$AF$216,,MATCH($F$1,FEB!$E$1:$AJ$1,0))=$B$1,ROW(FEB!$J$2:$AI$216)-ROW(FEB!$J$2)+1),ROWS(B$3:B38))),\"\")","v":1405663},{"$f":"IFERROR(INDEX(FEB!C$2:C$216,SMALL(IF(INDEX(FEB!$E$2:$AF$216,,MATCH($F$1,FEB!$E$1:$AJ$1,0))=$B$1,ROW(FEB!$J$2:$AI$216)-ROW(FEB!$J$2)+1),ROWS(C$3:C38))),\"\")","v":"MOHAMMED 164"},{"$f":"IFERROR(INDEX(FEB!D$2:D$216,SMALL(IF(INDEX(FEB!$E$2:$AF$216,,MATCH($F$1,FEB!$E$1:$AJ$1,0))=$B$1,ROW(FEB!$J$2:$AI$216)-ROW(FEB!$J$2)+1),ROWS(D$3:D38))),\"\")","v":"OFFICE"}]
[null,{"$f":"IFERROR(INDEX(FEB!B$2:B$216,SMALL(IF(INDEX(FEB!$E$2:$AF$216,,MATCH($F$1,FEB!$E$1:$AJ$1,0))=$B$1,ROW(FEB!$J$2:$AI$216)-ROW(FEB!$J$2)+1),ROWS(B$3:B39))),\"\")","v":1405664},{"$f":"IFERROR(INDEX(FEB!C$2:C$216,SMALL(IF(INDEX(FEB!$E$2:$AF$216,,MATCH($F$1,FEB!$E$1:$AJ$1,0))=$B$1,ROW(FEB!$J$2:$AI$216)-ROW(FEB!$J$2)+1),ROWS(C$3:C39))),\"\")","v":"MOHAMMED 165"},{"$f":"IFERROR(INDEX(FEB!D$2:D$216,SMALL(IF(INDEX(FEB!$E$2:$AF$216,,MATCH($F$1,FEB!$E$1:$AJ$1,0))=$B$1,ROW(FEB!$J$2:$AI$216)-ROW(FEB!$J$2)+1),ROWS(D$3:D39))),\"\")","v":"PLAZA"}]
[null,{"$f":"IFERROR(INDEX(FEB!B$2:B$216,SMALL(IF(INDEX(FEB!$E$2:$AF$216,,MATCH($F$1,FEB!$E$1:$AJ$1,0))=$B$1,ROW(FEB!$J$2:$AI$216)-ROW(FEB!$J$2)+1),ROWS(B$3:B40))),\"\")","v":1405665},{"$f":"IFERROR(INDEX(FEB!C$2:C$216,SMALL(IF(INDEX(FEB!$E$2:$AF$216,,MATCH($F$1,FEB!$E$1:$AJ$1,0))=$B$1,ROW(FEB!$J$2:$AI$216)-ROW(FEB!$J$2)+1),ROWS(C$3:C40))),\"\")","v":"MOHAMMED 166"},{"$f":"IFERROR(INDEX(FEB!D$2:D$216,SMALL(IF(INDEX(FEB!$E$2:$AF$216,,MATCH($F$1,FEB!$E$1:$AJ$1,0))=$B$1,ROW(FEB!$J$2:$AI$216)-ROW(FEB!$J$2)+1),ROWS(D$3:D40))),\"\")","v":"DOC"}]
[null,{"$f":"IFERROR(INDEX(FEB!B$2:B$216,SMALL(IF(INDEX(FEB!$E$2:$AF$216,,MATCH($F$1,FEB!$E$1:$AJ$1,0))=$B$1,ROW(FEB!$J$2:$AI$216)-ROW(FEB!$J$2)+1),ROWS(B$3:B41))),\"\")","v":1405666},{"$f":"IFERROR(INDEX(FEB!C$2:C$216,SMALL(IF(INDEX(FEB!$E$2:$AF$216,,MATCH($F$1,FEB!$E$1:$AJ$1,0))=$B$1,ROW(FEB!$J$2:$AI$216)-ROW(FEB!$J$2)+1),ROWS(C$3:C41))),\"\")","v":"MOHAMMED 167"},{"$f":"IFERROR(INDEX(FEB!D$2:D$216,SMALL(IF(INDEX(FEB!$E$2:$AF$216,,MATCH($F$1,FEB!$E$1:$AJ$1,0))=$B$1,ROW(FEB!$J$2:$AI$216)-ROW(FEB!$J$2)+1),ROWS(D$3:D41))),\"\")","v":"Agent"}]
[null,{"$f":"IFERROR(INDEX(FEB!B$2:B$216,SMALL(IF(INDEX(FEB!$E$2:$AF$216,,MATCH($F$1,FEB!$E$1:$AJ$1,0))=$B$1,ROW(FEB!$J$2:$AI$216)-ROW(FEB!$J$2)+1),ROWS(B$3:B42))),\"\")","v":1405667},{"$f":"IFERROR(INDEX(FEB!C$2:C$216,SMALL(IF(INDEX(FEB!$E$2:$AF$216,,MATCH($F$1,FEB!$E$1:$AJ$1,0))=$B$1,ROW(FEB!$J$2:$AI$216)-ROW(FEB!$J$2)+1),ROWS(C$3:C42))),\"\")","v":"MOHAMMED 168"},{"$f":"IFERROR(INDEX(FEB!D$2:D$216,SMALL(IF(INDEX(FEB!$E$2:$AF$216,,MATCH($F$1,FEB!$E$1:$AJ$1,0))=$B$1,ROW(FEB!$J$2:$AI$216)-ROW(FEB!$J$2)+1),ROWS(D$3:D42))),\"\")","v":"Agent"}]
[null,{"$f":"IFERROR(INDEX(FEB!B$2:B$216,SMALL(IF(INDEX(FEB!$E$2:$AF$216,,MATCH($F$1,FEB!$E$1:$AJ$1,0))=$B$1,ROW(FEB!$J$2:$AI$216)-ROW(FEB!$J$2)+1),ROWS(B$3:B43))),\"\")","v":1405668},{"$f":"IFERROR(INDEX(FEB!C$2:C$216,SMALL(IF(INDEX(FEB!$E$2:$AF$216,,MATCH($F$1,FEB!$E$1:$AJ$1,0))=$B$1,ROW(FEB!$J$2:$AI$216)-ROW(FEB!$J$2)+1),ROWS(C$3:C43))),\"\")","v":"MOHAMMED 169"},{"$f":"IFERROR(INDEX(FEB!D$2:D$216,SMALL(IF(INDEX(FEB!$E$2:$AF$216,,MATCH($F$1,FEB!$E$1:$AJ$1,0))=$B$1,ROW(FEB!$J$2:$AI$216)-ROW(FEB!$J$2)+1),ROWS(D$3:D43))),\"\")","v":"Agent"}]
[null,{"$f":"IFERROR(INDEX(FEB!B$2:B$216,SMALL(IF(INDEX(FEB!$E$2:$AF$216,,MATCH($F$1,FEB!$E$1:$AJ$1,0))=$B$1,ROW(FEB!$J$2:$AI$216)-ROW(FEB!$J$2)+1),ROWS(B$3:B44))),\"\")","v":1405669},{"$f":"IFERROR(INDEX(FEB!C$2:C$216,SMALL(IF(INDEX(FEB!$E$2:$AF$216,,MATCH($F$1,FEB!$E$1:$AJ$1,0))=$B$1,ROW(FEB!$J$2:$AI$216)-ROW(FEB!$J$2)+1),ROWS(C$3:C44))),\"\")","v":"MOHAMMED 170"},{"$f":"IFERROR(INDEX(FEB!D$2:D$216,SMALL(IF(INDEX(FEB!$E$2:$AF$216,,MATCH($F$1,FEB!$E$1:$AJ$1,0))=$B$1,ROW(FEB!$J$2:$AI$216)-ROW(FEB!$J$2)+1),ROWS(D$3:D44))),\"\")","v":"Agent"}]
[null,{"$f":"IFERROR(INDEX(FEB!B$2:B$216,SMALL(IF(INDEX(FEB!$E$2:$AF$216,,MATCH($F$1,FEB!$E$1:$AJ$1,0))=$B$1,ROW(FEB!$J$2:$AI$216)-ROW(FEB!$J$2)+1),ROWS(B$3:B45))),\"\")","v":1405670},{"$f":"IFERROR(INDEX(FEB!C$2:C$216,SMALL(IF(INDEX(FEB!$E$2:$AF$216,,MATCH($F$1,FEB!$E$1:$AJ$1,0))=$B$1,ROW(FEB!$J$2:$AI$216)-ROW(FEB!$J$2)+1),ROWS(C$3:C45))),\"\")","v":"MOHAMMED 171"},{"$f":"IFERROR(INDEX(FEB!D$2:D$216,SMALL(IF(INDEX(FEB!$E$2:$AF$216,,MATCH($F$1,FEB!$E$1:$AJ$1,0))=$B$1,ROW(FEB!$J$2:$AI$216)-ROW(FEB!$J$2)+1),ROWS(D$3:D45))),\"\")","v":"Agent"}]
[null,{"$f":"IFERROR(INDEX(FEB!B$2:B$216,SMALL(IF(INDEX(FEB!$E$2:$AF$216,,MATCH($F$1,FEB!$E$1:$AJ$1,0))=$B$1,ROW(FEB!$J$2:$AI$216)-ROW(FEB!$J$2)+1),ROWS(B$3:B46))),\"\")","v":1405671},{"$f":"IFERROR(INDEX(FEB!C$2:C$216,SMALL(IF(INDEX(FEB!$E$2:$AF$216,,MATCH($F$1,FEB!$E$1:$AJ$1,0))=$B$1,ROW(FEB!$J$2:$AI$216)-ROW(FEB!$J$2)+1),ROWS(C$3:C46))),\"\")","v":"MOHAMMED 172"},{"$f":"IFERROR(INDEX(FEB!D$2:D$216,SMALL(IF(INDEX(FEB!$E$2:$AF$216,,MATCH($F$1,FEB!$E$1:$AJ$1,0))=$B$1,ROW(FEB!$J$2:$AI$216)-ROW(FEB!$J$2)+1),ROWS(D$3:D46))),\"\")","v":"Agent"}]
[null,{"$f":"IFERROR(INDEX(FEB!B$2:B$216,SMALL(IF(INDEX(FEB!$E$2:$AF$216,,MATCH($F$1,FEB!$E$1:$AJ$1,0))=$B$1,ROW(FEB!$J$2:$AI$216)-ROW(FEB!$J$2)+1),ROWS(B$3:B47))),\"\")","v":1405672},{"$f":"IFERROR(INDEX(FEB!C$2:C$216,SMALL(IF(INDEX(FEB!$E$2:$AF$216,,MATCH($F$1,FEB!$E$1:$AJ$1,0))=$B$1,ROW(FEB!$J$2:$AI$216)-ROW(FEB!$J$2)+1),ROWS(C$3:C47))),\"\")","v":"MOHAMMED 173"},{"$f":"IFERROR(INDEX(FEB!D$2:D$216,SMALL(IF(INDEX(FEB!$E$2:$AF$216,,MATCH($F$1,FEB!$E$1:$AJ$1,0))=$B$1,ROW(FEB!$J$2:$AI$216)-ROW(FEB!$J$2)+1),ROWS(D$3:D47))),\"\")","v":"Agent"}]
[null,{"$f":"IFERROR(INDEX(FEB!B$2:B$216,SMALL(IF(INDEX(FEB!$E$2:$AF$216,,MATCH($F$1,FEB!$E$1:$AJ$1,0))=$B$1,ROW(FEB!$J$2:$AI$216)-ROW(FEB!$J$2)+1),ROWS(B$3:B48))),\"\")","v":1405673},{"$f":"IFERROR(INDEX(FEB!C$2:C$216,SMALL(IF(INDEX(FEB!$E$2:$AF$216,,MATCH($F$1,FEB!$E$1:$AJ$1,0))=$B$1,ROW(FEB!$J$2:$AI$216)-ROW(FEB!$J$2)+1),ROWS(C$3:C48))),\"\")","v":"MOHAMMED 174"},{"$f":"IFERROR(INDEX(FEB!D$2:D$216,SMALL(IF(INDEX(FEB!$E$2:$AF$216,,MATCH($F$1,FEB!$E$1:$AJ$1,0))=$B$1,ROW(FEB!$J$2:$AI$216)-ROW(FEB!$J$2)+1),ROWS(D$3:D48))),\"\")","v":"Agent"}]
[null,{"$f":"IFERROR(INDEX(FEB!B$2:B$216,SMALL(IF(INDEX(FEB!$E$2:$AF$216,,MATCH($F$1,FEB!$E$1:$AJ$1,0))=$B$1,ROW(FEB!$J$2:$AI$216)-ROW(FEB!$J$2)+1),ROWS(B$3:B49))),\"\")","v":1405674},{"$f":"IFERROR(INDEX(FEB!C$2:C$216,SMALL(IF(INDEX(FEB!$E$2:$AF$216,,MATCH($F$1,FEB!$E$1:$AJ$1,0))=$B$1,ROW(FEB!$J$2:$AI$216)-ROW(FEB!$J$2)+1),ROWS(C$3:C49))),\"\")","v":"MOHAMMED 175"},{"$f":"IFERROR(INDEX(FEB!D$2:D$216,SMALL(IF(INDEX(FEB!$E$2:$AF$216,,MATCH($F$1,FEB!$E$1:$AJ$1,0))=$B$1,ROW(FEB!$J$2:$AI$216)-ROW(FEB!$J$2)+1),ROWS(D$3:D49))),\"\")","v":"Agent"}]
[null,{"$f":"IFERROR(INDEX(FEB!B$2:B$216,SMALL(IF(INDEX(FEB!$E$2:$AF$216,,MATCH($F$1,FEB!$E$1:$AJ$1,0))=$B$1,ROW(FEB!$J$2:$AI$216)-ROW(FEB!$J$2)+1),ROWS(B$3:B50))),\"\")","v":1405675},{"$f":"IFERROR(INDEX(FEB!C$2:C$216,SMALL(IF(INDEX(FEB!$E$2:$AF$216,,MATCH($F$1,FEB!$E$1:$AJ$1,0))=$B$1,ROW(FEB!$J$2:$AI$216)-ROW(FEB!$J$2)+1),ROWS(C$3:C50))),\"\")","v":"MOHAMMED 176"},{"$f":"IFERROR(INDEX(FEB!D$2:D$216,SMALL(IF(INDEX(FEB!$E$2:$AF$216,,MATCH($F$1,FEB!$E$1:$AJ$1,0))=$B$1,ROW(FEB!$J$2:$AI$216)-ROW(FEB!$J$2)+1),ROWS(D$3:D50))),\"\")","v":"Agent"}]
[null,{"$f":"IFERROR(INDEX(FEB!B$2:B$216,SMALL(IF(INDEX(FEB!$E$2:$AF$216,,MATCH($F$1,FEB!$E$1:$AJ$1,0))=$B$1,ROW(FEB!$J$2:$AI$216)-ROW(FEB!$J$2)+1),ROWS(B$3:B51))),\"\")","v":1405676},{"$f":"IFERROR(INDEX(FEB!C$2:C$216,SMALL(IF(INDEX(FEB!$E$2:$AF$216,,MATCH($F$1,FEB!$E$1:$AJ$1,0))=$B$1,ROW(FEB!$J$2:$AI$216)-ROW(FEB!$J$2)+1),ROWS(C$3:C51))),\"\")","v":"MOHAMMED 177"},{"$f":"IFERROR(INDEX(FEB!D$2:D$216,SMALL(IF(INDEX(FEB!$E$2:$AF$216,,MATCH($F$1,FEB!$E$1:$AJ$1,0))=$B$1,ROW(FEB!$J$2:$AI$216)-ROW(FEB!$J$2)+1),ROWS(D$3:D51))),\"\")","v":"Agent"}]
[null,{"$f":"IFERROR(INDEX(FEB!B$2:B$216,SMALL(IF(INDEX(FEB!$E$2:$AF$216,,MATCH($F$1,FEB!$E$1:$AJ$1,0))=$B$1,ROW(FEB!$J$2:$AI$216)-ROW(FEB!$J$2)+1),ROWS(B$3:B52))),\"\")","v":1405677},{"$f":"IFERROR(INDEX(FEB!C$2:C$216,SMALL(IF(INDEX(FEB!$E$2:$AF$216,,MATCH($F$1,FEB!$E$1:$AJ$1,0))=$B$1,ROW(FEB!$J$2:$AI$216)-ROW(FEB!$J$2)+1),ROWS(C$3:C52))),\"\")","v":"MOHAMMED 178"},{"$f":"IFERROR(INDEX(FEB!D$2:D$216,SMALL(IF(INDEX(FEB!$E$2:$AF$216,,MATCH($F$1,FEB!$E$1:$AJ$1,0))=$B$1,ROW(FEB!$J$2:$AI$216)-ROW(FEB!$J$2)+1),ROWS(D$3:D52))),\"\")","v":"Agent"}]
[null,{"$f":"IFERROR(INDEX(FEB!B$2:B$216,SMALL(IF(INDEX(FEB!$E$2:$AF$216,,MATCH($F$1,FEB!$E$1:$AJ$1,0))=$B$1,ROW(FEB!$J$2:$AI$216)-ROW(FEB!$J$2)+1),ROWS(B$3:B53))),\"\")","v":1405678},{"$f":"IFERROR(INDEX(FEB!C$2:C$216,SMALL(IF(INDEX(FEB!$E$2:$AF$216,,MATCH($F$1,FEB!$E$1:$AJ$1,0))=$B$1,ROW(FEB!$J$2:$AI$216)-ROW(FEB!$J$2)+1),ROWS(C$3:C53))),\"\")","v":"MOHAMMED 179"},{"$f":"IFERROR(INDEX(FEB!D$2:D$216,SMALL(IF(INDEX(FEB!$E$2:$AF$216,,MATCH($F$1,FEB!$E$1:$AJ$1,0))=$B$1,ROW(FEB!$J$2:$AI$216)-ROW(FEB!$J$2)+1),ROWS(D$3:D53))),\"\")","v":"Agent"}]
[null,{"$f":"IFERROR(INDEX(FEB!B$2:B$216,SMALL(IF(INDEX(FEB!$E$2:$AF$216,,MATCH($F$1,FEB!$E$1:$AJ$1,0))=$B$1,ROW(FEB!$J$2:$AI$216)-ROW(FEB!$J$2)+1),ROWS(B$3:B54))),\"\")","v":1405679},{"$f":"IFERROR(INDEX(FEB!C$2:C$216,SMALL(IF(INDEX(FEB!$E$2:$AF$216,,MATCH($F$1,FEB!$E$1:$AJ$1,0))=$B$1,ROW(FEB!$J$2:$AI$216)-ROW(FEB!$J$2)+1),ROWS(C$3:C54))),\"\")","v":"MOHAMMED 180"},{"$f":"IFERROR(INDEX(FEB!D$2:D$216,SMALL(IF(INDEX(FEB!$E$2:$AF$216,,MATCH($F$1,FEB!$E$1:$AJ$1,0))=$B$1,ROW(FEB!$J$2:$AI$216)-ROW(FEB!$J$2)+1),ROWS(D$3:D54))),\"\")","v":"Agent"}]
[null,{"$f":"IFERROR(INDEX(FEB!B$2:B$216,SMALL(IF(INDEX(FEB!$E$2:$AF$216,,MATCH($F$1,FEB!$E$1:$AJ$1,0))=$B$1,ROW(FEB!$J$2:$AI$216)-ROW(FEB!$J$2)+1),ROWS(B$3:B55))),\"\")","v":1405680},{"$f":"IFERROR(INDEX(FEB!C$2:C$216,SMALL(IF(INDEX(FEB!$E$2:$AF$216,,MATCH($F$1,FEB!$E$1:$AJ$1,0))=$B$1,ROW(FEB!$J$2:$AI$216)-ROW(FEB!$J$2)+1),ROWS(C$3:C55))),\"\")","v":"MOHAMMED 181"},{"$f":"IFERROR(INDEX(FEB!D$2:D$216,SMALL(IF(INDEX(FEB!$E$2:$AF$216,,MATCH($F$1,FEB!$E$1:$AJ$1,0))=$B$1,ROW(FEB!$J$2:$AI$216)-ROW(FEB!$J$2)+1),ROWS(D$3:D55))),\"\")","v":"Agent"}]
[null,{"$f":"IFERROR(INDEX(FEB!B$2:B$216,SMALL(IF(INDEX(FEB!$E$2:$AF$216,,MATCH($F$1,FEB!$E$1:$AJ$1,0))=$B$1,ROW(FEB!$J$2:$AI$216)-ROW(FEB!$J$2)+1),ROWS(B$3:B56))),\"\")","v":1405681},{"$f":"IFERROR(INDEX(FEB!C$2:C$216,SMALL(IF(INDEX(FEB!$E$2:$AF$216,,MATCH($F$1,FEB!$E$1:$AJ$1,0))=$B$1,ROW(FEB!$J$2:$AI$216)-ROW(FEB!$J$2)+1),ROWS(C$3:C56))),\"\")","v":"MOHAMMED 182"},{"$f":"IFERROR(INDEX(FEB!D$2:D$216,SMALL(IF(INDEX(FEB!$E$2:$AF$216,,MATCH($F$1,FEB!$E$1:$AJ$1,0))=$B$1,ROW(FEB!$J$2:$AI$216)-ROW(FEB!$J$2)+1),ROWS(D$3:D56))),\"\")","v":"Agent"}]
[null,{"$f":"IFERROR(INDEX(FEB!B$2:B$216,SMALL(IF(INDEX(FEB!$E$2:$AF$216,,MATCH($F$1,FEB!$E$1:$AJ$1,0))=$B$1,ROW(FEB!$J$2:$AI$216)-ROW(FEB!$J$2)+1),ROWS(B$3:B57))),\"\")","v":1405682},{"$f":"IFERROR(INDEX(FEB!C$2:C$216,SMALL(IF(INDEX(FEB!$E$2:$AF$216,,MATCH($F$1,FEB!$E$1:$AJ$1,0))=$B$1,ROW(FEB!$J$2:$AI$216)-ROW(FEB!$J$2)+1),ROWS(C$3:C57))),\"\")","v":"MOHAMMED 183"},{"$f":"IFERROR(INDEX(FEB!D$2:D$216,SMALL(IF(INDEX(FEB!$E$2:$AF$216,,MATCH($F$1,FEB!$E$1:$AJ$1,0))=$B$1,ROW(FEB!$J$2:$AI$216)-ROW(FEB!$J$2)+1),ROWS(D$3:D57))),\"\")","v":"Agent"}]
[null,{"$f":"IFERROR(INDEX(FEB!B$2:B$216,SMALL(IF(INDEX(FEB!$E$2:$AF$216,,MATCH($F$1,FEB!$E$1:$AJ$1,0))=$B$1,ROW(FEB!$J$2:$AI$216)-ROW(FEB!$J$2)+1),ROWS(B$3:B58))),\"\")","v":1405683},{"$f":"IFERROR(INDEX(FEB!C$2:C$216,SMALL(IF(INDEX(FEB!$E$2:$AF$216,,MATCH($F$1,FEB!$E$1:$AJ$1,0))=$B$1,ROW(FEB!$J$2:$AI$216)-ROW(FEB!$J$2)+1),ROWS(C$3:C58))),\"\")","v":"MOHAMMED 184"},{"$f":"IFERROR(INDEX(FEB!D$2:D$216,SMALL(IF(INDEX(FEB!$E$2:$AF$216,,MATCH($F$1,FEB!$E$1:$AJ$1,0))=$B$1,ROW(FEB!$J$2:$AI$216)-ROW(FEB!$J$2)+1),ROWS(D$3:D58))),\"\")","v":"Agent"}]
[null,{"$f":"IFERROR(INDEX(FEB!B$2:B$216,SMALL(IF(INDEX(FEB!$E$2:$AF$216,,MATCH($F$1,FEB!$E$1:$AJ$1,0))=$B$1,ROW(FEB!$J$2:$AI$216)-ROW(FEB!$J$2)+1),ROWS(B$3:B59))),\"\")","v":1405684},{"$f":"IFERROR(INDEX(FEB!C$2:C$216,SMALL(IF(INDEX(FEB!$E$2:$AF$216,,MATCH($F$1,FEB!$E$1:$AJ$1,0))=$B$1,ROW(FEB!$J$2:$AI$216)-ROW(FEB!$J$2)+1),ROWS(C$3:C59))),\"\")","v":"MOHAMMED 185"},{"$f":"IFERROR(INDEX(FEB!D$2:D$216,SMALL(IF(INDEX(FEB!$E$2:$AF$216,,MATCH($F$1,FEB!$E$1:$AJ$1,0))=$B$1,ROW(FEB!$J$2:$AI$216)-ROW(FEB!$J$2)+1),ROWS(D$3:D59))),\"\")","v":"Agent"}]
[null,{"$f":"IFERROR(INDEX(FEB!B$2:B$216,SMALL(IF(INDEX(FEB!$E$2:$AF$216,,MATCH($F$1,FEB!$E$1:$AJ$1,0))=$B$1,ROW(FEB!$J$2:$AI$216)-ROW(FEB!$J$2)+1),ROWS(B$3:B60))),\"\")","v":1405685},{"$f":"IFERROR(INDEX(FEB!C$2:C$216,SMALL(IF(INDEX(FEB!$E$2:$AF$216,,MATCH($F$1,FEB!$E$1:$AJ$1,0))=$B$1,ROW(FEB!$J$2:$AI$216)-ROW(FEB!$J$2)+1),ROWS(C$3:C60))),\"\")","v":"MOHAMMED 186"},{"$f":"IFERROR(INDEX(FEB!D$2:D$216,SMALL(IF(INDEX(FEB!$E$2:$AF$216,,MATCH($F$1,FEB!$E$1:$AJ$1,0))=$B$1,ROW(FEB!$J$2:$AI$216)-ROW(FEB!$J$2)+1),ROWS(D$3:D60))),\"\")","v":"Agent"}]
[null,{"$f":"IFERROR(INDEX(FEB!B$2:B$216,SMALL(IF(INDEX(FEB!$E$2:$AF$216,,MATCH($F$1,FEB!$E$1:$AJ$1,0))=$B$1,ROW(FEB!$J$2:$AI$216)-ROW(FEB!$J$2)+1),ROWS(B$3:B61))),\"\")","v":1405686},{"$f":"IFERROR(INDEX(FEB!C$2:C$216,SMALL(IF(INDEX(FEB!$E$2:$AF$216,,MATCH($F$1,FEB!$E$1:$AJ$1,0))=$B$1,ROW(FEB!$J$2:$AI$216)-ROW(FEB!$J$2)+1),ROWS(C$3:C61))),\"\")","v":"MOHAMMED 187"},{"$f":"IFERROR(INDEX(FEB!D$2:D$216,SMALL(IF(INDEX(FEB!$E$2:$AF$216,,MATCH($F$1,FEB!$E$1:$AJ$1,0))=$B$1,ROW(FEB!$J$2:$AI$216)-ROW(FEB!$J$2)+1),ROWS(D$3:D61))),\"\")","v":"Agent"}]
[null,{"$f":"IFERROR(INDEX(FEB!B$2:B$216,SMALL(IF(INDEX(FEB!$E$2:$AF$216,,MATCH($F$1,FEB!$E$1:$AJ$1,0))=$B$1,ROW(FEB!$J$2:$AI$216)-ROW(FEB!$J$2)+1),ROWS(B$3:B62))),\"\")","v":1405687},{"$f":"IFERROR(INDEX(FEB!C$2:C$216,SMALL(IF(INDEX(FEB!$E$2:$AF$216,,MATCH($F$1,FEB!$E$1:$AJ$1,0))=$B$1,ROW(FEB!$J$2:$AI$216)-ROW(FEB!$J$2)+1),ROWS(C$3:C62))),\"\")","v":"MOHAMMED 188"},{"$f":"IFERROR(INDEX(FEB!D$2:D$216,SMALL(IF(INDEX(FEB!$E$2:$AF$216,,MATCH($F$1,FEB!$E$1:$AJ$1,0))=$B$1,ROW(FEB!$J$2:$AI$216)-ROW(FEB!$J$2)+1),ROWS(D$3:D62))),\"\")","v":"Agent"}]
[null,{"$f":"IFERROR(INDEX(FEB!B$2:B$216,SMALL(IF(INDEX(FEB!$E$2:$AF$216,,MATCH($F$1,FEB!$E$1:$AJ$1,0))=$B$1,ROW(FEB!$J$2:$AI$216)-ROW(FEB!$J$2)+1),ROWS(B$3:B63))),\"\")","v":1405688},{"$f":"IFERROR(INDEX(FEB!C$2:C$216,SMALL(IF(INDEX(FEB!$E$2:$AF$216,,MATCH($F$1,FEB!$E$1:$AJ$1,0))=$B$1,ROW(FEB!$J$2:$AI$216)-ROW(FEB!$J$2)+1),ROWS(C$3:C63))),\"\")","v":"MOHAMMED 189"},{"$f":"IFERROR(INDEX(FEB!D$2:D$216,SMALL(IF(INDEX(FEB!$E$2:$AF$216,,MATCH($F$1,FEB!$E$1:$AJ$1,0))=$B$1,ROW(FEB!$J$2:$AI$216)-ROW(FEB!$J$2)+1),ROWS(D$3:D63))),\"\")","v":"Agent"}]
[null,{"$f":"IFERROR(INDEX(FEB!B$2:B$216,SMALL(IF(INDEX(FEB!$E$2:$AF$216,,MATCH($F$1,FEB!$E$1:$AJ$1,0))=$B$1,ROW(FEB!$J$2:$AI$216)-ROW(FEB!$J$2)+1),ROWS(B$3:B64))),\"\")","v":""},{"$f":"IFERROR(INDEX(FEB!C$2:C$216,SMALL(IF(INDEX(FEB!$E$2:$AF$216,,MATCH($F$1,FEB!$E$1:$AJ$1,0))=$B$1,ROW(FEB!$J$2:$AI$216)-ROW(FEB!$J$2)+1),ROWS(C$3:C64))),\"\")","v":""},{"$f":"IFERROR(INDEX(FEB!D$2:D$216,SMALL(IF(INDEX(FEB!$E$2:$AF$216,,MATCH($F$1,FEB!$E$1:$AJ$1,0))=$B$1,ROW(FEB!$J$2:$AI$216)-ROW(FEB!$J$2)+1),ROWS(D$3:D64))),\"\")","v":""}]
[null,{"$f":"IFERROR(INDEX(FEB!B$2:B$216,SMALL(IF(INDEX(FEB!$E$2:$AF$216,,MATCH($F$1,FEB!$E$1:$AJ$1,0))=$B$1,ROW(FEB!$J$2:$AI$216)-ROW(FEB!$J$2)+1),ROWS(B$3:B65))),\"\")","v":""},{"$f":"IFERROR(INDEX(FEB!C$2:C$216,SMALL(IF(INDEX(FEB!$E$2:$AF$216,,MATCH($F$1,FEB!$E$1:$AJ$1,0))=$B$1,ROW(FEB!$J$2:$AI$216)-ROW(FEB!$J$2)+1),ROWS(C$3:C65))),\"\")","v":""},{"$f":"IFERROR(INDEX(FEB!D$2:D$216,SMALL(IF(INDEX(FEB!$E$2:$AF$216,,MATCH($F$1,FEB!$E$1:$AJ$1,0))=$B$1,ROW(FEB!$J$2:$AI$216)-ROW(FEB!$J$2)+1),ROWS(D$3:D65))),\"\")","v":""}]
[null,{"$f":"IFERROR(INDEX(FEB!B$2:B$216,SMALL(IF(INDEX(FEB!$E$2:$AF$216,,MATCH($F$1,FEB!$E$1:$AJ$1,0))=$B$1,ROW(FEB!$J$2:$AI$216)-ROW(FEB!$J$2)+1),ROWS(B$3:B66))),\"\")","v":""},{"$f":"IFERROR(INDEX(FEB!C$2:C$216,SMALL(IF(INDEX(FEB!$E$2:$AF$216,,MATCH($F$1,FEB!$E$1:$AJ$1,0))=$B$1,ROW(FEB!$J$2:$AI$216)-ROW(FEB!$J$2)+1),ROWS(C$3:C66))),\"\")","v":""},{"$f":"IFERROR(INDEX(FEB!D$2:D$216,SMALL(IF(INDEX(FEB!$E$2:$AF$216,,MATCH($F$1,FEB!$E$1:$AJ$1,0))=$B$1,ROW(FEB!$J$2:$AI$216)-ROW(FEB!$J$2)+1),ROWS(D$3:D66))),\"\")","v":""}]
[null,{"$f":"IFERROR(INDEX(FEB!B$2:B$216,SMALL(IF(INDEX(FEB!$E$2:$AF$216,,MATCH($F$1,FEB!$E$1:$AJ$1,0))=$B$1,ROW(FEB!$J$2:$AI$216)-ROW(FEB!$J$2)+1),ROWS(B$3:B67))),\"\")","v":""},{"$f":"IFERROR(INDEX(FEB!C$2:C$216,SMALL(IF(INDEX(FEB!$E$2:$AF$216,,MATCH($F$1,FEB!$E$1:$AJ$1,0))=$B$1,ROW(FEB!$J$2:$AI$216)-ROW(FEB!$J$2)+1),ROWS(C$3:C67))),\"\")","v":""},{"$f":"IFERROR(INDEX(FEB!D$2:D$216,SMALL(IF(INDEX(FEB!$E$2:$AF$216,,MATCH($F$1,FEB!$E$1:$AJ$1,0))=$B$1,ROW(FEB!$J$2:$AI$216)-ROW(FEB!$J$2)+1),ROWS(D$3:D67))),\"\")","v":""}]
[null,{"$f":"IFERROR(INDEX(FEB!B$2:B$216,SMALL(IF(INDEX(FEB!$E$2:$AF$216,,MATCH($F$1,FEB!$E$1:$AJ$1,0))=$B$1,ROW(FEB!$J$2:$AI$216)-ROW(FEB!$J$2)+1),ROWS(B$3:B68))),\"\")","v":""},{"$f":"IFERROR(INDEX(FEB!C$2:C$216,SMALL(IF(INDEX(FEB!$E$2:$AF$216,,MATCH($F$1,FEB!$E$1:$AJ$1,0))=$B$1,ROW(FEB!$J$2:$AI$216)-ROW(FEB!$J$2)+1),ROWS(C$3:C68))),\"\")","v":""},{"$f":"IFERROR(INDEX(FEB!D$2:D$216,SMALL(IF(INDEX(FEB!$E$2:$AF$216,,MATCH($F$1,FEB!$E$1:$AJ$1,0))=$B$1,ROW(FEB!$J$2:$AI$216)-ROW(FEB!$J$2)+1),ROWS(D$3:D68))),\"\")","v":""}]
[null,{"$f":"IFERROR(INDEX(FEB!B$2:B$216,SMALL(IF(INDEX(FEB!$E$2:$AF$216,,MATCH($F$1,FEB!$E$1:$AJ$1,0))=$B$1,ROW(FEB!$J$2:$AI$216)-ROW(FEB!$J$2)+1),ROWS(B$3:B69))),\"\")","v":""},{"$f":"IFERROR(INDEX(FEB!C$2:C$216,SMALL(IF(INDEX(FEB!$E$2:$AF$216,,MATCH($F$1,FEB!$E$1:$AJ$1,0))=$B$1,ROW(FEB!$J$2:$AI$216)-ROW(FEB!$J$2)+1),ROWS(C$3:C69))),\"\")","v":""},{"$f":"IFERROR(INDEX(FEB!D$2:D$216,SMALL(IF(INDEX(FEB!$E$2:$AF$216,,MATCH($F$1,FEB!$E$1:$AJ$1,0))=$B$1,ROW(FEB!$J$2:$AI$216)-ROW(FEB!$J$2)+1),ROWS(D$3:D69))),\"\")","v":""}]
[null,{"$f":"IFERROR(INDEX(FEB!B$2:B$216,SMALL(IF(INDEX(FEB!$E$2:$AF$216,,MATCH($F$1,FEB!$E$1:$AJ$1,0))=$B$1,ROW(FEB!$J$2:$AI$216)-ROW(FEB!$J$2)+1),ROWS(B$3:B70))),\"\")","v":""},{"$f":"IFERROR(INDEX(FEB!C$2:C$216,SMALL(IF(INDEX(FEB!$E$2:$AF$216,,MATCH($F$1,FEB!$E$1:$AJ$1,0))=$B$1,ROW(FEB!$J$2:$AI$216)-ROW(FEB!$J$2)+1),ROWS(C$3:C70))),\"\")","v":""},{"$f":"IFERROR(INDEX(FEB!D$2:D$216,SMALL(IF(INDEX(FEB!$E$2:$AF$216,,MATCH($F$1,FEB!$E$1:$AJ$1,0))=$B$1,ROW(FEB!$J$2:$AI$216)-ROW(FEB!$J$2)+1),ROWS(D$3:D70))),\"\")","v":""}]
[null,{"$f":"IFERROR(INDEX(FEB!B$2:B$216,SMALL(IF(INDEX(FEB!$E$2:$AF$216,,MATCH($F$1,FEB!$E$1:$AJ$1,0))=$B$1,ROW(FEB!$J$2:$AI$216)-ROW(FEB!$J$2)+1),ROWS(B$3:B71))),\"\")","v":""},{"$f":"IFERROR(INDEX(FEB!C$2:C$216,SMALL(IF(INDEX(FEB!$E$2:$AF$216,,MATCH($F$1,FEB!$E$1:$AJ$1,0))=$B$1,ROW(FEB!$J$2:$AI$216)-ROW(FEB!$J$2)+1),ROWS(C$3:C71))),\"\")","v":""},{"$f":"IFERROR(INDEX(FEB!D$2:D$216,SMALL(IF(INDEX(FEB!$E$2:$AF$216,,MATCH($F$1,FEB!$E$1:$AJ$1,0))=$B$1,ROW(FEB!$J$2:$AI$216)-ROW(FEB!$J$2)+1),ROWS(D$3:D71))),\"\")","v":""}]
[null,{"$f":"IFERROR(INDEX(FEB!B$2:B$216,SMALL(IF(INDEX(FEB!$E$2:$AF$216,,MATCH($F$1,FEB!$E$1:$AJ$1,0))=$B$1,ROW(FEB!$J$2:$AI$216)-ROW(FEB!$J$2)+1),ROWS(B$3:B72))),\"\")","v":""},{"$f":"IFERROR(INDEX(FEB!C$2:C$216,SMALL(IF(INDEX(FEB!$E$2:$AF$216,,MATCH($F$1,FEB!$E$1:$AJ$1,0))=$B$1,ROW(FEB!$J$2:$AI$216)-ROW(FEB!$J$2)+1),ROWS(C$3:C72))),\"\")","v":""},{"$f":"IFERROR(INDEX(FEB!D$2:D$216,SMALL(IF(INDEX(FEB!$E$2:$AF$216,,MATCH($F$1,FEB!$E$1:$AJ$1,0))=$B$1,ROW(FEB!$J$2:$AI$216)-ROW(FEB!$J$2)+1),ROWS(D$3:D72))),\"\")","v":""}]
[null,{"$f":"IFERROR(INDEX(FEB!B$2:B$216,SMALL(IF(INDEX(FEB!$E$2:$AF$216,,MATCH($F$1,FEB!$E$1:$AJ$1,0))=$B$1,ROW(FEB!$J$2:$AI$216)-ROW(FEB!$J$2)+1),ROWS(B$3:B73))),\"\")","v":""},{"$f":"IFERROR(INDEX(FEB!C$2:C$216,SMALL(IF(INDEX(FEB!$E$2:$AF$216,,MATCH($F$1,FEB!$E$1:$AJ$1,0))=$B$1,ROW(FEB!$J$2:$AI$216)-ROW(FEB!$J$2)+1),ROWS(C$3:C73))),\"\")","v":""},{"$f":"IFERROR(INDEX(FEB!D$2:D$216,SMALL(IF(INDEX(FEB!$E$2:$AF$216,,MATCH($F$1,FEB!$E$1:$AJ$1,0))=$B$1,ROW(FEB!$J$2:$AI$216)-ROW(FEB!$J$2)+1),ROWS(D$3:D73))),\"\")","v":""}]
[null,{"$f":"IFERROR(INDEX(FEB!B$2:B$216,SMALL(IF(INDEX(FEB!$E$2:$AF$216,,MATCH($F$1,FEB!$E$1:$AJ$1,0))=$B$1,ROW(FEB!$J$2:$AI$216)-ROW(FEB!$J$2)+1),ROWS(B$3:B74))),\"\")","v":""},{"$f":"IFERROR(INDEX(FEB!C$2:C$216,SMALL(IF(INDEX(FEB!$E$2:$AF$216,,MATCH($F$1,FEB!$E$1:$AJ$1,0))=$B$1,ROW(FEB!$J$2:$AI$216)-ROW(FEB!$J$2)+1),ROWS(C$3:C74))),\"\")","v":""},{"$f":"IFERROR(INDEX(FEB!D$2:D$216,SMALL(IF(INDEX(FEB!$E$2:$AF$216,,MATCH($F$1,FEB!$E$1:$AJ$1,0))=$B$1,ROW(FEB!$J$2:$AI$216)-ROW(FEB!$J$2)+1),ROWS(D$3:D74))),\"\")","v":""}]
[null,{"$f":"IFERROR(INDEX(FEB!B$2:B$216,SMALL(IF(INDEX(FEB!$E$2:$AF$216,,MATCH($F$1,FEB!$E$1:$AJ$1,0))=$B$1,ROW(FEB!$J$2:$AI$216)-ROW(FEB!$J$2)+1),ROWS(B$3:B75))),\"\")","v":""},{"$f":"IFERROR(INDEX(FEB!C$2:C$216,SMALL(IF(INDEX(FEB!$E$2:$AF$216,,MATCH($F$1,FEB!$E$1:$AJ$1,0))=$B$1,ROW(FEB!$J$2:$AI$216)-ROW(FEB!$J$2)+1),ROWS(C$3:C75))),\"\")","v":""},{"$f":"IFERROR(INDEX(FEB!D$2:D$216,SMALL(IF(INDEX(FEB!$E$2:$AF$216,,MATCH($F$1,FEB!$E$1:$AJ$1,0))=$B$1,ROW(FEB!$J$2:$AI$216)-ROW(FEB!$J$2)+1),ROWS(D$3:D75))),\"\")","v":""}]
[null,{"$f":"IFERROR(INDEX(FEB!B$2:B$216,SMALL(IF(INDEX(FEB!$E$2:$AF$216,,MATCH($F$1,FEB!$E$1:$AJ$1,0))=$B$1,ROW(FEB!$J$2:$AI$216)-ROW(FEB!$J$2)+1),ROWS(B$3:B76))),\"\")","v":""},{"$f":"IFERROR(INDEX(FEB!C$2:C$216,SMALL(IF(INDEX(FEB!$E$2:$AF$216,,MATCH($F$1,FEB!$E$1:$AJ$1,0))=$B$1,ROW(FEB!$J$2:$AI$216)-ROW(FEB!$J$2)+1),ROWS(C$3:C76))),\"\")","v":""},{"$f":"IFERROR(INDEX(FEB!D$2:D$216,SMALL(IF(INDEX(FEB!$E$2:$AF$216,,MATCH($F$1,FEB!$E$1:$AJ$1,0))=$B$1,ROW(FEB!$J$2:$AI$216)-ROW(FEB!$J$2)+1),ROWS(D$3:D76))),\"\")","v":""}]
[null,{"$f":"IFERROR(INDEX(FEB!B$2:B$216,SMALL(IF(INDEX(FEB!$E$2:$AF$216,,MATCH($F$1,FEB!$E$1:$AJ$1,0))=$B$1,ROW(FEB!$J$2:$AI$216)-ROW(FEB!$J$2)+1),ROWS(B$3:B77))),\"\")","v":""},{"$f":"IFERROR(INDEX(FEB!C$2:C$216,SMALL(IF(INDEX(FEB!$E$2:$AF$216,,MATCH($F$1,FEB!$E$1:$AJ$1,0))=$B$1,ROW(FEB!$J$2:$AI$216)-ROW(FEB!$J$2)+1),ROWS(C$3:C77))),\"\")","v":""},{"$f":"IFERROR(INDEX(FEB!D$2:D$216,SMALL(IF(INDEX(FEB!$E$2:$AF$216,,MATCH($F$1,FEB!$E$1:$AJ$1,0))=$B$1,ROW(FEB!$J$2:$AI$216)-ROW(FEB!$J$2)+1),ROWS(D$3:D77))),\"\")","v":""}]
[null,{"$f":"IFERROR(INDEX(FEB!B$2:B$216,SMALL(IF(INDEX(FEB!$E$2:$AF$216,,MATCH($F$1,FEB!$E$1:$AJ$1,0))=$B$1,ROW(FEB!$J$2:$AI$216)-ROW(FEB!$J$2)+1),ROWS(B$3:B78))),\"\")","v":""},{"$f":"IFERROR(INDEX(FEB!C$2:C$216,SMALL(IF(INDEX(FEB!$E$2:$AF$216,,MATCH($F$1,FEB!$E$1:$AJ$1,0))=$B$1,ROW(FEB!$J$2:$AI$216)-ROW(FEB!$J$2)+1),ROWS(C$3:C78))),\"\")","v":""},{"$f":"IFERROR(INDEX(FEB!D$2:D$216,SMALL(IF(INDEX(FEB!$E$2:$AF$216,,MATCH($F$1,FEB!$E$1:$AJ$1,0))=$B$1,ROW(FEB!$J$2:$AI$216)-ROW(FEB!$J$2)+1),ROWS(D$3:D78))),\"\")","v":""}]
[null,{"$f":"IFERROR(INDEX(FEB!B$2:B$216,SMALL(IF(INDEX(FEB!$E$2:$AF$216,,MATCH($F$1,FEB!$E$1:$AJ$1,0))=$B$1,ROW(FEB!$J$2:$AI$216)-ROW(FEB!$J$2)+1),ROWS(B$3:B79))),\"\")","v":""},{"$f":"IFERROR(INDEX(FEB!C$2:C$216,SMALL(IF(INDEX(FEB!$E$2:$AF$216,,MATCH($F$1,FEB!$E$1:$AJ$1,0))=$B$1,ROW(FEB!$J$2:$AI$216)-ROW(FEB!$J$2)+1),ROWS(C$3:C79))),\"\")","v":""},{"$f":"IFERROR(INDEX(FEB!D$2:D$216,SMALL(IF(INDEX(FEB!$E$2:$AF$216,,MATCH($F$1,FEB!$E$1:$AJ$1,0))=$B$1,ROW(FEB!$J$2:$AI$216)-ROW(FEB!$J$2)+1),ROWS(D$3:D79))),\"\")","v":""}]
[null,{"$f":"IFERROR(INDEX(FEB!B$2:B$216,SMALL(IF(INDEX(FEB!$E$2:$AF$216,,MATCH($F$1,FEB!$E$1:$AJ$1,0))=$B$1,ROW(FEB!$J$2:$AI$216)-ROW(FEB!$J$2)+1),ROWS(B$3:B80))),\"\")","v":""},{"$f":"IFERROR(INDEX(FEB!C$2:C$216,SMALL(IF(INDEX(FEB!$E$2:$AF$216,,MATCH($F$1,FEB!$E$1:$AJ$1,0))=$B$1,ROW(FEB!$J$2:$AI$216)-ROW(FEB!$J$2)+1),ROWS(C$3:C80))),\"\")","v":""},{"$f":"IFERROR(INDEX(FEB!D$2:D$216,SMALL(IF(INDEX(FEB!$E$2:$AF$216,,MATCH($F$1,FEB!$E$1:$AJ$1,0))=$B$1,ROW(FEB!$J$2:$AI$216)-ROW(FEB!$J$2)+1),ROWS(D$3:D80))),\"\")","v":""}]
[null,{"$f":"IFERROR(INDEX(FEB!B$2:B$216,SMALL(IF(INDEX(FEB!$E$2:$AF$216,,MATCH($F$1,FEB!$E$1:$AJ$1,0))=$B$1,ROW(FEB!$J$2:$AI$216)-ROW(FEB!$J$2)+1),ROWS(B$3:B81))),\"\")","v":""},{"$f":"IFERROR(INDEX(FEB!C$2:C$216,SMALL(IF(INDEX(FEB!$E$2:$AF$216,,MATCH($F$1,FEB!$E$1:$AJ$1,0))=$B$1,ROW(FEB!$J$2:$AI$216)-ROW(FEB!$J$2)+1),ROWS(C$3:C81))),\"\")","v":""},{"$f":"IFERROR(INDEX(FEB!D$2:D$216,SMALL(IF(INDEX(FEB!$E$2:$AF$216,,MATCH($F$1,FEB!$E$1:$AJ$1,0))=$B$1,ROW(FEB!$J$2:$AI$216)-ROW(FEB!$J$2)+1),ROWS(D$3:D81))),\"\")","v":""}]
[null,{"$f":"IFERROR(INDEX(FEB!B$2:B$216,SMALL(IF(INDEX(FEB!$E$2:$AF$216,,MATCH($F$1,FEB!$E$1:$AJ$1,0))=$B$1,ROW(FEB!$J$2:$AI$216)-ROW(FEB!$J$2)+1),ROWS(B$3:B82))),\"\")","v":""},{"$f":"IFERROR(INDEX(FEB!C$2:C$216,SMALL(IF(INDEX(FEB!$E$2:$AF$216,,MATCH($F$1,FEB!$E$1:$AJ$1,0))=$B$1,ROW(FEB!$J$2:$AI$216)-ROW(FEB!$J$2)+1),ROWS(C$3:C82))),\"\")","v":""},{"$f":"IFERROR(INDEX(FEB!D$2:D$216,SMALL(IF(INDEX(FEB!$E$2:$AF$216,,MATCH($F$1,FEB!$E$1:$AJ$1,0))=$B$1,ROW(FEB!$J$2:$AI$216)-ROW(FEB!$J$2)+1),ROWS(D$3:D82))),\"\")","v":""}]
[null,{"$f":"IFERROR(INDEX(FEB!B$2:B$216,SMALL(IF(INDEX(FEB!$E$2:$AF$216,,MATCH($F$1,FEB!$E$1:$AJ$1,0))=$B$1,ROW(FEB!$J$2:$AI$216)-ROW(FEB!$J$2)+1),ROWS(B$3:B83))),\"\")","v":""},{"$f":"IFERROR(INDEX(FEB!C$2:C$216,SMALL(IF(INDEX(FEB!$E$2:$AF$216,,MATCH($F$1,FEB!$E$1:$AJ$1,0))=$B$1,ROW(FEB!$J$2:$AI$216)-ROW(FEB!$J$2)+1),ROWS(C$3:C83))),\"\")","v":""},{"$f":"IFERROR(INDEX(FEB!D$2:D$216,SMALL(IF(INDEX(FEB!$E$2:$AF$216,,MATCH($F$1,FEB!$E$1:$AJ$1,0))=$B$1,ROW(FEB!$J$2:$AI$216)-ROW(FEB!$J$2)+1),ROWS(D$3:D83))),\"\")","v":""}]
[null,{"$f":"IFERROR(INDEX(FEB!B$2:B$216,SMALL(IF(INDEX(FEB!$E$2:$AF$216,,MATCH($F$1,FEB!$E$1:$AJ$1,0))=$B$1,ROW(FEB!$J$2:$AI$216)-ROW(FEB!$J$2)+1),ROWS(B$3:B84))),\"\")","v":""},{"$f":"IFERROR(INDEX(FEB!C$2:C$216,SMALL(IF(INDEX(FEB!$E$2:$AF$216,,MATCH($F$1,FEB!$E$1:$AJ$1,0))=$B$1,ROW(FEB!$J$2:$AI$216)-ROW(FEB!$J$2)+1),ROWS(C$3:C84))),\"\")","v":""},{"$f":"IFERROR(INDEX(FEB!D$2:D$216,SMALL(IF(INDEX(FEB!$E$2:$AF$216,,MATCH($F$1,FEB!$E$1:$AJ$1,0))=$B$1,ROW(FEB!$J$2:$AI$216)-ROW(FEB!$J$2)+1),ROWS(D$3:D84))),\"\")","v":""}]
[null,{"$f":"IFERROR(INDEX(FEB!B$2:B$216,SMALL(IF(INDEX(FEB!$E$2:$AF$216,,MATCH($F$1,FEB!$E$1:$AJ$1,0))=$B$1,ROW(FEB!$J$2:$AI$216)-ROW(FEB!$J$2)+1),ROWS(B$3:B85))),\"\")","v":""},{"$f":"IFERROR(INDEX(FEB!C$2:C$216,SMALL(IF(INDEX(FEB!$E$2:$AF$216,,MATCH($F$1,FEB!$E$1:$AJ$1,0))=$B$1,ROW(FEB!$J$2:$AI$216)-ROW(FEB!$J$2)+1),ROWS(C$3:C85))),\"\")","v":""},{"$f":"IFERROR(INDEX(FEB!D$2:D$216,SMALL(IF(INDEX(FEB!$E$2:$AF$216,,MATCH($F$1,FEB!$E$1:$AJ$1,0))=$B$1,ROW(FEB!$J$2:$AI$216)-ROW(FEB!$J$2)+1),ROWS(D$3:D85))),\"\")","v":""}]
[null,{"$f":"IFERROR(INDEX(FEB!B$2:B$216,SMALL(IF(INDEX(FEB!$E$2:$AF$216,,MATCH($F$1,FEB!$E$1:$AJ$1,0))=$B$1,ROW(FEB!$J$2:$AI$216)-ROW(FEB!$J$2)+1),ROWS(B$3:B86))),\"\")","v":""},{"$f":"IFERROR(INDEX(FEB!C$2:C$216,SMALL(IF(INDEX(FEB!$E$2:$AF$216,,MATCH($F$1,FEB!$E$1:$AJ$1,0))=$B$1,ROW(FEB!$J$2:$AI$216)-ROW(FEB!$J$2)+1),ROWS(C$3:C86))),\"\")","v":""},{"$f":"IFERROR(INDEX(FEB!D$2:D$216,SMALL(IF(INDEX(FEB!$E$2:$AF$216,,MATCH($F$1,FEB!$E$1:$AJ$1,0))=$B$1,ROW(FEB!$J$2:$AI$216)-ROW(FEB!$J$2)+1),ROWS(D$3:D86))),\"\")","v":""}]
[null,{"$f":"IFERROR(INDEX(FEB!B$2:B$216,SMALL(IF(INDEX(FEB!$E$2:$AF$216,,MATCH($F$1,FEB!$E$1:$AJ$1,0))=$B$1,ROW(FEB!$J$2:$AI$216)-ROW(FEB!$J$2)+1),ROWS(B$3:B87))),\"\")","v":""},{"$f":"IFERROR(INDEX(FEB!C$2:C$216,SMALL(IF(INDEX(FEB!$E$2:$AF$216,,MATCH($F$1,FEB!$E$1:$AJ$1,0))=$B$1,ROW(FEB!$J$2:$AI$216)-ROW(FEB!$J$2)+1),ROWS(C$3:C87))),\"\")","v":""},{"$f":"IFERROR(INDEX(FEB!D$2:D$216,SMALL(IF(INDEX(FEB!$E$2:$AF$216,,MATCH($F$1,FEB!$E$1:$AJ$1,0))=$B$1,ROW(FEB!$J$2:$AI$216)-ROW(FEB!$J$2)+1),ROWS(D$3:D87))),\"\")","v":""}]
[null,{"$f":"IFERROR(INDEX(FEB!B$2:B$216,SMALL(IF(INDEX(FEB!$E$2:$AF$216,,MATCH($F$1,FEB!$E$1:$AJ$1,0))=$B$1,ROW(FEB!$J$2:$AI$216)-ROW(FEB!$J$2)+1),ROWS(B$3:B88))),\"\")","v":""},{"$f":"IFERROR(INDEX(FEB!C$2:C$216,SMALL(IF(INDEX(FEB!$E$2:$AF$216,,MATCH($F$1,FEB!$E$1:$AJ$1,0))=$B$1,ROW(FEB!$J$2:$AI$216)-ROW(FEB!$J$2)+1),ROWS(C$3:C88))),\"\")","v":""},{"$f":"IFERROR(INDEX(FEB!D$2:D$216,SMALL(IF(INDEX(FEB!$E$2:$AF$216,,MATCH($F$1,FEB!$E$1:$AJ$1,0))=$B$1,ROW(FEB!$J$2:$AI$216)-ROW(FEB!$J$2)+1),ROWS(D$3:D88))),\"\")","v":""}]
[null,{"$f":"IFERROR(INDEX(FEB!B$2:B$216,SMALL(IF(INDEX(FEB!$E$2:$AF$216,,MATCH($F$1,FEB!$E$1:$AJ$1,0))=$B$1,ROW(FEB!$J$2:$AI$216)-ROW(FEB!$J$2)+1),ROWS(B$3:B89))),\"\")","v":""},{"$f":"IFERROR(INDEX(FEB!C$2:C$216,SMALL(IF(INDEX(FEB!$E$2:$AF$216,,MATCH($F$1,FEB!$E$1:$AJ$1,0))=$B$1,ROW(FEB!$J$2:$AI$216)-ROW(FEB!$J$2)+1),ROWS(C$3:C89))),\"\")","v":""},{"$f":"IFERROR(INDEX(FEB!D$2:D$216,SMALL(IF(INDEX(FEB!$E$2:$AF$216,,MATCH($F$1,FEB!$E$1:$AJ$1,0))=$B$1,ROW(FEB!$J$2:$AI$216)-ROW(FEB!$J$2)+1),ROWS(D$3:D89))),\"\")","v":""}]
[null,{"$f":"IFERROR(INDEX(FEB!B$2:B$216,SMALL(IF(INDEX(FEB!$E$2:$AF$216,,MATCH($F$1,FEB!$E$1:$AJ$1,0))=$B$1,ROW(FEB!$J$2:$AI$216)-ROW(FEB!$J$2)+1),ROWS(B$3:B90))),\"\")","v":""},{"$f":"IFERROR(INDEX(FEB!C$2:C$216,SMALL(IF(INDEX(FEB!$E$2:$AF$216,,MATCH($F$1,FEB!$E$1:$AJ$1,0))=$B$1,ROW(FEB!$J$2:$AI$216)-ROW(FEB!$J$2)+1),ROWS(C$3:C90))),\"\")","v":""},{"$f":"IFERROR(INDEX(FEB!D$2:D$216,SMALL(IF(INDEX(FEB!$E$2:$AF$216,,MATCH($F$1,FEB!$E$1:$AJ$1,0))=$B$1,ROW(FEB!$J$2:$AI$216)-ROW(FEB!$J$2)+1),ROWS(D$3:D90))),\"\")","v":""}]
[null,{"$f":"IFERROR(INDEX(FEB!B$2:B$216,SMALL(IF(INDEX(FEB!$E$2:$AF$216,,MATCH($F$1,FEB!$E$1:$AJ$1,0))=$B$1,ROW(FEB!$J$2:$AI$216)-ROW(FEB!$J$2)+1),ROWS(B$3:B91))),\"\")","v":""},{"$f":"IFERROR(INDEX(FEB!C$2:C$216,SMALL(IF(INDEX(FEB!$E$2:$AF$216,,MATCH($F$1,FEB!$E$1:$AJ$1,0))=$B$1,ROW(FEB!$J$2:$AI$216)-ROW(FEB!$J$2)+1),ROWS(C$3:C91))),\"\")","v":""},{"$f":"IFERROR(INDEX(FEB!D$2:D$216,SMALL(IF(INDEX(FEB!$E$2:$AF$216,,MATCH($F$1,FEB!$E$1:$AJ$1,0))=$B$1,ROW(FEB!$J$2:$AI$216)-ROW(FEB!$J$2)+1),ROWS(D$3:D91))),\"\")","v":""}]
[null,{"$f":"IFERROR(INDEX(FEB!B$2:B$216,SMALL(IF(INDEX(FEB!$E$2:$AF$216,,MATCH($F$1,FEB!$E$1:$AJ$1,0))=$B$1,ROW(FEB!$J$2:$AI$216)-ROW(FEB!$J$2)+1),ROWS(B$3:B92))),\"\")","v":""},{"$f":"IFERROR(INDEX(FEB!C$2:C$216,SMALL(IF(INDEX(FEB!$E$2:$AF$216,,MATCH($F$1,FEB!$E$1:$AJ$1,0))=$B$1,ROW(FEB!$J$2:$AI$216)-ROW(FEB!$J$2)+1),ROWS(C$3:C92))),\"\")","v":""},{"$f":"IFERROR(INDEX(FEB!D$2:D$216,SMALL(IF(INDEX(FEB!$E$2:$AF$216,,MATCH($F$1,FEB!$E$1:$AJ$1,0))=$B$1,ROW(FEB!$J$2:$AI$216)-ROW(FEB!$J$2)+1),ROWS(D$3:D92))),\"\")","v":""}]
[null,{"$f":"IFERROR(INDEX(FEB!B$2:B$216,SMALL(IF(INDEX(FEB!$E$2:$AF$216,,MATCH($F$1,FEB!$E$1:$AJ$1,0))=$B$1,ROW(FEB!$J$2:$AI$216)-ROW(FEB!$J$2)+1),ROWS(B$3:B93))),\"\")","v":""},{"$f":"IFERROR(INDEX(FEB!C$2:C$216,SMALL(IF(INDEX(FEB!$E$2:$AF$216,,MATCH($F$1,FEB!$E$1:$AJ$1,0))=$B$1,ROW(FEB!$J$2:$AI$216)-ROW(FEB!$J$2)+1),ROWS(C$3:C93))),\"\")","v":""},{"$f":"IFERROR(INDEX(FEB!D$2:D$216,SMALL(IF(INDEX(FEB!$E$2:$AF$216,,MATCH($F$1,FEB!$E$1:$AJ$1,0))=$B$1,ROW(FEB!$J$2:$AI$216)-ROW(FEB!$J$2)+1),ROWS(D$3:D93))),\"\")","v":""}]
[null,{"$f":"IFERROR(INDEX(FEB!B$2:B$216,SMALL(IF(INDEX(FEB!$E$2:$AF$216,,MATCH($F$1,FEB!$E$1:$AJ$1,0))=$B$1,ROW(FEB!$J$2:$AI$216)-ROW(FEB!$J$2)+1),ROWS(B$3:B94))),\"\")","v":""},{"$f":"IFERROR(INDEX(FEB!C$2:C$216,SMALL(IF(INDEX(FEB!$E$2:$AF$216,,MATCH($F$1,FEB!$E$1:$AJ$1,0))=$B$1,ROW(FEB!$J$2:$AI$216)-ROW(FEB!$J$2)+1),ROWS(C$3:C94))),\"\")","v":""},{"$f":"IFERROR(INDEX(FEB!D$2:D$216,SMALL(IF(INDEX(FEB!$E$2:$AF$216,,MATCH($F$1,FEB!$E$1:$AJ$1,0))=$B$1,ROW(FEB!$J$2:$AI$216)-ROW(FEB!$J$2)+1),ROWS(D$3:D94))),\"\")","v":""}]
[null,{"$f":"IFERROR(INDEX(FEB!B$2:B$216,SMALL(IF(INDEX(FEB!$E$2:$AF$216,,MATCH($F$1,FEB!$E$1:$AJ$1,0))=$B$1,ROW(FEB!$J$2:$AI$216)-ROW(FEB!$J$2)+1),ROWS(B$3:B95))),\"\")","v":""},{"$f":"IFERROR(INDEX(FEB!C$2:C$216,SMALL(IF(INDEX(FEB!$E$2:$AF$216,,MATCH($F$1,FEB!$E$1:$AJ$1,0))=$B$1,ROW(FEB!$J$2:$AI$216)-ROW(FEB!$J$2)+1),ROWS(C$3:C95))),\"\")","v":""},{"$f":"IFERROR(INDEX(FEB!D$2:D$216,SMALL(IF(INDEX(FEB!$E$2:$AF$216,,MATCH($F$1,FEB!$E$1:$AJ$1,0))=$B$1,ROW(FEB!$J$2:$AI$216)-ROW(FEB!$J$2)+1),ROWS(D$3:D95))),\"\")","v":""}]
[null,{"$f":"IFERROR(INDEX(FEB!B$2:B$216,SMALL(IF(INDEX(FEB!$E$2:$AF$216,,MATCH($F$1,FEB!$E$1:$AJ$1,0))=$B$1,ROW(FEB!$J$2:$AI$216)-ROW(FEB!$J$2)+1),ROWS(B$3:B96))),\"\")","v":""},{"$f":"IFERROR(INDEX(FEB!C$2:C$216,SMALL(IF(INDEX(FEB!$E$2:$AF$216,,MATCH($F$1,FEB!$E$1:$AJ$1,0))=$B$1,ROW(FEB!$J$2:$AI$216)-ROW(FEB!$J$2)+1),ROWS(C$3:C96))),\"\")","v":""},{"$f":"IFERROR(INDEX(FEB!D$2:D$216,SMALL(IF(INDEX(FEB!$E$2:$AF$216,,MATCH($F$1,FEB!$E$1:$AJ$1,0))=$B$1,ROW(FEB!$J$2:$AI$216)-ROW(FEB!$J$2)+1),ROWS(D$3:D96))),\"\")","v":""}]
[null,{"$f":"IFERROR(INDEX(FEB!B$2:B$216,SMALL(IF(INDEX(FEB!$E$2:$AF$216,,MATCH($F$1,FEB!$E$1:$AJ$1,0))=$B$1,ROW(FEB!$J$2:$AI$216)-ROW(FEB!$J$2)+1),ROWS(B$3:B97))),\"\")","v":""},{"$f":"IFERROR(INDEX(FEB!C$2:C$216,SMALL(IF(INDEX(FEB!$E$2:$AF$216,,MATCH($F$1,FEB!$E$1:$AJ$1,0))=$B$1,ROW(FEB!$J$2:$AI$216)-ROW(FEB!$J$2)+1),ROWS(C$3:C97))),\"\")","v":""},{"$f":"IFERROR(INDEX(FEB!D$2:D$216,SMALL(IF(INDEX(FEB!$E$2:$AF$216,,MATCH($F$1,FEB!$E$1:$AJ$1,0))=$B$1,ROW(FEB!$J$2:$AI$216)-ROW(FEB!$J$2)+1),ROWS(D$3:D97))),\"\")","v":""}]
[null,{"$f":"IFERROR(INDEX(FEB!B$2:B$216,SMALL(IF(INDEX(FEB!$E$2:$AF$216,,MATCH($F$1,FEB!$E$1:$AJ$1,0))=$B$1,ROW(FEB!$J$2:$AI$216)-ROW(FEB!$J$2)+1),ROWS(B$3:B98))),\"\")","v":""},{"$f":"IFERROR(INDEX(FEB!C$2:C$216,SMALL(IF(INDEX(FEB!$E$2:$AF$216,,MATCH($F$1,FEB!$E$1:$AJ$1,0))=$B$1,ROW(FEB!$J$2:$AI$216)-ROW(FEB!$J$2)+1),ROWS(C$3:C98))),\"\")","v":""},{"$f":"IFERROR(INDEX(FEB!D$2:D$216,SMALL(IF(INDEX(FEB!$E$2:$AF$216,,MATCH($F$1,FEB!$E$1:$AJ$1,0))=$B$1,ROW(FEB!$J$2:$AI$216)-ROW(FEB!$J$2)+1),ROWS(D$3:D98))),\"\")","v":""}]
[null,{"$f":"IFERROR(INDEX(FEB!B$2:B$216,SMALL(IF(INDEX(FEB!$E$2:$AF$216,,MATCH($F$1,FEB!$E$1:$AJ$1,0))=$B$1,ROW(FEB!$J$2:$AI$216)-ROW(FEB!$J$2)+1),ROWS(B$3:B99))),\"\")","v":""},{"$f":"IFERROR(INDEX(FEB!C$2:C$216,SMALL(IF(INDEX(FEB!$E$2:$AF$216,,MATCH($F$1,FEB!$E$1:$AJ$1,0))=$B$1,ROW(FEB!$J$2:$AI$216)-ROW(FEB!$J$2)+1),ROWS(C$3:C99))),\"\")","v":""},{"$f":"IFERROR(INDEX(FEB!D$2:D$216,SMALL(IF(INDEX(FEB!$E$2:$AF$216,,MATCH($F$1,FEB!$E$1:$AJ$1,0))=$B$1,ROW(FEB!$J$2:$AI$216)-ROW(FEB!$J$2)+1),ROWS(D$3:D99))),\"\")","v":""}]
[null,{"$f":"IFERROR(INDEX(FEB!B$2:B$216,SMALL(IF(INDEX(FEB!$E$2:$AF$216,,MATCH($F$1,FEB!$E$1:$AJ$1,0))=$B$1,ROW(FEB!$J$2:$AI$216)-ROW(FEB!$J$2)+1),ROWS(B$3:B100))),\"\")","v":""},{"$f":"IFERROR(INDEX(FEB!C$2:C$216,SMALL(IF(INDEX(FEB!$E$2:$AF$216,,MATCH($F$1,FEB!$E$1:$AJ$1,0))=$B$1,ROW(FEB!$J$2:$AI$216)-ROW(FEB!$J$2)+1),ROWS(C$3:C100))),\"\")","v":""},{"$f":"IFERROR(INDEX(FEB!D$2:D$216,SMALL(IF(INDEX(FEB!$E$2:$AF$216,,MATCH($F$1,FEB!$E$1:$AJ$1,0))=$B$1,ROW(FEB!$J$2:$AI$216)-ROW(FEB!$J$2)+1),ROWS(D$3:D100))),\"\")","v":""}]
[null,{"$f":"IFERROR(INDEX(FEB!B$2:B$216,SMALL(IF(INDEX(FEB!$E$2:$AF$216,,MATCH($F$1,FEB!$E$1:$AJ$1,0))=$B$1,ROW(FEB!$J$2:$AI$216)-ROW(FEB!$J$2)+1),ROWS(B$3:B101))),\"\")","v":""},{"$f":"IFERROR(INDEX(FEB!C$2:C$216,SMALL(IF(INDEX(FEB!$E$2:$AF$216,,MATCH($F$1,FEB!$E$1:$AJ$1,0))=$B$1,ROW(FEB!$J$2:$AI$216)-ROW(FEB!$J$2)+1),ROWS(C$3:C101))),\"\")","v":""},{"$f":"IFERROR(INDEX(FEB!D$2:D$216,SMALL(IF(INDEX(FEB!$E$2:$AF$216,,MATCH($F$1,FEB!$E$1:$AJ$1,0))=$B$1,ROW(FEB!$J$2:$AI$216)-ROW(FEB!$J$2)+1),ROWS(D$3:D101))),\"\")","v":""}]
[null,{"$f":"IFERROR(INDEX(FEB!B$2:B$216,SMALL(IF(INDEX(FEB!$E$2:$AF$216,,MATCH($F$1,FEB!$E$1:$AJ$1,0))=$B$1,ROW(FEB!$J$2:$AI$216)-ROW(FEB!$J$2)+1),ROWS(B$3:B102))),\"\")","v":""},{"$f":"IFERROR(INDEX(FEB!C$2:C$216,SMALL(IF(INDEX(FEB!$E$2:$AF$216,,MATCH($F$1,FEB!$E$1:$AJ$1,0))=$B$1,ROW(FEB!$J$2:$AI$216)-ROW(FEB!$J$2)+1),ROWS(C$3:C102))),\"\")","v":""},{"$f":"IFERROR(INDEX(FEB!D$2:D$216,SMALL(IF(INDEX(FEB!$E$2:$AF$216,,MATCH($F$1,FEB!$E$1:$AJ$1,0))=$B$1,ROW(FEB!$J$2:$AI$216)-ROW(FEB!$J$2)+1),ROWS(D$3:D102))),\"\")","v":""}]
[null,{"$f":"IFERROR(INDEX(FEB!B$2:B$216,SMALL(IF(INDEX(FEB!$E$2:$AF$216,,MATCH($F$1,FEB!$E$1:$AJ$1,0))=$B$1,ROW(FEB!$J$2:$AI$216)-ROW(FEB!$J$2)+1),ROWS(B$3:B103))),\"\")","v":""},{"$f":"IFERROR(INDEX(FEB!C$2:C$216,SMALL(IF(INDEX(FEB!$E$2:$AF$216,,MATCH($F$1,FEB!$E$1:$AJ$1,0))=$B$1,ROW(FEB!$J$2:$AI$216)-ROW(FEB!$J$2)+1),ROWS(C$3:C103))),\"\")","v":""},{"$f":"IFERROR(INDEX(FEB!D$2:D$216,SMALL(IF(INDEX(FEB!$E$2:$AF$216,,MATCH($F$1,FEB!$E$1:$AJ$1,0))=$B$1,ROW(FEB!$J$2:$AI$216)-ROW(FEB!$J$2)+1),ROWS(D$3:D103))),\"\")","v":""}]
[null,{"$f":"IFERROR(INDEX(FEB!B$2:B$216,SMALL(IF(INDEX(FEB!$E$2:$AF$216,,MATCH($F$1,FEB!$E$1:$AJ$1,0))=$B$1,ROW(FEB!$J$2:$AI$216)-ROW(FEB!$J$2)+1),ROWS(B$3:B104))),\"\")","v":""},{"$f":"IFERROR(INDEX(FEB!C$2:C$216,SMALL(IF(INDEX(FEB!$E$2:$AF$216,,MATCH($F$1,FEB!$E$1:$AJ$1,0))=$B$1,ROW(FEB!$J$2:$AI$216)-ROW(FEB!$J$2)+1),ROWS(C$3:C104))),\"\")","v":""},{"$f":"IFERROR(INDEX(FEB!D$2:D$216,SMALL(IF(INDEX(FEB!$E$2:$AF$216,,MATCH($F$1,FEB!$E$1:$AJ$1,0))=$B$1,ROW(FEB!$J$2:$AI$216)-ROW(FEB!$J$2)+1),ROWS(D$3:D104))),\"\")","v":""}]
[null,{"$f":"IFERROR(INDEX(FEB!B$2:B$216,SMALL(IF(INDEX(FEB!$E$2:$AF$216,,MATCH($F$1,FEB!$E$1:$AJ$1,0))=$B$1,ROW(FEB!$J$2:$AI$216)-ROW(FEB!$J$2)+1),ROWS(B$3:B105))),\"\")","v":""},{"$f":"IFERROR(INDEX(FEB!C$2:C$216,SMALL(IF(INDEX(FEB!$E$2:$AF$216,,MATCH($F$1,FEB!$E$1:$AJ$1,0))=$B$1,ROW(FEB!$J$2:$AI$216)-ROW(FEB!$J$2)+1),ROWS(C$3:C105))),\"\")","v":""},{"$f":"IFERROR(INDEX(FEB!D$2:D$216,SMALL(IF(INDEX(FEB!$E$2:$AF$216,,MATCH($F$1,FEB!$E$1:$AJ$1,0))=$B$1,ROW(FEB!$J$2:$AI$216)-ROW(FEB!$J$2)+1),ROWS(D$3:D105))),\"\")","v":""}]
[null,{"$f":"IFERROR(INDEX(FEB!B$2:B$216,SMALL(IF(INDEX(FEB!$E$2:$AF$216,,MATCH($F$1,FEB!$E$1:$AJ$1,0))=$B$1,ROW(FEB!$J$2:$AI$216)-ROW(FEB!$J$2)+1),ROWS(B$3:B106))),\"\")","v":""},{"$f":"IFERROR(INDEX(FEB!C$2:C$216,SMALL(IF(INDEX(FEB!$E$2:$AF$216,,MATCH($F$1,FEB!$E$1:$AJ$1,0))=$B$1,ROW(FEB!$J$2:$AI$216)-ROW(FEB!$J$2)+1),ROWS(C$3:C106))),\"\")","v":""},{"$f":"IFERROR(INDEX(FEB!D$2:D$216,SMALL(IF(INDEX(FEB!$E$2:$AF$216,,MATCH($F$1,FEB!$E$1:$AJ$1,0))=$B$1,ROW(FEB!$J$2:$AI$216)-ROW(FEB!$J$2)+1),ROWS(D$3:D106))),\"\")","v":""}]
[null,{"$f":"IFERROR(INDEX(FEB!B$2:B$216,SMALL(IF(INDEX(FEB!$E$2:$AF$216,,MATCH($F$1,FEB!$E$1:$AJ$1,0))=$B$1,ROW(FEB!$J$2:$AI$216)-ROW(FEB!$J$2)+1),ROWS(B$3:B107))),\"\")","v":""},{"$f":"IFERROR(INDEX(FEB!C$2:C$216,SMALL(IF(INDEX(FEB!$E$2:$AF$216,,MATCH($F$1,FEB!$E$1:$AJ$1,0))=$B$1,ROW(FEB!$J$2:$AI$216)-ROW(FEB!$J$2)+1),ROWS(C$3:C107))),\"\")","v":""},{"$f":"IFERROR(INDEX(FEB!D$2:D$216,SMALL(IF(INDEX(FEB!$E$2:$AF$216,,MATCH($F$1,FEB!$E$1:$AJ$1,0))=$B$1,ROW(FEB!$J$2:$AI$216)-ROW(FEB!$J$2)+1),ROWS(D$3:D107))),\"\")","v":""}]
[null,{"$f":"IFERROR(INDEX(FEB!B$2:B$216,SMALL(IF(INDEX(FEB!$E$2:$AF$216,,MATCH($F$1,FEB!$E$1:$AJ$1,0))=$B$1,ROW(FEB!$J$2:$AI$216)-ROW(FEB!$J$2)+1),ROWS(B$3:B108))),\"\")","v":""},{"$f":"IFERROR(INDEX(FEB!C$2:C$216,SMALL(IF(INDEX(FEB!$E$2:$AF$216,,MATCH($F$1,FEB!$E$1:$AJ$1,0))=$B$1,ROW(FEB!$J$2:$AI$216)-ROW(FEB!$J$2)+1),ROWS(C$3:C108))),\"\")","v":""},{"$f":"IFERROR(INDEX(FEB!D$2:D$216,SMALL(IF(INDEX(FEB!$E$2:$AF$216,,MATCH($F$1,FEB!$E$1:$AJ$1,0))=$B$1,ROW(FEB!$J$2:$AI$216)-ROW(FEB!$J$2)+1),ROWS(D$3:D108))),\"\")","v":""}]
[null,{"$f":"IFERROR(INDEX(FEB!B$2:B$216,SMALL(IF(INDEX(FEB!$E$2:$AF$216,,MATCH($F$1,FEB!$E$1:$AJ$1,0))=$B$1,ROW(FEB!$J$2:$AI$216)-ROW(FEB!$J$2)+1),ROWS(B$3:B109))),\"\")","v":""},{"$f":"IFERROR(INDEX(FEB!C$2:C$216,SMALL(IF(INDEX(FEB!$E$2:$AF$216,,MATCH($F$1,FEB!$E$1:$AJ$1,0))=$B$1,ROW(FEB!$J$2:$AI$216)-ROW(FEB!$J$2)+1),ROWS(C$3:C109))),\"\")","v":""},{"$f":"IFERROR(INDEX(FEB!D$2:D$216,SMALL(IF(INDEX(FEB!$E$2:$AF$216,,MATCH($F$1,FEB!$E$1:$AJ$1,0))=$B$1,ROW(FEB!$J$2:$AI$216)-ROW(FEB!$J$2)+1),ROWS(D$3:D109))),\"\")","v":""}]
[null,{"$f":"IFERROR(INDEX(FEB!B$2:B$216,SMALL(IF(INDEX(FEB!$E$2:$AF$216,,MATCH($F$1,FEB!$E$1:$AJ$1,0))=$B$1,ROW(FEB!$J$2:$AI$216)-ROW(FEB!$J$2)+1),ROWS(B$3:B110))),\"\")","v":""},{"$f":"IFERROR(INDEX(FEB!C$2:C$216,SMALL(IF(INDEX(FEB!$E$2:$AF$216,,MATCH($F$1,FEB!$E$1:$AJ$1,0))=$B$1,ROW(FEB!$J$2:$AI$216)-ROW(FEB!$J$2)+1),ROWS(C$3:C110))),\"\")","v":""},{"$f":"IFERROR(INDEX(FEB!D$2:D$216,SMALL(IF(INDEX(FEB!$E$2:$AF$216,,MATCH($F$1,FEB!$E$1:$AJ$1,0))=$B$1,ROW(FEB!$J$2:$AI$216)-ROW(FEB!$J$2)+1),ROWS(D$3:D110))),\"\")","v":""}]
[null,{"$f":"IFERROR(INDEX(FEB!B$2:B$216,SMALL(IF(INDEX(FEB!$E$2:$AF$216,,MATCH($F$1,FEB!$E$1:$AJ$1,0))=$B$1,ROW(FEB!$J$2:$AI$216)-ROW(FEB!$J$2)+1),ROWS(B$3:B111))),\"\")","v":""},{"$f":"IFERROR(INDEX(FEB!C$2:C$216,SMALL(IF(INDEX(FEB!$E$2:$AF$216,,MATCH($F$1,FEB!$E$1:$AJ$1,0))=$B$1,ROW(FEB!$J$2:$AI$216)-ROW(FEB!$J$2)+1),ROWS(C$3:C111))),\"\")","v":""},{"$f":"IFERROR(INDEX(FEB!D$2:D$216,SMALL(IF(INDEX(FEB!$E$2:$AF$216,,MATCH($F$1,FEB!$E$1:$AJ$1,0))=$B$1,ROW(FEB!$J$2:$AI$216)-ROW(FEB!$J$2)+1),ROWS(D$3:D111))),\"\")","v":""}]
[null,{"$f":"IFERROR(INDEX(FEB!B$2:B$216,SMALL(IF(INDEX(FEB!$E$2:$AF$216,,MATCH($F$1,FEB!$E$1:$AJ$1,0))=$B$1,ROW(FEB!$J$2:$AI$216)-ROW(FEB!$J$2)+1),ROWS(B$3:B112))),\"\")","v":""},{"$f":"IFERROR(INDEX(FEB!C$2:C$216,SMALL(IF(INDEX(FEB!$E$2:$AF$216,,MATCH($F$1,FEB!$E$1:$AJ$1,0))=$B$1,ROW(FEB!$J$2:$AI$216)-ROW(FEB!$J$2)+1),ROWS(C$3:C112))),\"\")","v":""},{"$f":"IFERROR(INDEX(FEB!D$2:D$216,SMALL(IF(INDEX(FEB!$E$2:$AF$216,,MATCH($F$1,FEB!$E$1:$AJ$1,0))=$B$1,ROW(FEB!$J$2:$AI$216)-ROW(FEB!$J$2)+1),ROWS(D$3:D112))),\"\")","v":""}]
[null,{"$f":"IFERROR(INDEX(FEB!B$2:B$216,SMALL(IF(INDEX(FEB!$E$2:$AF$216,,MATCH($F$1,FEB!$E$1:$AJ$1,0))=$B$1,ROW(FEB!$J$2:$AI$216)-ROW(FEB!$J$2)+1),ROWS(B$3:B113))),\"\")","v":""},{"$f":"IFERROR(INDEX(FEB!C$2:C$216,SMALL(IF(INDEX(FEB!$E$2:$AF$216,,MATCH($F$1,FEB!$E$1:$AJ$1,0))=$B$1,ROW(FEB!$J$2:$AI$216)-ROW(FEB!$J$2)+1),ROWS(C$3:C113))),\"\")","v":""},{"$f":"IFERROR(INDEX(FEB!D$2:D$216,SMALL(IF(INDEX(FEB!$E$2:$AF$216,,MATCH($F$1,FEB!$E$1:$AJ$1,0))=$B$1,ROW(FEB!$J$2:$AI$216)-ROW(FEB!$J$2)+1),ROWS(D$3:D113))),\"\")","v":""}]
[null,{"$f":"IFERROR(INDEX(FEB!B$2:B$216,SMALL(IF(INDEX(FEB!$E$2:$AF$216,,MATCH($F$1,FEB!$E$1:$AJ$1,0))=$B$1,ROW(FEB!$J$2:$AI$216)-ROW(FEB!$J$2)+1),ROWS(B$3:B114))),\"\")","v":""},{"$f":"IFERROR(INDEX(FEB!C$2:C$216,SMALL(IF(INDEX(FEB!$E$2:$AF$216,,MATCH($F$1,FEB!$E$1:$AJ$1,0))=$B$1,ROW(FEB!$J$2:$AI$216)-ROW(FEB!$J$2)+1),ROWS(C$3:C114))),\"\")","v":""},{"$f":"IFERROR(INDEX(FEB!D$2:D$216,SMALL(IF(INDEX(FEB!$E$2:$AF$216,,MATCH($F$1,FEB!$E$1:$AJ$1,0))=$B$1,ROW(FEB!$J$2:$AI$216)-ROW(FEB!$J$2)+1),ROWS(D$3:D114))),\"\")","v":""}]
[null,{"$f":"IFERROR(INDEX(FEB!B$2:B$216,SMALL(IF(INDEX(FEB!$E$2:$AF$216,,MATCH($F$1,FEB!$E$1:$AJ$1,0))=$B$1,ROW(FEB!$J$2:$AI$216)-ROW(FEB!$J$2)+1),ROWS(B$3:B115))),\"\")","v":""},{"$f":"IFERROR(INDEX(FEB!C$2:C$216,SMALL(IF(INDEX(FEB!$E$2:$AF$216,,MATCH($F$1,FEB!$E$1:$AJ$1,0))=$B$1,ROW(FEB!$J$2:$AI$216)-ROW(FEB!$J$2)+1),ROWS(C$3:C115))),\"\")","v":""},{"$f":"IFERROR(INDEX(FEB!D$2:D$216,SMALL(IF(INDEX(FEB!$E$2:$AF$216,,MATCH($F$1,FEB!$E$1:$AJ$1,0))=$B$1,ROW(FEB!$J$2:$AI$216)-ROW(FEB!$J$2)+1),ROWS(D$3:D115))),\"\")","v":""}]
[null,{"$f":"IFERROR(INDEX(FEB!B$2:B$216,SMALL(IF(INDEX(FEB!$E$2:$AF$216,,MATCH($F$1,FEB!$E$1:$AJ$1,0))=$B$1,ROW(FEB!$J$2:$AI$216)-ROW(FEB!$J$2)+1),ROWS(B$3:B116))),\"\")","v":""},{"$f":"IFERROR(INDEX(FEB!C$2:C$216,SMALL(IF(INDEX(FEB!$E$2:$AF$216,,MATCH($F$1,FEB!$E$1:$AJ$1,0))=$B$1,ROW(FEB!$J$2:$AI$216)-ROW(FEB!$J$2)+1),ROWS(C$3:C116))),\"\")","v":""},{"$f":"IFERROR(INDEX(FEB!D$2:D$216,SMALL(IF(INDEX(FEB!$E$2:$AF$216,,MATCH($F$1,FEB!$E$1:$AJ$1,0))=$B$1,ROW(FEB!$J$2:$AI$216)-ROW(FEB!$J$2)+1),ROWS(D$3:D116))),\"\")","v":""}]
[null,{"$f":"IFERROR(INDEX(FEB!B$2:B$216,SMALL(IF(INDEX(FEB!$E$2:$AF$216,,MATCH($F$1,FEB!$E$1:$AJ$1,0))=$B$1,ROW(FEB!$J$2:$AI$216)-ROW(FEB!$J$2)+1),ROWS(B$3:B117))),\"\")","v":""},{"$f":"IFERROR(INDEX(FEB!C$2:C$216,SMALL(IF(INDEX(FEB!$E$2:$AF$216,,MATCH($F$1,FEB!$E$1:$AJ$1,0))=$B$1,ROW(FEB!$J$2:$AI$216)-ROW(FEB!$J$2)+1),ROWS(C$3:C117))),\"\")","v":""},{"$f":"IFERROR(INDEX(FEB!D$2:D$216,SMALL(IF(INDEX(FEB!$E$2:$AF$216,,MATCH($F$1,FEB!$E$1:$AJ$1,0))=$B$1,ROW(FEB!$J$2:$AI$216)-ROW(FEB!$J$2)+1),ROWS(D$3:D117))),\"\")","v":""}]
[null,{"$f":"IFERROR(INDEX(FEB!B$2:B$216,SMALL(IF(INDEX(FEB!$E$2:$AF$216,,MATCH($F$1,FEB!$E$1:$AJ$1,0))=$B$1,ROW(FEB!$J$2:$AI$216)-ROW(FEB!$J$2)+1),ROWS(B$3:B118))),\"\")","v":""},{"$f":"IFERROR(INDEX(FEB!C$2:C$216,SMALL(IF(INDEX(FEB!$E$2:$AF$216,,MATCH($F$1,FEB!$E$1:$AJ$1,0))=$B$1,ROW(FEB!$J$2:$AI$216)-ROW(FEB!$J$2)+1),ROWS(C$3:C118))),\"\")","v":""},{"$f":"IFERROR(INDEX(FEB!D$2:D$216,SMALL(IF(INDEX(FEB!$E$2:$AF$216,,MATCH($F$1,FEB!$E$1:$AJ$1,0))=$B$1,ROW(FEB!$J$2:$AI$216)-ROW(FEB!$J$2)+1),ROWS(D$3:D118))),\"\")","v":""}]
[null,{"$f":"IFERROR(INDEX(FEB!B$2:B$216,SMALL(IF(INDEX(FEB!$E$2:$AF$216,,MATCH($F$1,FEB!$E$1:$AJ$1,0))=$B$1,ROW(FEB!$J$2:$AI$216)-ROW(FEB!$J$2)+1),ROWS(B$3:B119))),\"\")","v":""},{"$f":"IFERROR(INDEX(FEB!C$2:C$216,SMALL(IF(INDEX(FEB!$E$2:$AF$216,,MATCH($F$1,FEB!$E$1:$AJ$1,0))=$B$1,ROW(FEB!$J$2:$AI$216)-ROW(FEB!$J$2)+1),ROWS(C$3:C119))),\"\")","v":""},{"$f":"IFERROR(INDEX(FEB!D$2:D$216,SMALL(IF(INDEX(FEB!$E$2:$AF$216,,MATCH($F$1,FEB!$E$1:$AJ$1,0))=$B$1,ROW(FEB!$J$2:$AI$216)-ROW(FEB!$J$2)+1),ROWS(D$3:D119))),\"\")","v":""}]
[null,{"$f":"IFERROR(INDEX(FEB!B$2:B$216,SMALL(IF(INDEX(FEB!$E$2:$AF$216,,MATCH($F$1,FEB!$E$1:$AJ$1,0))=$B$1,ROW(FEB!$J$2:$AI$216)-ROW(FEB!$J$2)+1),ROWS(B$3:B120))),\"\")","v":""},{"$f":"IFERROR(INDEX(FEB!C$2:C$216,SMALL(IF(INDEX(FEB!$E$2:$AF$216,,MATCH($F$1,FEB!$E$1:$AJ$1,0))=$B$1,ROW(FEB!$J$2:$AI$216)-ROW(FEB!$J$2)+1),ROWS(C$3:C120))),\"\")","v":""},{"$f":"IFERROR(INDEX(FEB!D$2:D$216,SMALL(IF(INDEX(FEB!$E$2:$AF$216,,MATCH($F$1,FEB!$E$1:$AJ$1,0))=$B$1,ROW(FEB!$J$2:$AI$216)-ROW(FEB!$J$2)+1),ROWS(D$3:D120))),\"\")","v":""}]
[null,{"$f":"IFERROR(INDEX(FEB!B$2:B$216,SMALL(IF(INDEX(FEB!$E$2:$AF$216,,MATCH($F$1,FEB!$E$1:$AJ$1,0))=$B$1,ROW(FEB!$J$2:$AI$216)-ROW(FEB!$J$2)+1),ROWS(B$3:B121))),\"\")","v":""},{"$f":"IFERROR(INDEX(FEB!C$2:C$216,SMALL(IF(INDEX(FEB!$E$2:$AF$216,,MATCH($F$1,FEB!$E$1:$AJ$1,0))=$B$1,ROW(FEB!$J$2:$AI$216)-ROW(FEB!$J$2)+1),ROWS(C$3:C121))),\"\")","v":""},{"$f":"IFERROR(INDEX(FEB!D$2:D$216,SMALL(IF(INDEX(FEB!$E$2:$AF$216,,MATCH($F$1,FEB!$E$1:$AJ$1,0))=$B$1,ROW(FEB!$J$2:$AI$216)-ROW(FEB!$J$2)+1),ROWS(D$3:D121))),\"\")","v":""}]
[null,{"$f":"IFERROR(INDEX(FEB!B$2:B$216,SMALL(IF(INDEX(FEB!$E$2:$AF$216,,MATCH($F$1,FEB!$E$1:$AJ$1,0))=$B$1,ROW(FEB!$J$2:$AI$216)-ROW(FEB!$J$2)+1),ROWS(B$3:B122))),\"\")","v":""},{"$f":"IFERROR(INDEX(FEB!C$2:C$216,SMALL(IF(INDEX(FEB!$E$2:$AF$216,,MATCH($F$1,FEB!$E$1:$AJ$1,0))=$B$1,ROW(FEB!$J$2:$AI$216)-ROW(FEB!$J$2)+1),ROWS(C$3:C122))),\"\")","v":""},{"$f":"IFERROR(INDEX(FEB!D$2:D$216,SMALL(IF(INDEX(FEB!$E$2:$AF$216,,MATCH($F$1,FEB!$E$1:$AJ$1,0))=$B$1,ROW(FEB!$J$2:$AI$216)-ROW(FEB!$J$2)+1),ROWS(D$3:D122))),\"\")","v":""}]
[null,{"$f":"IFERROR(INDEX(FEB!B$2:B$216,SMALL(IF(INDEX(FEB!$E$2:$AF$216,,MATCH($F$1,FEB!$E$1:$AJ$1,0))=$B$1,ROW(FEB!$J$2:$AI$216)-ROW(FEB!$J$2)+1),ROWS(B$3:B123))),\"\")","v":""},{"$f":"IFERROR(INDEX(FEB!C$2:C$216,SMALL(IF(INDEX(FEB!$E$2:$AF$216,,MATCH($F$1,FEB!$E$1:$AJ$1,0))=$B$1,ROW(FEB!$J$2:$AI$216)-ROW(FEB!$J$2)+1),ROWS(C$3:C123))),\"\")","v":""},{"$f":"IFERROR(INDEX(FEB!D$2:D$216,SMALL(IF(INDEX(FEB!$E$2:$AF$216,,MATCH($F$1,FEB!$E$1:$AJ$1,0))=$B$1,ROW(FEB!$J$2:$AI$216)-ROW(FEB!$J$2)+1),ROWS(D$3:D123))),\"\")","v":""}]
[null,{"$f":"IFERROR(INDEX(FEB!B$2:B$216,SMALL(IF(INDEX(FEB!$E$2:$AF$216,,MATCH($F$1,FEB!$E$1:$AJ$1,0))=$B$1,ROW(FEB!$J$2:$AI$216)-ROW(FEB!$J$2)+1),ROWS(B$3:B124))),\"\")","v":""},{"$f":"IFERROR(INDEX(FEB!C$2:C$216,SMALL(IF(INDEX(FEB!$E$2:$AF$216,,MATCH($F$1,FEB!$E$1:$AJ$1,0))=$B$1,ROW(FEB!$J$2:$AI$216)-ROW(FEB!$J$2)+1),ROWS(C$3:C124))),\"\")","v":""},{"$f":"IFERROR(INDEX(FEB!D$2:D$216,SMALL(IF(INDEX(FEB!$E$2:$AF$216,,MATCH($F$1,FEB!$E$1:$AJ$1,0))=$B$1,ROW(FEB!$J$2:$AI$216)-ROW(FEB!$J$2)+1),ROWS(D$3:D124))),\"\")","v":""}]
[null,{"$f":"IFERROR(INDEX(FEB!B$2:B$216,SMALL(IF(INDEX(FEB!$E$2:$AF$216,,MATCH($F$1,FEB!$E$1:$AJ$1,0))=$B$1,ROW(FEB!$J$2:$AI$216)-ROW(FEB!$J$2)+1),ROWS(B$3:B125))),\"\")","v":""},{"$f":"IFERROR(INDEX(FEB!C$2:C$216,SMALL(IF(INDEX(FEB!$E$2:$AF$216,,MATCH($F$1,FEB!$E$1:$AJ$1,0))=$B$1,ROW(FEB!$J$2:$AI$216)-ROW(FEB!$J$2)+1),ROWS(C$3:C125))),\"\")","v":""},{"$f":"IFERROR(INDEX(FEB!D$2:D$216,SMALL(IF(INDEX(FEB!$E$2:$AF$216,,MATCH($F$1,FEB!$E$1:$AJ$1,0))=$B$1,ROW(FEB!$J$2:$AI$216)-ROW(FEB!$J$2)+1),ROWS(D$3:D125))),\"\")","v":""}]
[null,{"$f":"IFERROR(INDEX(FEB!B$2:B$216,SMALL(IF(INDEX(FEB!$E$2:$AF$216,,MATCH($F$1,FEB!$E$1:$AJ$1,0))=$B$1,ROW(FEB!$J$2:$AI$216)-ROW(FEB!$J$2)+1),ROWS(B$3:B126))),\"\")","v":""},{"$f":"IFERROR(INDEX(FEB!C$2:C$216,SMALL(IF(INDEX(FEB!$E$2:$AF$216,,MATCH($F$1,FEB!$E$1:$AJ$1,0))=$B$1,ROW(FEB!$J$2:$AI$216)-ROW(FEB!$J$2)+1),ROWS(C$3:C126))),\"\")","v":""},{"$f":"IFERROR(INDEX(FEB!D$2:D$216,SMALL(IF(INDEX(FEB!$E$2:$AF$216,,MATCH($F$1,FEB!$E$1:$AJ$1,0))=$B$1,ROW(FEB!$J$2:$AI$216)-ROW(FEB!$J$2)+1),ROWS(D$3:D126))),\"\")","v":""}]
[null,{"$f":"IFERROR(INDEX(FEB!B$2:B$216,SMALL(IF(INDEX(FEB!$E$2:$AF$216,,MATCH($F$1,FEB!$E$1:$AJ$1,0))=$B$1,ROW(FEB!$J$2:$AI$216)-ROW(FEB!$J$2)+1),ROWS(B$3:B127))),\"\")","v":""},{"$f":"IFERROR(INDEX(FEB!C$2:C$216,SMALL(IF(INDEX(FEB!$E$2:$AF$216,,MATCH($F$1,FEB!$E$1:$AJ$1,0))=$B$1,ROW(FEB!$J$2:$AI$216)-ROW(FEB!$J$2)+1),ROWS(C$3:C127))),\"\")","v":""},{"$f":"IFERROR(INDEX(FEB!D$2:D$216,SMALL(IF(INDEX(FEB!$E$2:$AF$216,,MATCH($F$1,FEB!$E$1:$AJ$1,0))=$B$1,ROW(FEB!$J$2:$AI$216)-ROW(FEB!$J$2)+1),ROWS(D$3:D127))),\"\")","v":""}]
[null,{"$f":"IFERROR(INDEX(FEB!B$2:B$216,SMALL(IF(INDEX(FEB!$E$2:$AF$216,,MATCH($F$1,FEB!$E$1:$AJ$1,0))=$B$1,ROW(FEB!$J$2:$AI$216)-ROW(FEB!$J$2)+1),ROWS(B$3:B128))),\"\")","v":""},{"$f":"IFERROR(INDEX(FEB!C$2:C$216,SMALL(IF(INDEX(FEB!$E$2:$AF$216,,MATCH($F$1,FEB!$E$1:$AJ$1,0))=$B$1,ROW(FEB!$J$2:$AI$216)-ROW(FEB!$J$2)+1),ROWS(C$3:C128))),\"\")","v":""},{"$f":"IFERROR(INDEX(FEB!D$2:D$216,SMALL(IF(INDEX(FEB!$E$2:$AF$216,,MATCH($F$1,FEB!$E$1:$AJ$1,0))=$B$1,ROW(FEB!$J$2:$AI$216)-ROW(FEB!$J$2)+1),ROWS(D$3:D128))),\"\")","v":""}]
[null,{"$f":"IFERROR(INDEX(FEB!B$2:B$216,SMALL(IF(INDEX(FEB!$E$2:$AF$216,,MATCH($F$1,FEB!$E$1:$AJ$1,0))=$B$1,ROW(FEB!$J$2:$AI$216)-ROW(FEB!$J$2)+1),ROWS(B$3:B129))),\"\")","v":""},{"$f":"IFERROR(INDEX(FEB!C$2:C$216,SMALL(IF(INDEX(FEB!$E$2:$AF$216,,MATCH($F$1,FEB!$E$1:$AJ$1,0))=$B$1,ROW(FEB!$J$2:$AI$216)-ROW(FEB!$J$2)+1),ROWS(C$3:C129))),\"\")","v":""},{"$f":"IFERROR(INDEX(FEB!D$2:D$216,SMALL(IF(INDEX(FEB!$E$2:$AF$216,,MATCH($F$1,FEB!$E$1:$AJ$1,0))=$B$1,ROW(FEB!$J$2:$AI$216)-ROW(FEB!$J$2)+1),ROWS(D$3:D129))),\"\")","v":""}]
[null,{"$f":"IFERROR(INDEX(FEB!B$2:B$216,SMALL(IF(INDEX(FEB!$E$2:$AF$216,,MATCH($F$1,FEB!$E$1:$AJ$1,0))=$B$1,ROW(FEB!$J$2:$AI$216)-ROW(FEB!$J$2)+1),ROWS(B$3:B130))),\"\")","v":""},{"$f":"IFERROR(INDEX(FEB!C$2:C$216,SMALL(IF(INDEX(FEB!$E$2:$AF$216,,MATCH($F$1,FEB!$E$1:$AJ$1,0))=$B$1,ROW(FEB!$J$2:$AI$216)-ROW(FEB!$J$2)+1),ROWS(C$3:C130))),\"\")","v":""},{"$f":"IFERROR(INDEX(FEB!D$2:D$216,SMALL(IF(INDEX(FEB!$E$2:$AF$216,,MATCH($F$1,FEB!$E$1:$AJ$1,0))=$B$1,ROW(FEB!$J$2:$AI$216)-ROW(FEB!$J$2)+1),ROWS(D$3:D130))),\"\")","v":""}]
[null,{"$f":"IFERROR(INDEX(FEB!B$2:B$216,SMALL(IF(INDEX(FEB!$E$2:$AF$216,,MATCH($F$1,FEB!$E$1:$AJ$1,0))=$B$1,ROW(FEB!$J$2:$AI$216)-ROW(FEB!$J$2)+1),ROWS(B$3:B131))),\"\")","v":""},{"$f":"IFERROR(INDEX(FEB!C$2:C$216,SMALL(IF(INDEX(FEB!$E$2:$AF$216,,MATCH($F$1,FEB!$E$1:$AJ$1,0))=$B$1,ROW(FEB!$J$2:$AI$216)-ROW(FEB!$J$2)+1),ROWS(C$3:C131))),\"\")","v":""},{"$f":"IFERROR(INDEX(FEB!D$2:D$216,SMALL(IF(INDEX(FEB!$E$2:$AF$216,,MATCH($F$1,FEB!$E$1:$AJ$1,0))=$B$1,ROW(FEB!$J$2:$AI$216)-ROW(FEB!$J$2)+1),ROWS(D$3:D131))),\"\")","v":""}]
[null,{"$f":"IFERROR(INDEX(FEB!B$2:B$216,SMALL(IF(INDEX(FEB!$E$2:$AF$216,,MATCH($F$1,FEB!$E$1:$AJ$1,0))=$B$1,ROW(FEB!$J$2:$AI$216)-ROW(FEB!$J$2)+1),ROWS(B$3:B132))),\"\")","v":""},{"$f":"IFERROR(INDEX(FEB!C$2:C$216,SMALL(IF(INDEX(FEB!$E$2:$AF$216,,MATCH($F$1,FEB!$E$1:$AJ$1,0))=$B$1,ROW(FEB!$J$2:$AI$216)-ROW(FEB!$J$2)+1),ROWS(C$3:C132))),\"\")","v":""},{"$f":"IFERROR(INDEX(FEB!D$2:D$216,SMALL(IF(INDEX(FEB!$E$2:$AF$216,,MATCH($F$1,FEB!$E$1:$AJ$1,0))=$B$1,ROW(FEB!$J$2:$AI$216)-ROW(FEB!$J$2)+1),ROWS(D$3:D132))),\"\")","v":""}]
[null,{"$f":"IFERROR(INDEX(FEB!B$2:B$216,SMALL(IF(INDEX(FEB!$E$2:$AF$216,,MATCH($F$1,FEB!$E$1:$AJ$1,0))=$B$1,ROW(FEB!$J$2:$AI$216)-ROW(FEB!$J$2)+1),ROWS(B$3:B133))),\"\")","v":""},{"$f":"IFERROR(INDEX(FEB!C$2:C$216,SMALL(IF(INDEX(FEB!$E$2:$AF$216,,MATCH($F$1,FEB!$E$1:$AJ$1,0))=$B$1,ROW(FEB!$J$2:$AI$216)-ROW(FEB!$J$2)+1),ROWS(C$3:C133))),\"\")","v":""},{"$f":"IFERROR(INDEX(FEB!D$2:D$216,SMALL(IF(INDEX(FEB!$E$2:$AF$216,,MATCH($F$1,FEB!$E$1:$AJ$1,0))=$B$1,ROW(FEB!$J$2:$AI$216)-ROW(FEB!$J$2)+1),ROWS(D$3:D133))),\"\")","v":""}]
[null,{"$f":"IFERROR(INDEX(FEB!B$2:B$216,SMALL(IF(INDEX(FEB!$E$2:$AF$216,,MATCH($F$1,FEB!$E$1:$AJ$1,0))=$B$1,ROW(FEB!$J$2:$AI$216)-ROW(FEB!$J$2)+1),ROWS(B$3:B134))),\"\")","v":""},{"$f":"IFERROR(INDEX(FEB!C$2:C$216,SMALL(IF(INDEX(FEB!$E$2:$AF$216,,MATCH($F$1,FEB!$E$1:$AJ$1,0))=$B$1,ROW(FEB!$J$2:$AI$216)-ROW(FEB!$J$2)+1),ROWS(C$3:C134))),\"\")","v":""},{"$f":"IFERROR(INDEX(FEB!D$2:D$216,SMALL(IF(INDEX(FEB!$E$2:$AF$216,,MATCH($F$1,FEB!$E$1:$AJ$1,0))=$B$1,ROW(FEB!$J$2:$AI$216)-ROW(FEB!$J$2)+1),ROWS(D$3:D134))),\"\")","v":""}]
[null,{"$f":"IFERROR(INDEX(FEB!B$2:B$216,SMALL(IF(INDEX(FEB!$E$2:$AF$216,,MATCH($F$1,FEB!$E$1:$AJ$1,0))=$B$1,ROW(FEB!$J$2:$AI$216)-ROW(FEB!$J$2)+1),ROWS(B$3:B135))),\"\")","v":""},{"$f":"IFERROR(INDEX(FEB!C$2:C$216,SMALL(IF(INDEX(FEB!$E$2:$AF$216,,MATCH($F$1,FEB!$E$1:$AJ$1,0))=$B$1,ROW(FEB!$J$2:$AI$216)-ROW(FEB!$J$2)+1),ROWS(C$3:C135))),\"\")","v":""},{"$f":"IFERROR(INDEX(FEB!D$2:D$216,SMALL(IF(INDEX(FEB!$E$2:$AF$216,,MATCH($F$1,FEB!$E$1:$AJ$1,0))=$B$1,ROW(FEB!$J$2:$AI$216)-ROW(FEB!$J$2)+1),ROWS(D$3:D135))),\"\")","v":""}]
[null,{"$f":"IFERROR(INDEX(FEB!B$2:B$216,SMALL(IF(INDEX(FEB!$E$2:$AF$216,,MATCH($F$1,FEB!$E$1:$AJ$1,0))=$B$1,ROW(FEB!$J$2:$AI$216)-ROW(FEB!$J$2)+1),ROWS(B$3:B136))),\"\")","v":""},{"$f":"IFERROR(INDEX(FEB!C$2:C$216,SMALL(IF(INDEX(FEB!$E$2:$AF$216,,MATCH($F$1,FEB!$E$1:$AJ$1,0))=$B$1,ROW(FEB!$J$2:$AI$216)-ROW(FEB!$J$2)+1),ROWS(C$3:C136))),\"\")","v":""},{"$f":"IFERROR(INDEX(FEB!D$2:D$216,SMALL(IF(INDEX(FEB!$E$2:$AF$216,,MATCH($F$1,FEB!$E$1:$AJ$1,0))=$B$1,ROW(FEB!$J$2:$AI$216)-ROW(FEB!$J$2)+1),ROWS(D$3:D136))),\"\")","v":""}]
[null,{"$f":"IFERROR(INDEX(FEB!B$2:B$216,SMALL(IF(INDEX(FEB!$E$2:$AF$216,,MATCH($F$1,FEB!$E$1:$AJ$1,0))=$B$1,ROW(FEB!$J$2:$AI$216)-ROW(FEB!$J$2)+1),ROWS(B$3:B137))),\"\")","v":""},{"$f":"IFERROR(INDEX(FEB!C$2:C$216,SMALL(IF(INDEX(FEB!$E$2:$AF$216,,MATCH($F$1,FEB!$E$1:$AJ$1,0))=$B$1,ROW(FEB!$J$2:$AI$216)-ROW(FEB!$J$2)+1),ROWS(C$3:C137))),\"\")","v":""},{"$f":"IFERROR(INDEX(FEB!D$2:D$216,SMALL(IF(INDEX(FEB!$E$2:$AF$216,,MATCH($F$1,FEB!$E$1:$AJ$1,0))=$B$1,ROW(FEB!$J$2:$AI$216)-ROW(FEB!$J$2)+1),ROWS(D$3:D137))),\"\")","v":""}]
[null,{"$f":"IFERROR(INDEX(FEB!B$2:B$216,SMALL(IF(INDEX(FEB!$E$2:$AF$216,,MATCH($F$1,FEB!$E$1:$AJ$1,0))=$B$1,ROW(FEB!$J$2:$AI$216)-ROW(FEB!$J$2)+1),ROWS(B$3:B138))),\"\")","v":""},{"$f":"IFERROR(INDEX(FEB!C$2:C$216,SMALL(IF(INDEX(FEB!$E$2:$AF$216,,MATCH($F$1,FEB!$E$1:$AJ$1,0))=$B$1,ROW(FEB!$J$2:$AI$216)-ROW(FEB!$J$2)+1),ROWS(C$3:C138))),\"\")","v":""},{"$f":"IFERROR(INDEX(FEB!D$2:D$216,SMALL(IF(INDEX(FEB!$E$2:$AF$216,,MATCH($F$1,FEB!$E$1:$AJ$1,0))=$B$1,ROW(FEB!$J$2:$AI$216)-ROW(FEB!$J$2)+1),ROWS(D$3:D138))),\"\")","v":""}]
[null,{"$f":"IFERROR(INDEX(FEB!B$2:B$216,SMALL(IF(INDEX(FEB!$E$2:$AF$216,,MATCH($F$1,FEB!$E$1:$AJ$1,0))=$B$1,ROW(FEB!$J$2:$AI$216)-ROW(FEB!$J$2)+1),ROWS(B$3:B139))),\"\")","v":""},{"$f":"IFERROR(INDEX(FEB!C$2:C$216,SMALL(IF(INDEX(FEB!$E$2:$AF$216,,MATCH($F$1,FEB!$E$1:$AJ$1,0))=$B$1,ROW(FEB!$J$2:$AI$216)-ROW(FEB!$J$2)+1),ROWS(C$3:C139))),\"\")","v":""},{"$f":"IFERROR(INDEX(FEB!D$2:D$216,SMALL(IF(INDEX(FEB!$E$2:$AF$216,,MATCH($F$1,FEB!$E$1:$AJ$1,0))=$B$1,ROW(FEB!$J$2:$AI$216)-ROW(FEB!$J$2)+1),ROWS(D$3:D139))),\"\")","v":""}]
[null,{"$f":"IFERROR(INDEX(FEB!B$2:B$216,SMALL(IF(INDEX(FEB!$E$2:$AF$216,,MATCH($F$1,FEB!$E$1:$AJ$1,0))=$B$1,ROW(FEB!$J$2:$AI$216)-ROW(FEB!$J$2)+1),ROWS(B$3:B140))),\"\")","v":""},{"$f":"IFERROR(INDEX(FEB!C$2:C$216,SMALL(IF(INDEX(FEB!$E$2:$AF$216,,MATCH($F$1,FEB!$E$1:$AJ$1,0))=$B$1,ROW(FEB!$J$2:$AI$216)-ROW(FEB!$J$2)+1),ROWS(C$3:C140))),\"\")","v":""},{"$f":"IFERROR(INDEX(FEB!D$2:D$216,SMALL(IF(INDEX(FEB!$E$2:$AF$216,,MATCH($F$1,FEB!$E$1:$AJ$1,0))=$B$1,ROW(FEB!$J$2:$AI$216)-ROW(FEB!$J$2)+1),ROWS(D$3:D140))),\"\")","v":""}]
[null,{"$f":"IFERROR(INDEX(FEB!B$2:B$216,SMALL(IF(INDEX(FEB!$E$2:$AF$216,,MATCH($F$1,FEB!$E$1:$AJ$1,0))=$B$1,ROW(FEB!$J$2:$AI$216)-ROW(FEB!$J$2)+1),ROWS(B$3:B141))),\"\")","v":""},{"$f":"IFERROR(INDEX(FEB!C$2:C$216,SMALL(IF(INDEX(FEB!$E$2:$AF$216,,MATCH($F$1,FEB!$E$1:$AJ$1,0))=$B$1,ROW(FEB!$J$2:$AI$216)-ROW(FEB!$J$2)+1),ROWS(C$3:C141))),\"\")","v":""},{"$f":"IFERROR(INDEX(FEB!D$2:D$216,SMALL(IF(INDEX(FEB!$E$2:$AF$216,,MATCH($F$1,FEB!$E$1:$AJ$1,0))=$B$1,ROW(FEB!$J$2:$AI$216)-ROW(FEB!$J$2)+1),ROWS(D$3:D141))),\"\")","v":""}]
[null,{"$f":"IFERROR(INDEX(FEB!B$2:B$216,SMALL(IF(INDEX(FEB!$E$2:$AF$216,,MATCH($F$1,FEB!$E$1:$AJ$1,0))=$B$1,ROW(FEB!$J$2:$AI$216)-ROW(FEB!$J$2)+1),ROWS(B$3:B142))),\"\")","v":""},{"$f":"IFERROR(INDEX(FEB!C$2:C$216,SMALL(IF(INDEX(FEB!$E$2:$AF$216,,MATCH($F$1,FEB!$E$1:$AJ$1,0))=$B$1,ROW(FEB!$J$2:$AI$216)-ROW(FEB!$J$2)+1),ROWS(C$3:C142))),\"\")","v":""},{"$f":"IFERROR(INDEX(FEB!D$2:D$216,SMALL(IF(INDEX(FEB!$E$2:$AF$216,,MATCH($F$1,FEB!$E$1:$AJ$1,0))=$B$1,ROW(FEB!$J$2:$AI$216)-ROW(FEB!$J$2)+1),ROWS(D$3:D142))),\"\")","v":""}]
[null,{"$f":"IFERROR(INDEX(FEB!B$2:B$216,SMALL(IF(INDEX(FEB!$E$2:$AF$216,,MATCH($F$1,FEB!$E$1:$AJ$1,0))=$B$1,ROW(FEB!$J$2:$AI$216)-ROW(FEB!$J$2)+1),ROWS(B$3:B143))),\"\")","v":""},{"$f":"IFERROR(INDEX(FEB!C$2:C$216,SMALL(IF(INDEX(FEB!$E$2:$AF$216,,MATCH($F$1,FEB!$E$1:$AJ$1,0))=$B$1,ROW(FEB!$J$2:$AI$216)-ROW(FEB!$J$2)+1),ROWS(C$3:C143))),\"\")","v":""},{"$f":"IFERROR(INDEX(FEB!D$2:D$216,SMALL(IF(INDEX(FEB!$E$2:$AF$216,,MATCH($F$1,FEB!$E$1:$AJ$1,0))=$B$1,ROW(FEB!$J$2:$AI$216)-ROW(FEB!$J$2)+1),ROWS(D$3:D143))),\"\")","v":""}]
[null,{"$f":"IFERROR(INDEX(FEB!B$2:B$216,SMALL(IF(INDEX(FEB!$E$2:$AF$216,,MATCH($F$1,FEB!$E$1:$AJ$1,0))=$B$1,ROW(FEB!$J$2:$AI$216)-ROW(FEB!$J$2)+1),ROWS(B$3:B144))),\"\")","v":""},{"$f":"IFERROR(INDEX(FEB!C$2:C$216,SMALL(IF(INDEX(FEB!$E$2:$AF$216,,MATCH($F$1,FEB!$E$1:$AJ$1,0))=$B$1,ROW(FEB!$J$2:$AI$216)-ROW(FEB!$J$2)+1),ROWS(C$3:C144))),\"\")","v":""},{"$f":"IFERROR(INDEX(FEB!D$2:D$216,SMALL(IF(INDEX(FEB!$E$2:$AF$216,,MATCH($F$1,FEB!$E$1:$AJ$1,0))=$B$1,ROW(FEB!$J$2:$AI$216)-ROW(FEB!$J$2)+1),ROWS(D$3:D144))),\"\")","v":""}]
[null,{"$f":"IFERROR(INDEX(FEB!B$2:B$216,SMALL(IF(INDEX(FEB!$E$2:$AF$216,,MATCH($F$1,FEB!$E$1:$AJ$1,0))=$B$1,ROW(FEB!$J$2:$AI$216)-ROW(FEB!$J$2)+1),ROWS(B$3:B145))),\"\")","v":""},{"$f":"IFERROR(INDEX(FEB!C$2:C$216,SMALL(IF(INDEX(FEB!$E$2:$AF$216,,MATCH($F$1,FEB!$E$1:$AJ$1,0))=$B$1,ROW(FEB!$J$2:$AI$216)-ROW(FEB!$J$2)+1),ROWS(C$3:C145))),\"\")","v":""},{"$f":"IFERROR(INDEX(FEB!D$2:D$216,SMALL(IF(INDEX(FEB!$E$2:$AF$216,,MATCH($F$1,FEB!$E$1:$AJ$1,0))=$B$1,ROW(FEB!$J$2:$AI$216)-ROW(FEB!$J$2)+1),ROWS(D$3:D145))),\"\")","v":""}]
[null,{"$f":"IFERROR(INDEX(FEB!B$2:B$216,SMALL(IF(INDEX(FEB!$E$2:$AF$216,,MATCH($F$1,FEB!$E$1:$AJ$1,0))=$B$1,ROW(FEB!$J$2:$AI$216)-ROW(FEB!$J$2)+1),ROWS(B$3:B146))),\"\")","v":""},{"$f":"IFERROR(INDEX(FEB!C$2:C$216,SMALL(IF(INDEX(FEB!$E$2:$AF$216,,MATCH($F$1,FEB!$E$1:$AJ$1,0))=$B$1,ROW(FEB!$J$2:$AI$216)-ROW(FEB!$J$2)+1),ROWS(C$3:C146))),\"\")","v":""},{"$f":"IFERROR(INDEX(FEB!D$2:D$216,SMALL(IF(INDEX(FEB!$E$2:$AF$216,,MATCH($F$1,FEB!$E$1:$AJ$1,0))=$B$1,ROW(FEB!$J$2:$AI$216)-ROW(FEB!$J$2)+1),ROWS(D$3:D146))),\"\")","v":""}]
[null,{"$f":"IFERROR(INDEX(FEB!B$2:B$216,SMALL(IF(INDEX(FEB!$E$2:$AF$216,,MATCH($F$1,FEB!$E$1:$AJ$1,0))=$B$1,ROW(FEB!$J$2:$AI$216)-ROW(FEB!$J$2)+1),ROWS(B$3:B147))),\"\")","v":""},{"$f":"IFERROR(INDEX(FEB!C$2:C$216,SMALL(IF(INDEX(FEB!$E$2:$AF$216,,MATCH($F$1,FEB!$E$1:$AJ$1,0))=$B$1,ROW(FEB!$J$2:$AI$216)-ROW(FEB!$J$2)+1),ROWS(C$3:C147))),\"\")","v":""},{"$f":"IFERROR(INDEX(FEB!D$2:D$216,SMALL(IF(INDEX(FEB!$E$2:$AF$216,,MATCH($F$1,FEB!$E$1:$AJ$1,0))=$B$1,ROW(FEB!$J$2:$AI$216)-ROW(FEB!$J$2)+1),ROWS(D$3:D147))),\"\")","v":""}]
[null,{"$f":"IFERROR(INDEX(FEB!B$2:B$216,SMALL(IF(INDEX(FEB!$E$2:$AF$216,,MATCH($F$1,FEB!$E$1:$AJ$1,0))=$B$1,ROW(FEB!$J$2:$AI$216)-ROW(FEB!$J$2)+1),ROWS(B$3:B148))),\"\")","v":""},{"$f":"IFERROR(INDEX(FEB!C$2:C$216,SMALL(IF(INDEX(FEB!$E$2:$AF$216,,MATCH($F$1,FEB!$E$1:$AJ$1,0))=$B$1,ROW(FEB!$J$2:$AI$216)-ROW(FEB!$J$2)+1),ROWS(C$3:C148))),\"\")","v":""},{"$f":"IFERROR(INDEX(FEB!D$2:D$216,SMALL(IF(INDEX(FEB!$E$2:$AF$216,,MATCH($F$1,FEB!$E$1:$AJ$1,0))=$B$1,ROW(FEB!$J$2:$AI$216)-ROW(FEB!$J$2)+1),ROWS(D$3:D148))),\"\")","v":""}]
[null,{"$f":"IFERROR(INDEX(FEB!B$2:B$216,SMALL(IF(INDEX(FEB!$E$2:$AF$216,,MATCH($F$1,FEB!$E$1:$AJ$1,0))=$B$1,ROW(FEB!$J$2:$AI$216)-ROW(FEB!$J$2)+1),ROWS(B$3:B149))),\"\")","v":""},{"$f":"IFERROR(INDEX(FEB!C$2:C$216,SMALL(IF(INDEX(FEB!$E$2:$AF$216,,MATCH($F$1,FEB!$E$1:$AJ$1,0))=$B$1,ROW(FEB!$J$2:$AI$216)-ROW(FEB!$J$2)+1),ROWS(C$3:C149))),\"\")","v":""},{"$f":"IFERROR(INDEX(FEB!D$2:D$216,SMALL(IF(INDEX(FEB!$E$2:$AF$216,,MATCH($F$1,FEB!$E$1:$AJ$1,0))=$B$1,ROW(FEB!$J$2:$AI$216)-ROW(FEB!$J$2)+1),ROWS(D$3:D149))),\"\")","v":""}]
[null,{"$f":"IFERROR(INDEX(FEB!B$2:B$216,SMALL(IF(INDEX(FEB!$E$2:$AF$216,,MATCH($F$1,FEB!$E$1:$AJ$1,0))=$B$1,ROW(FEB!$J$2:$AI$216)-ROW(FEB!$J$2)+1),ROWS(B$3:B150))),\"\")","v":""},{"$f":"IFERROR(INDEX(FEB!C$2:C$216,SMALL(IF(INDEX(FEB!$E$2:$AF$216,,MATCH($F$1,FEB!$E$1:$AJ$1,0))=$B$1,ROW(FEB!$J$2:$AI$216)-ROW(FEB!$J$2)+1),ROWS(C$3:C150))),\"\")","v":""},{"$f":"IFERROR(INDEX(FEB!D$2:D$216,SMALL(IF(INDEX(FEB!$E$2:$AF$216,,MATCH($F$1,FEB!$E$1:$AJ$1,0))=$B$1,ROW(FEB!$J$2:$AI$216)-ROW(FEB!$J$2)+1),ROWS(D$3:D150))),\"\")","v":""}]
[null,{"$f":"IFERROR(INDEX(FEB!B$2:B$216,SMALL(IF(INDEX(FEB!$E$2:$AF$216,,MATCH($F$1,FEB!$E$1:$AJ$1,0))=$B$1,ROW(FEB!$J$2:$AI$216)-ROW(FEB!$J$2)+1),ROWS(B$3:B151))),\"\")","v":""},{"$f":"IFERROR(INDEX(FEB!C$2:C$216,SMALL(IF(INDEX(FEB!$E$2:$AF$216,,MATCH($F$1,FEB!$E$1:$AJ$1,0))=$B$1,ROW(FEB!$J$2:$AI$216)-ROW(FEB!$J$2)+1),ROWS(C$3:C151))),\"\")","v":""},{"$f":"IFERROR(INDEX(FEB!D$2:D$216,SMALL(IF(INDEX(FEB!$E$2:$AF$216,,MATCH($F$1,FEB!$E$1:$AJ$1,0))=$B$1,ROW(FEB!$J$2:$AI$216)-ROW(FEB!$J$2)+1),ROWS(D$3:D151))),\"\")","v":""}]
[null,{"$f":"IFERROR(INDEX(FEB!B$2:B$216,SMALL(IF(INDEX(FEB!$E$2:$AF$216,,MATCH($F$1,FEB!$E$1:$AJ$1,0))=$B$1,ROW(FEB!$J$2:$AI$216)-ROW(FEB!$J$2)+1),ROWS(B$3:B152))),\"\")","v":""},{"$f":"IFERROR(INDEX(FEB!C$2:C$216,SMALL(IF(INDEX(FEB!$E$2:$AF$216,,MATCH($F$1,FEB!$E$1:$AJ$1,0))=$B$1,ROW(FEB!$J$2:$AI$216)-ROW(FEB!$J$2)+1),ROWS(C$3:C152))),\"\")","v":""},{"$f":"IFERROR(INDEX(FEB!D$2:D$216,SMALL(IF(INDEX(FEB!$E$2:$AF$216,,MATCH($F$1,FEB!$E$1:$AJ$1,0))=$B$1,ROW(FEB!$J$2:$AI$216)-ROW(FEB!$J$2)+1),ROWS(D$3:D152))),\"\")","v":""}]
[null,{"$f":"IFERROR(INDEX(FEB!B$2:B$216,SMALL(IF(INDEX(FEB!$E$2:$AF$216,,MATCH($F$1,FEB!$E$1:$AJ$1,0))=$B$1,ROW(FEB!$J$2:$AI$216)-ROW(FEB!$J$2)+1),ROWS(B$3:B153))),\"\")","v":""},{"$f":"IFERROR(INDEX(FEB!C$2:C$216,SMALL(IF(INDEX(FEB!$E$2:$AF$216,,MATCH($F$1,FEB!$E$1:$AJ$1,0))=$B$1,ROW(FEB!$J$2:$AI$216)-ROW(FEB!$J$2)+1),ROWS(C$3:C153))),\"\")","v":""},{"$f":"IFERROR(INDEX(FEB!D$2:D$216,SMALL(IF(INDEX(FEB!$E$2:$AF$216,,MATCH($F$1,FEB!$E$1:$AJ$1,0))=$B$1,ROW(FEB!$J$2:$AI$216)-ROW(FEB!$J$2)+1),ROWS(D$3:D153))),\"\")","v":""}]
[null,{"$f":"IFERROR(INDEX(FEB!B$2:B$216,SMALL(IF(INDEX(FEB!$E$2:$AF$216,,MATCH($F$1,FEB!$E$1:$AJ$1,0))=$B$1,ROW(FEB!$J$2:$AI$216)-ROW(FEB!$J$2)+1),ROWS(B$3:B154))),\"\")","v":""},{"$f":"IFERROR(INDEX(FEB!C$2:C$216,SMALL(IF(INDEX(FEB!$E$2:$AF$216,,MATCH($F$1,FEB!$E$1:$AJ$1,0))=$B$1,ROW(FEB!$J$2:$AI$216)-ROW(FEB!$J$2)+1),ROWS(C$3:C154))),\"\")","v":""},{"$f":"IFERROR(INDEX(FEB!D$2:D$216,SMALL(IF(INDEX(FEB!$E$2:$AF$216,,MATCH($F$1,FEB!$E$1:$AJ$1,0))=$B$1,ROW(FEB!$J$2:$AI$216)-ROW(FEB!$J$2)+1),ROWS(D$3:D154))),\"\")","v":""}]
[null,{"$f":"IFERROR(INDEX(FEB!B$2:B$216,SMALL(IF(INDEX(FEB!$E$2:$AF$216,,MATCH($F$1,FEB!$E$1:$AJ$1,0))=$B$1,ROW(FEB!$J$2:$AI$216)-ROW(FEB!$J$2)+1),ROWS(B$3:B155))),\"\")","v":""},{"$f":"IFERROR(INDEX(FEB!C$2:C$216,SMALL(IF(INDEX(FEB!$E$2:$AF$216,,MATCH($F$1,FEB!$E$1:$AJ$1,0))=$B$1,ROW(FEB!$J$2:$AI$216)-ROW(FEB!$J$2)+1),ROWS(C$3:C155))),\"\")","v":""},{"$f":"IFERROR(INDEX(FEB!D$2:D$216,SMALL(IF(INDEX(FEB!$E$2:$AF$216,,MATCH($F$1,FEB!$E$1:$AJ$1,0))=$B$1,ROW(FEB!$J$2:$AI$216)-ROW(FEB!$J$2)+1),ROWS(D$3:D155))),\"\")","v":""}]
[null,{"$f":"IFERROR(INDEX(FEB!B$2:B$216,SMALL(IF(INDEX(FEB!$E$2:$AF$216,,MATCH($F$1,FEB!$E$1:$AJ$1,0))=$B$1,ROW(FEB!$J$2:$AI$216)-ROW(FEB!$J$2)+1),ROWS(B$3:B156))),\"\")","v":""},{"$f":"IFERROR(INDEX(FEB!C$2:C$216,SMALL(IF(INDEX(FEB!$E$2:$AF$216,,MATCH($F$1,FEB!$E$1:$AJ$1,0))=$B$1,ROW(FEB!$J$2:$AI$216)-ROW(FEB!$J$2)+1),ROWS(C$3:C156))),\"\")","v":""},{"$f":"IFERROR(INDEX(FEB!D$2:D$216,SMALL(IF(INDEX(FEB!$E$2:$AF$216,,MATCH($F$1,FEB!$E$1:$AJ$1,0))=$B$1,ROW(FEB!$J$2:$AI$216)-ROW(FEB!$J$2)+1),ROWS(D$3:D156))),\"\")","v":""}]
[null,{"$f":"IFERROR(INDEX(FEB!B$2:B$216,SMALL(IF(INDEX(FEB!$E$2:$AF$216,,MATCH($F$1,FEB!$E$1:$AJ$1,0))=$B$1,ROW(FEB!$J$2:$AI$216)-ROW(FEB!$J$2)+1),ROWS(B$3:B157))),\"\")","v":""},{"$f":"IFERROR(INDEX(FEB!C$2:C$216,SMALL(IF(INDEX(FEB!$E$2:$AF$216,,MATCH($F$1,FEB!$E$1:$AJ$1,0))=$B$1,ROW(FEB!$J$2:$AI$216)-ROW(FEB!$J$2)+1),ROWS(C$3:C157))),\"\")","v":""},{"$f":"IFERROR(INDEX(FEB!D$2:D$216,SMALL(IF(INDEX(FEB!$E$2:$AF$216,,MATCH($F$1,FEB!$E$1:$AJ$1,0))=$B$1,ROW(FEB!$J$2:$AI$216)-ROW(FEB!$J$2)+1),ROWS(D$3:D157))),\"\")","v":""}]
[null,{"$f":"IFERROR(INDEX(FEB!B$2:B$216,SMALL(IF(INDEX(FEB!$E$2:$AF$216,,MATCH($F$1,FEB!$E$1:$AJ$1,0))=$B$1,ROW(FEB!$J$2:$AI$216)-ROW(FEB!$J$2)+1),ROWS(B$3:B158))),\"\")","v":""},{"$f":"IFERROR(INDEX(FEB!C$2:C$216,SMALL(IF(INDEX(FEB!$E$2:$AF$216,,MATCH($F$1,FEB!$E$1:$AJ$1,0))=$B$1,ROW(FEB!$J$2:$AI$216)-ROW(FEB!$J$2)+1),ROWS(C$3:C158))),\"\")","v":""},{"$f":"IFERROR(INDEX(FEB!D$2:D$216,SMALL(IF(INDEX(FEB!$E$2:$AF$216,,MATCH($F$1,FEB!$E$1:$AJ$1,0))=$B$1,ROW(FEB!$J$2:$AI$216)-ROW(FEB!$J$2)+1),ROWS(D$3:D158))),\"\")","v":""}]
[null,{"$f":"IFERROR(INDEX(FEB!B$2:B$216,SMALL(IF(INDEX(FEB!$E$2:$AF$216,,MATCH($F$1,FEB!$E$1:$AJ$1,0))=$B$1,ROW(FEB!$J$2:$AI$216)-ROW(FEB!$J$2)+1),ROWS(B$3:B159))),\"\")","v":""},{"$f":"IFERROR(INDEX(FEB!C$2:C$216,SMALL(IF(INDEX(FEB!$E$2:$AF$216,,MATCH($F$1,FEB!$E$1:$AJ$1,0))=$B$1,ROW(FEB!$J$2:$AI$216)-ROW(FEB!$J$2)+1),ROWS(C$3:C159))),\"\")","v":""},{"$f":"IFERROR(INDEX(FEB!D$2:D$216,SMALL(IF(INDEX(FEB!$E$2:$AF$216,,MATCH($F$1,FEB!$E$1:$AJ$1,0))=$B$1,ROW(FEB!$J$2:$AI$216)-ROW(FEB!$J$2)+1),ROWS(D$3:D159))),\"\")","v":""}]
[null,{"$f":"IFERROR(INDEX(FEB!B$2:B$216,SMALL(IF(INDEX(FEB!$E$2:$AF$216,,MATCH($F$1,FEB!$E$1:$AJ$1,0))=$B$1,ROW(FEB!$J$2:$AI$216)-ROW(FEB!$J$2)+1),ROWS(B$3:B160))),\"\")","v":""},{"$f":"IFERROR(INDEX(FEB!C$2:C$216,SMALL(IF(INDEX(FEB!$E$2:$AF$216,,MATCH($F$1,FEB!$E$1:$AJ$1,0))=$B$1,ROW(FEB!$J$2:$AI$216)-ROW(FEB!$J$2)+1),ROWS(C$3:C160))),\"\")","v":""},{"$f":"IFERROR(INDEX(FEB!D$2:D$216,SMALL(IF(INDEX(FEB!$E$2:$AF$216,,MATCH($F$1,FEB!$E$1:$AJ$1,0))=$B$1,ROW(FEB!$J$2:$AI$216)-ROW(FEB!$J$2)+1),ROWS(D$3:D160))),\"\")","v":""}]
[null,{"$f":"IFERROR(INDEX(FEB!B$2:B$216,SMALL(IF(INDEX(FEB!$E$2:$AF$216,,MATCH($F$1,FEB!$E$1:$AJ$1,0))=$B$1,ROW(FEB!$J$2:$AI$216)-ROW(FEB!$J$2)+1),ROWS(B$3:B161))),\"\")","v":""},{"$f":"IFERROR(INDEX(FEB!C$2:C$216,SMALL(IF(INDEX(FEB!$E$2:$AF$216,,MATCH($F$1,FEB!$E$1:$AJ$1,0))=$B$1,ROW(FEB!$J$2:$AI$216)-ROW(FEB!$J$2)+1),ROWS(C$3:C161))),\"\")","v":""},{"$f":"IFERROR(INDEX(FEB!D$2:D$216,SMALL(IF(INDEX(FEB!$E$2:$AF$216,,MATCH($F$1,FEB!$E$1:$AJ$1,0))=$B$1,ROW(FEB!$J$2:$AI$216)-ROW(FEB!$J$2)+1),ROWS(D$3:D161))),\"\")","v":""}]
[null,{"$f":"IFERROR(INDEX(FEB!B$2:B$216,SMALL(IF(INDEX(FEB!$E$2:$AF$216,,MATCH($F$1,FEB!$E$1:$AJ$1,0))=$B$1,ROW(FEB!$J$2:$AI$216)-ROW(FEB!$J$2)+1),ROWS(B$3:B162))),\"\")","v":""},{"$f":"IFERROR(INDEX(FEB!C$2:C$216,SMALL(IF(INDEX(FEB!$E$2:$AF$216,,MATCH($F$1,FEB!$E$1:$AJ$1,0))=$B$1,ROW(FEB!$J$2:$AI$216)-ROW(FEB!$J$2)+1),ROWS(C$3:C162))),\"\")","v":""},{"$f":"IFERROR(INDEX(FEB!D$2:D$216,SMALL(IF(INDEX(FEB!$E$2:$AF$216,,MATCH($F$1,FEB!$E$1:$AJ$1,0))=$B$1,ROW(FEB!$J$2:$AI$216)-ROW(FEB!$J$2)+1),ROWS(D$3:D162))),\"\")","v":""}]
[null,{"$f":"IFERROR(INDEX(FEB!B$2:B$216,SMALL(IF(INDEX(FEB!$E$2:$AF$216,,MATCH($F$1,FEB!$E$1:$AJ$1,0))=$B$1,ROW(FEB!$J$2:$AI$216)-ROW(FEB!$J$2)+1),ROWS(B$3:B163))),\"\")","v":""},{"$f":"IFERROR(INDEX(FEB!C$2:C$216,SMALL(IF(INDEX(FEB!$E$2:$AF$216,,MATCH($F$1,FEB!$E$1:$AJ$1,0))=$B$1,ROW(FEB!$J$2:$AI$216)-ROW(FEB!$J$2)+1),ROWS(C$3:C163))),\"\")","v":""},{"$f":"IFERROR(INDEX(FEB!D$2:D$216,SMALL(IF(INDEX(FEB!$E$2:$AF$216,,MATCH($F$1,FEB!$E$1:$AJ$1,0))=$B$1,ROW(FEB!$J$2:$AI$216)-ROW(FEB!$J$2)+1),ROWS(D$3:D163))),\"\")","v":""}]
[null,{"$f":"IFERROR(INDEX(FEB!B$2:B$216,SMALL(IF(INDEX(FEB!$E$2:$AF$216,,MATCH($F$1,FEB!$E$1:$AJ$1,0))=$B$1,ROW(FEB!$J$2:$AI$216)-ROW(FEB!$J$2)+1),ROWS(B$3:B164))),\"\")","v":""},{"$f":"IFERROR(INDEX(FEB!C$2:C$216,SMALL(IF(INDEX(FEB!$E$2:$AF$216,,MATCH($F$1,FEB!$E$1:$AJ$1,0))=$B$1,ROW(FEB!$J$2:$AI$216)-ROW(FEB!$J$2)+1),ROWS(C$3:C164))),\"\")","v":""},{"$f":"IFERROR(INDEX(FEB!D$2:D$216,SMALL(IF(INDEX(FEB!$E$2:$AF$216,,MATCH($F$1,FEB!$E$1:$AJ$1,0))=$B$1,ROW(FEB!$J$2:$AI$216)-ROW(FEB!$J$2)+1),ROWS(D$3:D164))),\"\")","v":""}]
[null,{"$f":"IFERROR(INDEX(FEB!B$2:B$216,SMALL(IF(INDEX(FEB!$E$2:$AF$216,,MATCH($F$1,FEB!$E$1:$AJ$1,0))=$B$1,ROW(FEB!$J$2:$AI$216)-ROW(FEB!$J$2)+1),ROWS(B$3:B165))),\"\")","v":""},{"$f":"IFERROR(INDEX(FEB!C$2:C$216,SMALL(IF(INDEX(FEB!$E$2:$AF$216,,MATCH($F$1,FEB!$E$1:$AJ$1,0))=$B$1,ROW(FEB!$J$2:$AI$216)-ROW(FEB!$J$2)+1),ROWS(C$3:C165))),\"\")","v":""},{"$f":"IFERROR(INDEX(FEB!D$2:D$216,SMALL(IF(INDEX(FEB!$E$2:$AF$216,,MATCH($F$1,FEB!$E$1:$AJ$1,0))=$B$1,ROW(FEB!$J$2:$AI$216)-ROW(FEB!$J$2)+1),ROWS(D$3:D165))),\"\")","v":""}]
[null,{"$f":"IFERROR(INDEX(FEB!B$2:B$216,SMALL(IF(INDEX(FEB!$E$2:$AF$216,,MATCH($F$1,FEB!$E$1:$AJ$1,0))=$B$1,ROW(FEB!$J$2:$AI$216)-ROW(FEB!$J$2)+1),ROWS(B$3:B166))),\"\")","v":""},{"$f":"IFERROR(INDEX(FEB!C$2:C$216,SMALL(IF(INDEX(FEB!$E$2:$AF$216,,MATCH($F$1,FEB!$E$1:$AJ$1,0))=$B$1,ROW(FEB!$J$2:$AI$216)-ROW(FEB!$J$2)+1),ROWS(C$3:C166))),\"\")","v":""},{"$f":"IFERROR(INDEX(FEB!D$2:D$216,SMALL(IF(INDEX(FEB!$E$2:$AF$216,,MATCH($F$1,FEB!$E$1:$AJ$1,0))=$B$1,ROW(FEB!$J$2:$AI$216)-ROW(FEB!$J$2)+1),ROWS(D$3:D166))),\"\")","v":""}]
[null,{"$f":"IFERROR(INDEX(FEB!B$2:B$216,SMALL(IF(INDEX(FEB!$E$2:$AF$216,,MATCH($F$1,FEB!$E$1:$AJ$1,0))=$B$1,ROW(FEB!$J$2:$AI$216)-ROW(FEB!$J$2)+1),ROWS(B$3:B167))),\"\")","v":""},{"$f":"IFERROR(INDEX(FEB!C$2:C$216,SMALL(IF(INDEX(FEB!$E$2:$AF$216,,MATCH($F$1,FEB!$E$1:$AJ$1,0))=$B$1,ROW(FEB!$J$2:$AI$216)-ROW(FEB!$J$2)+1),ROWS(C$3:C167))),\"\")","v":""},{"$f":"IFERROR(INDEX(FEB!D$2:D$216,SMALL(IF(INDEX(FEB!$E$2:$AF$216,,MATCH($F$1,FEB!$E$1:$AJ$1,0))=$B$1,ROW(FEB!$J$2:$AI$216)-ROW(FEB!$J$2)+1),ROWS(D$3:D167))),\"\")","v":""}]
[null,{"$f":"IFERROR(INDEX(FEB!B$2:B$216,SMALL(IF(INDEX(FEB!$E$2:$AF$216,,MATCH($F$1,FEB!$E$1:$AJ$1,0))=$B$1,ROW(FEB!$J$2:$AI$216)-ROW(FEB!$J$2)+1),ROWS(B$3:B168))),\"\")","v":""},{"$f":"IFERROR(INDEX(FEB!C$2:C$216,SMALL(IF(INDEX(FEB!$E$2:$AF$216,,MATCH($F$1,FEB!$E$1:$AJ$1,0))=$B$1,ROW(FEB!$J$2:$AI$216)-ROW(FEB!$J$2)+1),ROWS(C$3:C168))),\"\")","v":""},{"$f":"IFERROR(INDEX(FEB!D$2:D$216,SMALL(IF(INDEX(FEB!$E$2:$AF$216,,MATCH($F$1,FEB!$E$1:$AJ$1,0))=$B$1,ROW(FEB!$J$2:$AI$216)-ROW(FEB!$J$2)+1),ROWS(D$3:D168))),\"\")","v":""}]
[null,{"$f":"IFERROR(INDEX(FEB!B$2:B$216,SMALL(IF(INDEX(FEB!$E$2:$AF$216,,MATCH($F$1,FEB!$E$1:$AJ$1,0))=$B$1,ROW(FEB!$J$2:$AI$216)-ROW(FEB!$J$2)+1),ROWS(B$3:B169))),\"\")","v":""},{"$f":"IFERROR(INDEX(FEB!C$2:C$216,SMALL(IF(INDEX(FEB!$E$2:$AF$216,,MATCH($F$1,FEB!$E$1:$AJ$1,0))=$B$1,ROW(FEB!$J$2:$AI$216)-ROW(FEB!$J$2)+1),ROWS(C$3:C169))),\"\")","v":""},{"$f":"IFERROR(INDEX(FEB!D$2:D$216,SMALL(IF(INDEX(FEB!$E$2:$AF$216,,MATCH($F$1,FEB!$E$1:$AJ$1,0))=$B$1,ROW(FEB!$J$2:$AI$216)-ROW(FEB!$J$2)+1),ROWS(D$3:D169))),\"\")","v":""}]
[null,{"$f":"IFERROR(INDEX(FEB!B$2:B$216,SMALL(IF(INDEX(FEB!$E$2:$AF$216,,MATCH($F$1,FEB!$E$1:$AJ$1,0))=$B$1,ROW(FEB!$J$2:$AI$216)-ROW(FEB!$J$2)+1),ROWS(B$3:B170))),\"\")","v":""},{"$f":"IFERROR(INDEX(FEB!C$2:C$216,SMALL(IF(INDEX(FEB!$E$2:$AF$216,,MATCH($F$1,FEB!$E$1:$AJ$1,0))=$B$1,ROW(FEB!$J$2:$AI$216)-ROW(FEB!$J$2)+1),ROWS(C$3:C170))),\"\")","v":""},{"$f":"IFERROR(INDEX(FEB!D$2:D$216,SMALL(IF(INDEX(FEB!$E$2:$AF$216,,MATCH($F$1,FEB!$E$1:$AJ$1,0))=$B$1,ROW(FEB!$J$2:$AI$216)-ROW(FEB!$J$2)+1),ROWS(D$3:D170))),\"\")","v":""}]
[null,{"$f":"IFERROR(INDEX(FEB!B$2:B$216,SMALL(IF(INDEX(FEB!$E$2:$AF$216,,MATCH($F$1,FEB!$E$1:$AJ$1,0))=$B$1,ROW(FEB!$J$2:$AI$216)-ROW(FEB!$J$2)+1),ROWS(B$3:B171))),\"\")","v":""},{"$f":"IFERROR(INDEX(FEB!C$2:C$216,SMALL(IF(INDEX(FEB!$E$2:$AF$216,,MATCH($F$1,FEB!$E$1:$AJ$1,0))=$B$1,ROW(FEB!$J$2:$AI$216)-ROW(FEB!$J$2)+1),ROWS(C$3:C171))),\"\")","v":""},{"$f":"IFERROR(INDEX(FEB!D$2:D$216,SMALL(IF(INDEX(FEB!$E$2:$AF$216,,MATCH($F$1,FEB!$E$1:$AJ$1,0))=$B$1,ROW(FEB!$J$2:$AI$216)-ROW(FEB!$J$2)+1),ROWS(D$3:D171))),\"\")","v":""}]
[null,{"$f":"IFERROR(INDEX(FEB!B$2:B$216,SMALL(IF(INDEX(FEB!$E$2:$AF$216,,MATCH($F$1,FEB!$E$1:$AJ$1,0))=$B$1,ROW(FEB!$J$2:$AI$216)-ROW(FEB!$J$2)+1),ROWS(B$3:B172))),\"\")","v":""},{"$f":"IFERROR(INDEX(FEB!C$2:C$216,SMALL(IF(INDEX(FEB!$E$2:$AF$216,,MATCH($F$1,FEB!$E$1:$AJ$1,0))=$B$1,ROW(FEB!$J$2:$AI$216)-ROW(FEB!$J$2)+1),ROWS(C$3:C172))),\"\")","v":""},{"$f":"IFERROR(INDEX(FEB!D$2:D$216,SMALL(IF(INDEX(FEB!$E$2:$AF$216,,MATCH($F$1,FEB!$E$1:$AJ$1,0))=$B$1,ROW(FEB!$J$2:$AI$216)-ROW(FEB!$J$2)+1),ROWS(D$3:D172))),\"\")","v":""}]
[null,{"$f":"IFERROR(INDEX(FEB!B$2:B$216,SMALL(IF(INDEX(FEB!$E$2:$AF$216,,MATCH($F$1,FEB!$E$1:$AJ$1,0))=$B$1,ROW(FEB!$J$2:$AI$216)-ROW(FEB!$J$2)+1),ROWS(B$3:B173))),\"\")","v":""},{"$f":"IFERROR(INDEX(FEB!C$2:C$216,SMALL(IF(INDEX(FEB!$E$2:$AF$216,,MATCH($F$1,FEB!$E$1:$AJ$1,0))=$B$1,ROW(FEB!$J$2:$AI$216)-ROW(FEB!$J$2)+1),ROWS(C$3:C173))),\"\")","v":""},{"$f":"IFERROR(INDEX(FEB!D$2:D$216,SMALL(IF(INDEX(FEB!$E$2:$AF$216,,MATCH($F$1,FEB!$E$1:$AJ$1,0))=$B$1,ROW(FEB!$J$2:$AI$216)-ROW(FEB!$J$2)+1),ROWS(D$3:D173))),\"\")","v":""}]
[null,{"$f":"IFERROR(INDEX(FEB!B$2:B$216,SMALL(IF(INDEX(FEB!$E$2:$AF$216,,MATCH($F$1,FEB!$E$1:$AJ$1,0))=$B$1,ROW(FEB!$J$2:$AI$216)-ROW(FEB!$J$2)+1),ROWS(B$3:B174))),\"\")","v":""},{"$f":"IFERROR(INDEX(FEB!C$2:C$216,SMALL(IF(INDEX(FEB!$E$2:$AF$216,,MATCH($F$1,FEB!$E$1:$AJ$1,0))=$B$1,ROW(FEB!$J$2:$AI$216)-ROW(FEB!$J$2)+1),ROWS(C$3:C174))),\"\")","v":""},{"$f":"IFERROR(INDEX(FEB!D$2:D$216,SMALL(IF(INDEX(FEB!$E$2:$AF$216,,MATCH($F$1,FEB!$E$1:$AJ$1,0))=$B$1,ROW(FEB!$J$2:$AI$216)-ROW(FEB!$J$2)+1),ROWS(D$3:D174))),\"\")","v":""}]
[null,{"$f":"IFERROR(INDEX(FEB!B$2:B$216,SMALL(IF(INDEX(FEB!$E$2:$AF$216,,MATCH($F$1,FEB!$E$1:$AJ$1,0))=$B$1,ROW(FEB!$J$2:$AI$216)-ROW(FEB!$J$2)+1),ROWS(B$3:B175))),\"\")","v":""},{"$f":"IFERROR(INDEX(FEB!C$2:C$216,SMALL(IF(INDEX(FEB!$E$2:$AF$216,,MATCH($F$1,FEB!$E$1:$AJ$1,0))=$B$1,ROW(FEB!$J$2:$AI$216)-ROW(FEB!$J$2)+1),ROWS(C$3:C175))),\"\")","v":""},{"$f":"IFERROR(INDEX(FEB!D$2:D$216,SMALL(IF(INDEX(FEB!$E$2:$AF$216,,MATCH($F$1,FEB!$E$1:$AJ$1,0))=$B$1,ROW(FEB!$J$2:$AI$216)-ROW(FEB!$J$2)+1),ROWS(D$3:D175))),\"\")","v":""}]
[null,{"$f":"IFERROR(INDEX(FEB!B$2:B$216,SMALL(IF(INDEX(FEB!$E$2:$AF$216,,MATCH($F$1,FEB!$E$1:$AJ$1,0))=$B$1,ROW(FEB!$J$2:$AI$216)-ROW(FEB!$J$2)+1),ROWS(B$3:B176))),\"\")","v":""},{"$f":"IFERROR(INDEX(FEB!C$2:C$216,SMALL(IF(INDEX(FEB!$E$2:$AF$216,,MATCH($F$1,FEB!$E$1:$AJ$1,0))=$B$1,ROW(FEB!$J$2:$AI$216)-ROW(FEB!$J$2)+1),ROWS(C$3:C176))),\"\")","v":""},{"$f":"IFERROR(INDEX(FEB!D$2:D$216,SMALL(IF(INDEX(FEB!$E$2:$AF$216,,MATCH($F$1,FEB!$E$1:$AJ$1,0))=$B$1,ROW(FEB!$J$2:$AI$216)-ROW(FEB!$J$2)+1),ROWS(D$3:D176))),\"\")","v":""}]
[null,{"$f":"IFERROR(INDEX(FEB!B$2:B$216,SMALL(IF(INDEX(FEB!$E$2:$AF$216,,MATCH($F$1,FEB!$E$1:$AJ$1,0))=$B$1,ROW(FEB!$J$2:$AI$216)-ROW(FEB!$J$2)+1),ROWS(B$3:B177))),\"\")","v":""},{"$f":"IFERROR(INDEX(FEB!C$2:C$216,SMALL(IF(INDEX(FEB!$E$2:$AF$216,,MATCH($F$1,FEB!$E$1:$AJ$1,0))=$B$1,ROW(FEB!$J$2:$AI$216)-ROW(FEB!$J$2)+1),ROWS(C$3:C177))),\"\")","v":""},{"$f":"IFERROR(INDEX(FEB!D$2:D$216,SMALL(IF(INDEX(FEB!$E$2:$AF$216,,MATCH($F$1,FEB!$E$1:$AJ$1,0))=$B$1,ROW(FEB!$J$2:$AI$216)-ROW(FEB!$J$2)+1),ROWS(D$3:D177))),\"\")","v":""}]
[null,{"$f":"IFERROR(INDEX(FEB!B$2:B$216,SMALL(IF(INDEX(FEB!$E$2:$AF$216,,MATCH($F$1,FEB!$E$1:$AJ$1,0))=$B$1,ROW(FEB!$J$2:$AI$216)-ROW(FEB!$J$2)+1),ROWS(B$3:B178))),\"\")","v":""},{"$f":"IFERROR(INDEX(FEB!C$2:C$216,SMALL(IF(INDEX(FEB!$E$2:$AF$216,,MATCH($F$1,FEB!$E$1:$AJ$1,0))=$B$1,ROW(FEB!$J$2:$AI$216)-ROW(FEB!$J$2)+1),ROWS(C$3:C178))),\"\")","v":""},{"$f":"IFERROR(INDEX(FEB!D$2:D$216,SMALL(IF(INDEX(FEB!$E$2:$AF$216,,MATCH($F$1,FEB!$E$1:$AJ$1,0))=$B$1,ROW(FEB!$J$2:$AI$216)-ROW(FEB!$J$2)+1),ROWS(D$3:D178))),\"\")","v":""}]
[null,{"$f":"IFERROR(INDEX(FEB!B$2:B$216,SMALL(IF(INDEX(FEB!$E$2:$AF$216,,MATCH($F$1,FEB!$E$1:$AJ$1,0))=$B$1,ROW(FEB!$J$2:$AI$216)-ROW(FEB!$J$2)+1),ROWS(B$3:B179))),\"\")","v":""},{"$f":"IFERROR(INDEX(FEB!C$2:C$216,SMALL(IF(INDEX(FEB!$E$2:$AF$216,,MATCH($F$1,FEB!$E$1:$AJ$1,0))=$B$1,ROW(FEB!$J$2:$AI$216)-ROW(FEB!$J$2)+1),ROWS(C$3:C179))),\"\")","v":""},{"$f":"IFERROR(INDEX(FEB!D$2:D$216,SMALL(IF(INDEX(FEB!$E$2:$AF$216,,MATCH($F$1,FEB!$E$1:$AJ$1,0))=$B$1,ROW(FEB!$J$2:$AI$216)-ROW(FEB!$J$2)+1),ROWS(D$3:D179))),\"\")","v":""}]
[null,{"$f":"IFERROR(INDEX(FEB!B$2:B$216,SMALL(IF(INDEX(FEB!$E$2:$AF$216,,MATCH($F$1,FEB!$E$1:$AJ$1,0))=$B$1,ROW(FEB!$J$2:$AI$216)-ROW(FEB!$J$2)+1),ROWS(B$3:B180))),\"\")","v":""},{"$f":"IFERROR(INDEX(FEB!C$2:C$216,SMALL(IF(INDEX(FEB!$E$2:$AF$216,,MATCH($F$1,FEB!$E$1:$AJ$1,0))=$B$1,ROW(FEB!$J$2:$AI$216)-ROW(FEB!$J$2)+1),ROWS(C$3:C180))),\"\")","v":""},{"$f":"IFERROR(INDEX(FEB!D$2:D$216,SMALL(IF(INDEX(FEB!$E$2:$AF$216,,MATCH($F$1,FEB!$E$1:$AJ$1,0))=$B$1,ROW(FEB!$J$2:$AI$216)-ROW(FEB!$J$2)+1),ROWS(D$3:D180))),\"\")","v":""}]
[null,{"$f":"IFERROR(INDEX(FEB!B$2:B$216,SMALL(IF(INDEX(FEB!$E$2:$AF$216,,MATCH($F$1,FEB!$E$1:$AJ$1,0))=$B$1,ROW(FEB!$J$2:$AI$216)-ROW(FEB!$J$2)+1),ROWS(B$3:B181))),\"\")","v":""},{"$f":"IFERROR(INDEX(FEB!C$2:C$216,SMALL(IF(INDEX(FEB!$E$2:$AF$216,,MATCH($F$1,FEB!$E$1:$AJ$1,0))=$B$1,ROW(FEB!$J$2:$AI$216)-ROW(FEB!$J$2)+1),ROWS(C$3:C181))),\"\")","v":""},{"$f":"IFERROR(INDEX(FEB!D$2:D$216,SMALL(IF(INDEX(FEB!$E$2:$AF$216,,MATCH($F$1,FEB!$E$1:$AJ$1,0))=$B$1,ROW(FEB!$J$2:$AI$216)-ROW(FEB!$J$2)+1),ROWS(D$3:D181))),\"\")","v":""}]
[null,{"$f":"IFERROR(INDEX(FEB!B$2:B$216,SMALL(IF(INDEX(FEB!$E$2:$AF$216,,MATCH($F$1,FEB!$E$1:$AJ$1,0))=$B$1,ROW(FEB!$J$2:$AI$216)-ROW(FEB!$J$2)+1),ROWS(B$3:B182))),\"\")","v":""},{"$f":"IFERROR(INDEX(FEB!C$2:C$216,SMALL(IF(INDEX(FEB!$E$2:$AF$216,,MATCH($F$1,FEB!$E$1:$AJ$1,0))=$B$1,ROW(FEB!$J$2:$AI$216)-ROW(FEB!$J$2)+1),ROWS(C$3:C182))),\"\")","v":""},{"$f":"IFERROR(INDEX(FEB!D$2:D$216,SMALL(IF(INDEX(FEB!$E$2:$AF$216,,MATCH($F$1,FEB!$E$1:$AJ$1,0))=$B$1,ROW(FEB!$J$2:$AI$216)-ROW(FEB!$J$2)+1),ROWS(D$3:D182))),\"\")","v":""}]
[null,{"$f":"IFERROR(INDEX(FEB!B$2:B$216,SMALL(IF(INDEX(FEB!$E$2:$AF$216,,MATCH($F$1,FEB!$E$1:$AJ$1,0))=$B$1,ROW(FEB!$J$2:$AI$216)-ROW(FEB!$J$2)+1),ROWS(B$3:B183))),\"\")","v":""},{"$f":"IFERROR(INDEX(FEB!C$2:C$216,SMALL(IF(INDEX(FEB!$E$2:$AF$216,,MATCH($F$1,FEB!$E$1:$AJ$1,0))=$B$1,ROW(FEB!$J$2:$AI$216)-ROW(FEB!$J$2)+1),ROWS(C$3:C183))),\"\")","v":""},{"$f":"IFERROR(INDEX(FEB!D$2:D$216,SMALL(IF(INDEX(FEB!$E$2:$AF$216,,MATCH($F$1,FEB!$E$1:$AJ$1,0))=$B$1,ROW(FEB!$J$2:$AI$216)-ROW(FEB!$J$2)+1),ROWS(D$3:D183))),\"\")","v":""}]
[null,{"$f":"IFERROR(INDEX(FEB!B$2:B$216,SMALL(IF(INDEX(FEB!$E$2:$AF$216,,MATCH($F$1,FEB!$E$1:$AJ$1,0))=$B$1,ROW(FEB!$J$2:$AI$216)-ROW(FEB!$J$2)+1),ROWS(B$3:B184))),\"\")","v":""},{"$f":"IFERROR(INDEX(FEB!C$2:C$216,SMALL(IF(INDEX(FEB!$E$2:$AF$216,,MATCH($F$1,FEB!$E$1:$AJ$1,0))=$B$1,ROW(FEB!$J$2:$AI$216)-ROW(FEB!$J$2)+1),ROWS(C$3:C184))),\"\")","v":""},{"$f":"IFERROR(INDEX(FEB!D$2:D$216,SMALL(IF(INDEX(FEB!$E$2:$AF$216,,MATCH($F$1,FEB!$E$1:$AJ$1,0))=$B$1,ROW(FEB!$J$2:$AI$216)-ROW(FEB!$J$2)+1),ROWS(D$3:D184))),\"\")","v":""}]
[null,{"$f":"IFERROR(INDEX(FEB!B$2:B$216,SMALL(IF(INDEX(FEB!$E$2:$AF$216,,MATCH($F$1,FEB!$E$1:$AJ$1,0))=$B$1,ROW(FEB!$J$2:$AI$216)-ROW(FEB!$J$2)+1),ROWS(B$3:B185))),\"\")","v":""},{"$f":"IFERROR(INDEX(FEB!C$2:C$216,SMALL(IF(INDEX(FEB!$E$2:$AF$216,,MATCH($F$1,FEB!$E$1:$AJ$1,0))=$B$1,ROW(FEB!$J$2:$AI$216)-ROW(FEB!$J$2)+1),ROWS(C$3:C185))),\"\")","v":""},{"$f":"IFERROR(INDEX(FEB!D$2:D$216,SMALL(IF(INDEX(FEB!$E$2:$AF$216,,MATCH($F$1,FEB!$E$1:$AJ$1,0))=$B$1,ROW(FEB!$J$2:$AI$216)-ROW(FEB!$J$2)+1),ROWS(D$3:D185))),\"\")","v":""}]
[null,{"$f":"IFERROR(INDEX(FEB!B$2:B$216,SMALL(IF(INDEX(FEB!$E$2:$AF$216,,MATCH($F$1,FEB!$E$1:$AJ$1,0))=$B$1,ROW(FEB!$J$2:$AI$216)-ROW(FEB!$J$2)+1),ROWS(B$3:B186))),\"\")","v":""},{"$f":"IFERROR(INDEX(FEB!C$2:C$216,SMALL(IF(INDEX(FEB!$E$2:$AF$216,,MATCH($F$1,FEB!$E$1:$AJ$1,0))=$B$1,ROW(FEB!$J$2:$AI$216)-ROW(FEB!$J$2)+1),ROWS(C$3:C186))),\"\")","v":""},{"$f":"IFERROR(INDEX(FEB!D$2:D$216,SMALL(IF(INDEX(FEB!$E$2:$AF$216,,MATCH($F$1,FEB!$E$1:$AJ$1,0))=$B$1,ROW(FEB!$J$2:$AI$216)-ROW(FEB!$J$2)+1),ROWS(D$3:D186))),\"\")","v":""}]
[null,{"$f":"IFERROR(INDEX(FEB!B$2:B$216,SMALL(IF(INDEX(FEB!$E$2:$AF$216,,MATCH($F$1,FEB!$E$1:$AJ$1,0))=$B$1,ROW(FEB!$J$2:$AI$216)-ROW(FEB!$J$2)+1),ROWS(B$3:B187))),\"\")","v":""},{"$f":"IFERROR(INDEX(FEB!C$2:C$216,SMALL(IF(INDEX(FEB!$E$2:$AF$216,,MATCH($F$1,FEB!$E$1:$AJ$1,0))=$B$1,ROW(FEB!$J$2:$AI$216)-ROW(FEB!$J$2)+1),ROWS(C$3:C187))),\"\")","v":""},{"$f":"IFERROR(INDEX(FEB!D$2:D$216,SMALL(IF(INDEX(FEB!$E$2:$AF$216,,MATCH($F$1,FEB!$E$1:$AJ$1,0))=$B$1,ROW(FEB!$J$2:$AI$216)-ROW(FEB!$J$2)+1),ROWS(D$3:D187))),\"\")","v":""}]
[null,{"$f":"IFERROR(INDEX(FEB!B$2:B$216,SMALL(IF(INDEX(FEB!$E$2:$AF$216,,MATCH($F$1,FEB!$E$1:$AJ$1,0))=$B$1,ROW(FEB!$J$2:$AI$216)-ROW(FEB!$J$2)+1),ROWS(B$3:B188))),\"\")","v":""},{"$f":"IFERROR(INDEX(FEB!C$2:C$216,SMALL(IF(INDEX(FEB!$E$2:$AF$216,,MATCH($F$1,FEB!$E$1:$AJ$1,0))=$B$1,ROW(FEB!$J$2:$AI$216)-ROW(FEB!$J$2)+1),ROWS(C$3:C188))),\"\")","v":""},{"$f":"IFERROR(INDEX(FEB!D$2:D$216,SMALL(IF(INDEX(FEB!$E$2:$AF$216,,MATCH($F$1,FEB!$E$1:$AJ$1,0))=$B$1,ROW(FEB!$J$2:$AI$216)-ROW(FEB!$J$2)+1),ROWS(D$3:D188))),\"\")","v":""}]
[null,{"$f":"IFERROR(INDEX(FEB!B$2:B$216,SMALL(IF(INDEX(FEB!$E$2:$AF$216,,MATCH($F$1,FEB!$E$1:$AJ$1,0))=$B$1,ROW(FEB!$J$2:$AI$216)-ROW(FEB!$J$2)+1),ROWS(B$3:B189))),\"\")","v":""},{"$f":"IFERROR(INDEX(FEB!C$2:C$216,SMALL(IF(INDEX(FEB!$E$2:$AF$216,,MATCH($F$1,FEB!$E$1:$AJ$1,0))=$B$1,ROW(FEB!$J$2:$AI$216)-ROW(FEB!$J$2)+1),ROWS(C$3:C189))),\"\")","v":""},{"$f":"IFERROR(INDEX(FEB!D$2:D$216,SMALL(IF(INDEX(FEB!$E$2:$AF$216,,MATCH($F$1,FEB!$E$1:$AJ$1,0))=$B$1,ROW(FEB!$J$2:$AI$216)-ROW(FEB!$J$2)+1),ROWS(D$3:D189))),\"\")","v":""}]
[null,{"$f":"IFERROR(INDEX(FEB!B$2:B$216,SMALL(IF(INDEX(FEB!$E$2:$AF$216,,MATCH($F$1,FEB!$E$1:$AJ$1,0))=$B$1,ROW(FEB!$J$2:$AI$216)-ROW(FEB!$J$2)+1),ROWS(B$3:B190))),\"\")","v":""},{"$f":"IFERROR(INDEX(FEB!C$2:C$216,SMALL(IF(INDEX(FEB!$E$2:$AF$216,,MATCH($F$1,FEB!$E$1:$AJ$1,0))=$B$1,ROW(FEB!$J$2:$AI$216)-ROW(FEB!$J$2)+1),ROWS(C$3:C190))),\"\")","v":""},{"$f":"IFERROR(INDEX(FEB!D$2:D$216,SMALL(IF(INDEX(FEB!$E$2:$AF$216,,MATCH($F$1,FEB!$E$1:$AJ$1,0))=$B$1,ROW(FEB!$J$2:$AI$216)-ROW(FEB!$J$2)+1),ROWS(D$3:D190))),\"\")","v":""}]
[null,{"$f":"IFERROR(INDEX(FEB!B$2:B$216,SMALL(IF(INDEX(FEB!$E$2:$AF$216,,MATCH($F$1,FEB!$E$1:$AJ$1,0))=$B$1,ROW(FEB!$J$2:$AI$216)-ROW(FEB!$J$2)+1),ROWS(B$3:B191))),\"\")","v":""},{"$f":"IFERROR(INDEX(FEB!C$2:C$216,SMALL(IF(INDEX(FEB!$E$2:$AF$216,,MATCH($F$1,FEB!$E$1:$AJ$1,0))=$B$1,ROW(FEB!$J$2:$AI$216)-ROW(FEB!$J$2)+1),ROWS(C$3:C191))),\"\")","v":""},{"$f":"IFERROR(INDEX(FEB!D$2:D$216,SMALL(IF(INDEX(FEB!$E$2:$AF$216,,MATCH($F$1,FEB!$E$1:$AJ$1,0))=$B$1,ROW(FEB!$J$2:$AI$216)-ROW(FEB!$J$2)+1),ROWS(D$3:D191))),\"\")","v":""}]
[null,{"$f":"IFERROR(INDEX(FEB!B$2:B$216,SMALL(IF(INDEX(FEB!$E$2:$AF$216,,MATCH($F$1,FEB!$E$1:$AJ$1,0))=$B$1,ROW(FEB!$J$2:$AI$216)-ROW(FEB!$J$2)+1),ROWS(B$3:B192))),\"\")","v":""},{"$f":"IFERROR(INDEX(FEB!C$2:C$216,SMALL(IF(INDEX(FEB!$E$2:$AF$216,,MATCH($F$1,FEB!$E$1:$AJ$1,0))=$B$1,ROW(FEB!$J$2:$AI$216)-ROW(FEB!$J$2)+1),ROWS(C$3:C192))),\"\")","v":""},{"$f":"IFERROR(INDEX(FEB!D$2:D$216,SMALL(IF(INDEX(FEB!$E$2:$AF$216,,MATCH($F$1,FEB!$E$1:$AJ$1,0))=$B$1,ROW(FEB!$J$2:$AI$216)-ROW(FEB!$J$2)+1),ROWS(D$3:D192))),\"\")","v":""}]
[null,{"$f":"IFERROR(INDEX(FEB!B$2:B$216,SMALL(IF(INDEX(FEB!$E$2:$AF$216,,MATCH($F$1,FEB!$E$1:$AJ$1,0))=$B$1,ROW(FEB!$J$2:$AI$216)-ROW(FEB!$J$2)+1),ROWS(B$3:B193))),\"\")","v":""},{"$f":"IFERROR(INDEX(FEB!C$2:C$216,SMALL(IF(INDEX(FEB!$E$2:$AF$216,,MATCH($F$1,FEB!$E$1:$AJ$1,0))=$B$1,ROW(FEB!$J$2:$AI$216)-ROW(FEB!$J$2)+1),ROWS(C$3:C193))),\"\")","v":""},{"$f":"IFERROR(INDEX(FEB!D$2:D$216,SMALL(IF(INDEX(FEB!$E$2:$AF$216,,MATCH($F$1,FEB!$E$1:$AJ$1,0))=$B$1,ROW(FEB!$J$2:$AI$216)-ROW(FEB!$J$2)+1),ROWS(D$3:D193))),\"\")","v":""}]
[null,{"$f":"IFERROR(INDEX(FEB!B$2:B$216,SMALL(IF(INDEX(FEB!$E$2:$AF$216,,MATCH($F$1,FEB!$E$1:$AJ$1,0))=$B$1,ROW(FEB!$J$2:$AI$216)-ROW(FEB!$J$2)+1),ROWS(B$3:B194))),\"\")","v":""},{"$f":"IFERROR(INDEX(FEB!C$2:C$216,SMALL(IF(INDEX(FEB!$E$2:$AF$216,,MATCH($F$1,FEB!$E$1:$AJ$1,0))=$B$1,ROW(FEB!$J$2:$AI$216)-ROW(FEB!$J$2)+1),ROWS(C$3:C194))),\"\")","v":""},{"$f":"IFERROR(INDEX(FEB!D$2:D$216,SMALL(IF(INDEX(FEB!$E$2:$AF$216,,MATCH($F$1,FEB!$E$1:$AJ$1,0))=$B$1,ROW(FEB!$J$2:$AI$216)-ROW(FEB!$J$2)+1),ROWS(D$3:D194))),\"\")","v":""}]
[null,{"$f":"IFERROR(INDEX(FEB!B$2:B$216,SMALL(IF(INDEX(FEB!$E$2:$AF$216,,MATCH($F$1,FEB!$E$1:$AJ$1,0))=$B$1,ROW(FEB!$J$2:$AI$216)-ROW(FEB!$J$2)+1),ROWS(B$3:B195))),\"\")","v":""},{"$f":"IFERROR(INDEX(FEB!C$2:C$216,SMALL(IF(INDEX(FEB!$E$2:$AF$216,,MATCH($F$1,FEB!$E$1:$AJ$1,0))=$B$1,ROW(FEB!$J$2:$AI$216)-ROW(FEB!$J$2)+1),ROWS(C$3:C195))),\"\")","v":""},{"$f":"IFERROR(INDEX(FEB!D$2:D$216,SMALL(IF(INDEX(FEB!$E$2:$AF$216,,MATCH($F$1,FEB!$E$1:$AJ$1,0))=$B$1,ROW(FEB!$J$2:$AI$216)-ROW(FEB!$J$2)+1),ROWS(D$3:D195))),\"\")","v":""}]
[null,{"$f":"IFERROR(INDEX(FEB!B$2:B$216,SMALL(IF(INDEX(FEB!$E$2:$AF$216,,MATCH($F$1,FEB!$E$1:$AJ$1,0))=$B$1,ROW(FEB!$J$2:$AI$216)-ROW(FEB!$J$2)+1),ROWS(B$3:B196))),\"\")","v":""},{"$f":"IFERROR(INDEX(FEB!C$2:C$216,SMALL(IF(INDEX(FEB!$E$2:$AF$216,,MATCH($F$1,FEB!$E$1:$AJ$1,0))=$B$1,ROW(FEB!$J$2:$AI$216)-ROW(FEB!$J$2)+1),ROWS(C$3:C196))),\"\")","v":""},{"$f":"IFERROR(INDEX(FEB!D$2:D$216,SMALL(IF(INDEX(FEB!$E$2:$AF$216,,MATCH($F$1,FEB!$E$1:$AJ$1,0))=$B$1,ROW(FEB!$J$2:$AI$216)-ROW(FEB!$J$2)+1),ROWS(D$3:D196))),\"\")","v":""}]
[null,{"$f":"IFERROR(INDEX(FEB!B$2:B$216,SMALL(IF(INDEX(FEB!$E$2:$AF$216,,MATCH($F$1,FEB!$E$1:$AJ$1,0))=$B$1,ROW(FEB!$J$2:$AI$216)-ROW(FEB!$J$2)+1),ROWS(B$3:B197))),\"\")","v":""},{"$f":"IFERROR(INDEX(FEB!C$2:C$216,SMALL(IF(INDEX(FEB!$E$2:$AF$216,,MATCH($F$1,FEB!$E$1:$AJ$1,0))=$B$1,ROW(FEB!$J$2:$AI$216)-ROW(FEB!$J$2)+1),ROWS(C$3:C197))),\"\")","v":""},{"$f":"IFERROR(INDEX(FEB!D$2:D$216,SMALL(IF(INDEX(FEB!$E$2:$AF$216,,MATCH($F$1,FEB!$E$1:$AJ$1,0))=$B$1,ROW(FEB!$J$2:$AI$216)-ROW(FEB!$J$2)+1),ROWS(D$3:D197))),\"\")","v":""}]
[null,{"$f":"IFERROR(INDEX(FEB!B$2:B$216,SMALL(IF(INDEX(FEB!$E$2:$AF$216,,MATCH($F$1,FEB!$E$1:$AJ$1,0))=$B$1,ROW(FEB!$J$2:$AI$216)-ROW(FEB!$J$2)+1),ROWS(B$3:B198))),\"\")","v":""},{"$f":"IFERROR(INDEX(FEB!C$2:C$216,SMALL(IF(INDEX(FEB!$E$2:$AF$216,,MATCH($F$1,FEB!$E$1:$AJ$1,0))=$B$1,ROW(FEB!$J$2:$AI$216)-ROW(FEB!$J$2)+1),ROWS(C$3:C198))),\"\")","v":""},{"$f":"IFERROR(INDEX(FEB!D$2:D$216,SMALL(IF(INDEX(FEB!$E$2:$AF$216,,MATCH($F$1,FEB!$E$1:$AJ$1,0))=$B$1,ROW(FEB!$J$2:$AI$216)-ROW(FEB!$J$2)+1),ROWS(D$3:D198))),\"\")","v":""}]
[null,{"$f":"IFERROR(INDEX(FEB!B$2:B$216,SMALL(IF(INDEX(FEB!$E$2:$AF$216,,MATCH($F$1,FEB!$E$1:$AJ$1,0))=$B$1,ROW(FEB!$J$2:$AI$216)-ROW(FEB!$J$2)+1),ROWS(B$3:B199))),\"\")","v":""},{"$f":"IFERROR(INDEX(FEB!C$2:C$216,SMALL(IF(INDEX(FEB!$E$2:$AF$216,,MATCH($F$1,FEB!$E$1:$AJ$1,0))=$B$1,ROW(FEB!$J$2:$AI$216)-ROW(FEB!$J$2)+1),ROWS(C$3:C199))),\"\")","v":""},{"$f":"IFERROR(INDEX(FEB!D$2:D$216,SMALL(IF(INDEX(FEB!$E$2:$AF$216,,MATCH($F$1,FEB!$E$1:$AJ$1,0))=$B$1,ROW(FEB!$J$2:$AI$216)-ROW(FEB!$J$2)+1),ROWS(D$3:D199))),\"\")","v":""}]
[null,{"$f":"IFERROR(INDEX(FEB!B$2:B$216,SMALL(IF(INDEX(FEB!$E$2:$AF$216,,MATCH($F$1,FEB!$E$1:$AJ$1,0))=$B$1,ROW(FEB!$J$2:$AI$216)-ROW(FEB!$J$2)+1),ROWS(B$3:B200))),\"\")","v":""},{"$f":"IFERROR(INDEX(FEB!C$2:C$216,SMALL(IF(INDEX(FEB!$E$2:$AF$216,,MATCH($F$1,FEB!$E$1:$AJ$1,0))=$B$1,ROW(FEB!$J$2:$AI$216)-ROW(FEB!$J$2)+1),ROWS(C$3:C200))),\"\")","v":""},{"$f":"IFERROR(INDEX(FEB!D$2:D$216,SMALL(IF(INDEX(FEB!$E$2:$AF$216,,MATCH($F$1,FEB!$E$1:$AJ$1,0))=$B$1,ROW(FEB!$J$2:$AI$216)-ROW(FEB!$J$2)+1),ROWS(D$3:D200))),\"\")","v":""}]
[null,{"$f":"IFERROR(INDEX(FEB!B$2:B$216,SMALL(IF(INDEX(FEB!$E$2:$AF$216,,MATCH($F$1,FEB!$E$1:$AJ$1,0))=$B$1,ROW(FEB!$J$2:$AI$216)-ROW(FEB!$J$2)+1),ROWS(B$3:B201))),\"\")","v":""},{"$f":"IFERROR(INDEX(FEB!C$2:C$216,SMALL(IF(INDEX(FEB!$E$2:$AF$216,,MATCH($F$1,FEB!$E$1:$AJ$1,0))=$B$1,ROW(FEB!$J$2:$AI$216)-ROW(FEB!$J$2)+1),ROWS(C$3:C201))),\"\")","v":""},{"$f":"IFERROR(INDEX(FEB!D$2:D$216,SMALL(IF(INDEX(FEB!$E$2:$AF$216,,MATCH($F$1,FEB!$E$1:$AJ$1,0))=$B$1,ROW(FEB!$J$2:$AI$216)-ROW(FEB!$J$2)+1),ROWS(D$3:D201))),\"\")","v":""}]
[null,{"$f":"IFERROR(INDEX(FEB!B$2:B$216,SMALL(IF(INDEX(FEB!$E$2:$AF$216,,MATCH($F$1,FEB!$E$1:$AJ$1,0))=$B$1,ROW(FEB!$J$2:$AI$216)-ROW(FEB!$J$2)+1),ROWS(B$3:B202))),\"\")","v":""},{"$f":"IFERROR(INDEX(FEB!C$2:C$216,SMALL(IF(INDEX(FEB!$E$2:$AF$216,,MATCH($F$1,FEB!$E$1:$AJ$1,0))=$B$1,ROW(FEB!$J$2:$AI$216)-ROW(FEB!$J$2)+1),ROWS(C$3:C202))),\"\")","v":""},{"$f":"IFERROR(INDEX(FEB!D$2:D$216,SMALL(IF(INDEX(FEB!$E$2:$AF$216,,MATCH($F$1,FEB!$E$1:$AJ$1,0))=$B$1,ROW(FEB!$J$2:$AI$216)-ROW(FEB!$J$2)+1),ROWS(D$3:D202))),\"\")","v":""}]
[null,{"$f":"IFERROR(INDEX(FEB!B$2:B$216,SMALL(IF(INDEX(FEB!$E$2:$AF$216,,MATCH($F$1,FEB!$E$1:$AJ$1,0))=$B$1,ROW(FEB!$J$2:$AI$216)-ROW(FEB!$J$2)+1),ROWS(B$3:B203))),\"\")","v":""},{"$f":"IFERROR(INDEX(FEB!C$2:C$216,SMALL(IF(INDEX(FEB!$E$2:$AF$216,,MATCH($F$1,FEB!$E$1:$AJ$1,0))=$B$1,ROW(FEB!$J$2:$AI$216)-ROW(FEB!$J$2)+1),ROWS(C$3:C203))),\"\")","v":""},{"$f":"IFERROR(INDEX(FEB!D$2:D$216,SMALL(IF(INDEX(FEB!$E$2:$AF$216,,MATCH($F$1,FEB!$E$1:$AJ$1,0))=$B$1,ROW(FEB!$J$2:$AI$216)-ROW(FEB!$J$2)+1),ROWS(D$3:D203))),\"\")","v":""}]
[null,{"$f":"IFERROR(INDEX(FEB!B$2:B$216,SMALL(IF(INDEX(FEB!$E$2:$AF$216,,MATCH($F$1,FEB!$E$1:$AJ$1,0))=$B$1,ROW(FEB!$J$2:$AI$216)-ROW(FEB!$J$2)+1),ROWS(B$3:B204))),\"\")","v":""},{"$f":"IFERROR(INDEX(FEB!C$2:C$216,SMALL(IF(INDEX(FEB!$E$2:$AF$216,,MATCH($F$1,FEB!$E$1:$AJ$1,0))=$B$1,ROW(FEB!$J$2:$AI$216)-ROW(FEB!$J$2)+1),ROWS(C$3:C204))),\"\")","v":""},{"$f":"IFERROR(INDEX(FEB!D$2:D$216,SMALL(IF(INDEX(FEB!$E$2:$AF$216,,MATCH($F$1,FEB!$E$1:$AJ$1,0))=$B$1,ROW(FEB!$J$2:$AI$216)-ROW(FEB!$J$2)+1),ROWS(D$3:D204))),\"\")","v":""}]
[null,{"$f":"IFERROR(INDEX(FEB!B$2:B$216,SMALL(IF(INDEX(FEB!$E$2:$AF$216,,MATCH($F$1,FEB!$E$1:$AJ$1,0))=$B$1,ROW(FEB!$J$2:$AI$216)-ROW(FEB!$J$2)+1),ROWS(B$3:B205))),\"\")","v":""},{"$f":"IFERROR(INDEX(FEB!C$2:C$216,SMALL(IF(INDEX(FEB!$E$2:$AF$216,,MATCH($F$1,FEB!$E$1:$AJ$1,0))=$B$1,ROW(FEB!$J$2:$AI$216)-ROW(FEB!$J$2)+1),ROWS(C$3:C205))),\"\")","v":""},{"$f":"IFERROR(INDEX(FEB!D$2:D$216,SMALL(IF(INDEX(FEB!$E$2:$AF$216,,MATCH($F$1,FEB!$E$1:$AJ$1,0))=$B$1,ROW(FEB!$J$2:$AI$216)-ROW(FEB!$J$2)+1),ROWS(D$3:D205))),\"\")","v":""}]
[null,{"$f":"IFERROR(INDEX(FEB!B$2:B$216,SMALL(IF(INDEX(FEB!$E$2:$AF$216,,MATCH($F$1,FEB!$E$1:$AJ$1,0))=$B$1,ROW(FEB!$J$2:$AI$216)-ROW(FEB!$J$2)+1),ROWS(B$3:B206))),\"\")","v":""},{"$f":"IFERROR(INDEX(FEB!C$2:C$216,SMALL(IF(INDEX(FEB!$E$2:$AF$216,,MATCH($F$1,FEB!$E$1:$AJ$1,0))=$B$1,ROW(FEB!$J$2:$AI$216)-ROW(FEB!$J$2)+1),ROWS(C$3:C206))),\"\")","v":""},{"$f":"IFERROR(INDEX(FEB!D$2:D$216,SMALL(IF(INDEX(FEB!$E$2:$AF$216,,MATCH($F$1,FEB!$E$1:$AJ$1,0))=$B$1,ROW(FEB!$J$2:$AI$216)-ROW(FEB!$J$2)+1),ROWS(D$3:D206))),\"\")","v":""}]
[null,{"$f":"IFERROR(INDEX(FEB!B$2:B$216,SMALL(IF(INDEX(FEB!$E$2:$AF$216,,MATCH($F$1,FEB!$E$1:$AJ$1,0))=$B$1,ROW(FEB!$J$2:$AI$216)-ROW(FEB!$J$2)+1),ROWS(B$3:B207))),\"\")","v":""},{"$f":"IFERROR(INDEX(FEB!C$2:C$216,SMALL(IF(INDEX(FEB!$E$2:$AF$216,,MATCH($F$1,FEB!$E$1:$AJ$1,0))=$B$1,ROW(FEB!$J$2:$AI$216)-ROW(FEB!$J$2)+1),ROWS(C$3:C207))),\"\")","v":""},{"$f":"IFERROR(INDEX(FEB!D$2:D$216,SMALL(IF(INDEX(FEB!$E$2:$AF$216,,MATCH($F$1,FEB!$E$1:$AJ$1,0))=$B$1,ROW(FEB!$J$2:$AI$216)-ROW(FEB!$J$2)+1),ROWS(D$3:D207))),\"\")","v":""}]
[null,{"$f":"IFERROR(INDEX(FEB!B$2:B$216,SMALL(IF(INDEX(FEB!$E$2:$AF$216,,MATCH($F$1,FEB!$E$1:$AJ$1,0))=$B$1,ROW(FEB!$J$2:$AI$216)-ROW(FEB!$J$2)+1),ROWS(B$3:B208))),\"\")","v":""},{"$f":"IFERROR(INDEX(FEB!C$2:C$216,SMALL(IF(INDEX(FEB!$E$2:$AF$216,,MATCH($F$1,FEB!$E$1:$AJ$1,0))=$B$1,ROW(FEB!$J$2:$AI$216)-ROW(FEB!$J$2)+1),ROWS(C$3:C208))),\"\")","v":""},{"$f":"IFERROR(INDEX(FEB!D$2:D$216,SMALL(IF(INDEX(FEB!$E$2:$AF$216,,MATCH($F$1,FEB!$E$1:$AJ$1,0))=$B$1,ROW(FEB!$J$2:$AI$216)-ROW(FEB!$J$2)+1),ROWS(D$3:D208))),\"\")","v":""}]
[null,{"$f":"IFERROR(INDEX(FEB!B$2:B$216,SMALL(IF(INDEX(FEB!$E$2:$AF$216,,MATCH($F$1,FEB!$E$1:$AJ$1,0))=$B$1,ROW(FEB!$J$2:$AI$216)-ROW(FEB!$J$2)+1),ROWS(B$3:B209))),\"\")","v":""},{"$f":"IFERROR(INDEX(FEB!C$2:C$216,SMALL(IF(INDEX(FEB!$E$2:$AF$216,,MATCH($F$1,FEB!$E$1:$AJ$1,0))=$B$1,ROW(FEB!$J$2:$AI$216)-ROW(FEB!$J$2)+1),ROWS(C$3:C209))),\"\")","v":""},{"$f":"IFERROR(INDEX(FEB!D$2:D$216,SMALL(IF(INDEX(FEB!$E$2:$AF$216,,MATCH($F$1,FEB!$E$1:$AJ$1,0))=$B$1,ROW(FEB!$J$2:$AI$216)-ROW(FEB!$J$2)+1),ROWS(D$3:D209))),\"\")","v":""}]
[null,{"$f":"IFERROR(INDEX(FEB!B$2:B$216,SMALL(IF(INDEX(FEB!$E$2:$AF$216,,MATCH($F$1,FEB!$E$1:$AJ$1,0))=$B$1,ROW(FEB!$J$2:$AI$216)-ROW(FEB!$J$2)+1),ROWS(B$3:B210))),\"\")","v":""},{"$f":"IFERROR(INDEX(FEB!C$2:C$216,SMALL(IF(INDEX(FEB!$E$2:$AF$216,,MATCH($F$1,FEB!$E$1:$AJ$1,0))=$B$1,ROW(FEB!$J$2:$AI$216)-ROW(FEB!$J$2)+1),ROWS(C$3:C210))),\"\")","v":""},{"$f":"IFERROR(INDEX(FEB!D$2:D$216,SMALL(IF(INDEX(FEB!$E$2:$AF$216,,MATCH($F$1,FEB!$E$1:$AJ$1,0))=$B$1,ROW(FEB!$J$2:$AI$216)-ROW(FEB!$J$2)+1),ROWS(D$3:D210))),\"\")","v":""}]
[null,{"$f":"IFERROR(INDEX(FEB!B$2:B$216,SMALL(IF(INDEX(FEB!$E$2:$AF$216,,MATCH($F$1,FEB!$E$1:$AJ$1,0))=$B$1,ROW(FEB!$J$2:$AI$216)-ROW(FEB!$J$2)+1),ROWS(B$3:B211))),\"\")","v":""},{"$f":"IFERROR(INDEX(FEB!C$2:C$216,SMALL(IF(INDEX(FEB!$E$2:$AF$216,,MATCH($F$1,FEB!$E$1:$AJ$1,0))=$B$1,ROW(FEB!$J$2:$AI$216)-ROW(FEB!$J$2)+1),ROWS(C$3:C211))),\"\")","v":""},{"$f":"IFERROR(INDEX(FEB!D$2:D$216,SMALL(IF(INDEX(FEB!$E$2:$AF$216,,MATCH($F$1,FEB!$E$1:$AJ$1,0))=$B$1,ROW(FEB!$J$2:$AI$216)-ROW(FEB!$J$2)+1),ROWS(D$3:D211))),\"\")","v":""}]
[null,{"$f":"IFERROR(INDEX(FEB!B$2:B$216,SMALL(IF(INDEX(FEB!$E$2:$AF$216,,MATCH($F$1,FEB!$E$1:$AJ$1,0))=$B$1,ROW(FEB!$J$2:$AI$216)-ROW(FEB!$J$2)+1),ROWS(B$3:B212))),\"\")","v":""},{"$f":"IFERROR(INDEX(FEB!C$2:C$216,SMALL(IF(INDEX(FEB!$E$2:$AF$216,,MATCH($F$1,FEB!$E$1:$AJ$1,0))=$B$1,ROW(FEB!$J$2:$AI$216)-ROW(FEB!$J$2)+1),ROWS(C$3:C212))),\"\")","v":""},{"$f":"IFERROR(INDEX(FEB!D$2:D$216,SMALL(IF(INDEX(FEB!$E$2:$AF$216,,MATCH($F$1,FEB!$E$1:$AJ$1,0))=$B$1,ROW(FEB!$J$2:$AI$216)-ROW(FEB!$J$2)+1),ROWS(D$3:D212))),\"\")","v":""}]
[null,{"$f":"IFERROR(INDEX(FEB!B$2:B$216,SMALL(IF(INDEX(FEB!$E$2:$AF$216,,MATCH($F$1,FEB!$E$1:$AJ$1,0))=$B$1,ROW(FEB!$J$2:$AI$216)-ROW(FEB!$J$2)+1),ROWS(B$3:B213))),\"\")","v":""},{"$f":"IFERROR(INDEX(FEB!C$2:C$216,SMALL(IF(INDEX(FEB!$E$2:$AF$216,,MATCH($F$1,FEB!$E$1:$AJ$1,0))=$B$1,ROW(FEB!$J$2:$AI$216)-ROW(FEB!$J$2)+1),ROWS(C$3:C213))),\"\")","v":""},{"$f":"IFERROR(INDEX(FEB!D$2:D$216,SMALL(IF(INDEX(FEB!$E$2:$AF$216,,MATCH($F$1,FEB!$E$1:$AJ$1,0))=$B$1,ROW(FEB!$J$2:$AI$216)-ROW(FEB!$J$2)+1),ROWS(D$3:D213))),\"\")","v":""}]
[null,{"$f":"IFERROR(INDEX(FEB!B$2:B$216,SMALL(IF(INDEX(FEB!$E$2:$AF$216,,MATCH($F$1,FEB!$E$1:$AJ$1,0))=$B$1,ROW(FEB!$J$2:$AI$216)-ROW(FEB!$J$2)+1),ROWS(B$3:B214))),\"\")","v":""},{"$f":"IFERROR(INDEX(FEB!C$2:C$216,SMALL(IF(INDEX(FEB!$E$2:$AF$216,,MATCH($F$1,FEB!$E$1:$AJ$1,0))=$B$1,ROW(FEB!$J$2:$AI$216)-ROW(FEB!$J$2)+1),ROWS(C$3:C214))),\"\")","v":""},{"$f":"IFERROR(INDEX(FEB!D$2:D$216,SMALL(IF(INDEX(FEB!$E$2:$AF$216,,MATCH($F$1,FEB!$E$1:$AJ$1,0))=$B$1,ROW(FEB!$J$2:$AI$216)-ROW(FEB!$J$2)+1),ROWS(D$3:D214))),\"\")","v":""}]
[null,{"$f":"IFERROR(INDEX(FEB!B$2:B$216,SMALL(IF(INDEX(FEB!$E$2:$AF$216,,MATCH($F$1,FEB!$E$1:$AJ$1,0))=$B$1,ROW(FEB!$J$2:$AI$216)-ROW(FEB!$J$2)+1),ROWS(B$3:B215))),\"\")","v":""},{"$f":"IFERROR(INDEX(FEB!C$2:C$216,SMALL(IF(INDEX(FEB!$E$2:$AF$216,,MATCH($F$1,FEB!$E$1:$AJ$1,0))=$B$1,ROW(FEB!$J$2:$AI$216)-ROW(FEB!$J$2)+1),ROWS(C$3:C215))),\"\")","v":""},{"$f":"IFERROR(INDEX(FEB!D$2:D$216,SMALL(IF(INDEX(FEB!$E$2:$AF$216,,MATCH($F$1,FEB!$E$1:$AJ$1,0))=$B$1,ROW(FEB!$J$2:$AI$216)-ROW(FEB!$J$2)+1),ROWS(D$3:D215))),\"\")","v":""}]
[null,{"$f":"IFERROR(INDEX(FEB!B$2:B$216,SMALL(IF(INDEX(FEB!$E$2:$AF$216,,MATCH($F$1,FEB!$E$1:$AJ$1,0))=$B$1,ROW(FEB!$J$2:$AI$216)-ROW(FEB!$J$2)+1),ROWS(B$3:B216))),\"\")","v":""},{"$f":"IFERROR(INDEX(FEB!C$2:C$216,SMALL(IF(INDEX(FEB!$E$2:$AF$216,,MATCH($F$1,FEB!$E$1:$AJ$1,0))=$B$1,ROW(FEB!$J$2:$AI$216)-ROW(FEB!$J$2)+1),ROWS(C$3:C216))),\"\")","v":""},{"$f":"IFERROR(INDEX(FEB!D$2:D$216,SMALL(IF(INDEX(FEB!$E$2:$AF$216,,MATCH($F$1,FEB!$E$1:$AJ$1,0))=$B$1,ROW(FEB!$J$2:$AI$216)-ROW(FEB!$J$2)+1),ROWS(D$3:D216))),\"\")","v":""}]

{"sheet":"Signatur","index":2,"n_rows":100,"n_cols":6,"rows_kept":100,"cut":false,"hidden":false,"merged":[]}
["PRN","NAME","TIME IN","Date"]
[1405502,"MOHAMMED 3","08:09:24","2018-02-17",null,{"$f":"SUMPRODUCT(--($B2&$D2=$B$2:$B2&$D$2:$D2)*($B2<>\"\"))","v":1}]
[1405508,"MOHAMMED 9","08:10:13","2018-02-17",null,{"$f":"SUMPRODUCT(--($B3&$D3=$B$2:$B3&$D$2:$D3)*($B3<>\"\"))","v":1}]
[1405506,"MOHAMMED 7","06:22:31","2018-02-19",null,{"$f":"SUMPRODUCT(--($B4&$D4=$B$2:$B4&$D$2:$D4)*($B4<>\"\"))","v":1}]
[1405506,"MOHAMMED 7","06:43:09","2018-02-19",null,{"$f":"SUMPRODUCT(--($B5&$D5=$B$2:$B5&$D$2:$D5)*($B5<>\"\"))","v":2}]
[1405501,"MOHAMMED 2","06:44:23","2018-02-19",null,{"$f":"SUMPRODUCT(--($B6&$D6=$B$2:$B6&$D$2:$D6)*($B6<>\"\"))","v":1}]
[1405510,"MOHAMMED 11","06:48:24","2018-02-19",null,{"$f":"SUMPRODUCT(--($B7&$D7=$B$2:$B7&$D$2:$D7)*($B7<>\"\"))","v":1}]
[null,null,null,null,null,{"$f":"SUMPRODUCT(--($B8&$D8=$B$2:$B8&$D$2:$D8)*($B8<>\"\"))","v":0}]
[null,null,null,null,null,{"$f":"SUMPRODUCT(--($B9&$D9=$B$2:$B9&$D$2:$D9)*($B9<>\"\"))","v":0}]
[null,null,null,null,null,{"$f":"SUMPRODUCT(--($B10&$D10=$B$2:$B10&$D$2:$D10)*($B10<>\"\"))","v":0}]
[null,null,null,null,null,{"$f":"SUMPRODUCT(--($B11&$D11=$B$2:$B11&$D$2:$D11)*($B11<>\"\"))","v":0}]
[null,null,null,null,null,{"$f":"SUMPRODUCT(--($B12&$D12=$B$2:$B12&$D$2:$D12)*($B12<>\"\"))","v":0}]
[null,null,null,null,null,{"$f":"SUMPRODUCT(--($B13&$D13=$B$2:$B13&$D$2:$D13)*($B13<>\"\"))","v":0}]
[null,null,null,null,null,{"$f":"SUMPRODUCT(--($B14&$D14=$B$2:$B14&$D$2:$D14)*($B14<>\"\"))","v":0}]
[null,null,null,null,null,{"$f":"SUMPRODUCT(--($B15&$D15=$B$2:$B15&$D$2:$D15)*($B15<>\"\"))","v":0}]
[null,null,null,null,null,{"$f":"SUMPRODUCT(--($B16&$D16=$B$2:$B16&$D$2:$D16)*($B16<>\"\"))","v":0}]
[null,null,null,null,null,{"$f":"SUMPRODUCT(--($B17&$D17=$B$2:$B17&$D$2:$D17)*($B17<>\"\"))","v":0}]
[null,null,null,null,null,{"$f":"SUMPRODUCT(--($B18&$D18=$B$2:$B18&$D$2:$D18)*($B18<>\"\"))","v":0}]
[null,null,null,null,null,{"$f":"SUMPRODUCT(--($B19&$D19=$B$2:$B19&$D$2:$D19)*($B19<>\"\"))","v":0}]
[null,null,null,null,null,{"$f":"SUMPRODUCT(--($B20&$D20=$B$2:$B20&$D$2:$D20)*($B20<>\"\"))","v":0}]
[null,null,null,null,null,{"$f":"SUMPRODUCT(--($B21&$D21=$B$2:$B21&$D$2:$D21)*($B21<>\"\"))","v":0}]
[null,null,null,null,null,{"$f":"SUMPRODUCT(--($B22&$D22=$B$2:$B22&$D$2:$D22)*($B22<>\"\"))","v":0}]
[null,null,null,null,null,{"$f":"SUMPRODUCT(--($B23&$D23=$B$2:$B23&$D$2:$D23)*($B23<>\"\"))","v":0}]
[null,null,null,null,null,{"$f":"SUMPRODUCT(--($B24&$D24=$B$2:$B24&$D$2:$D24)*($B24<>\"\"))","v":0}]
[null,null,null,null,null,{"$f":"SUMPRODUCT(--($B25&$D25=$B$2:$B25&$D$2:$D25)*($B25<>\"\"))","v":0}]
[null,null,null,null,null,{"$f":"SUMPRODUCT(--($B26&$D26=$B$2:$B26&$D$2:$D26)*($B26<>\"\"))","v":0}]
[null,null,null,null,null,{"$f":"SUMPRODUCT(--($B27&$D27=$B$2:$B27&$D$2:$D27)*($B27<>\"\"))","v":0}]
[null,null,null,null,null,{"$f":"SUMPRODUCT(--($B28&$D28=$B$2:$B28&$D$2:$D28)*($B28<>\"\"))","v":0}]
[null,null,null,null,null,{"$f":"SUMPRODUCT(--($B29&$D29=$B$2:$B29&$D$2:$D29)*($B29<>\"\"))","v":0}]
[null,null,null,null,null,{"$f":"SUMPRODUCT(--($B30&$D30=$B$2:$B30&$D$2:$D30)*($B30<>\"\"))","v":0}]
[null,null,null,null,null,{"$f":"SUMPRODUCT(--($B31&$D31=$B$2:$B31&$D$2:$D31)*($B31<>\"\"))","v":0}]
[null,null,null,null,null,{"$f":"SUMPRODUCT(--($B32&$D32=$B$2:$B32&$D$2:$D32)*($B32<>\"\"))","v":0}]
[null,null,null,null,null,{"$f":"SUMPRODUCT(--($B33&$D33=$B$2:$B33&$D$2:$D33)*($B33<>\"\"))","v":0}]
[null,null,null,null,null,{"$f":"SUMPRODUCT(--($B34&$D34=$B$2:$B34&$D$2:$D34)*($B34<>\"\"))","v":0}]
[null,null,null,null,null,{"$f":"SUMPRODUCT(--($B35&$D35=$B$2:$B35&$D$2:$D35)*($B35<>\"\"))","v":0}]
[null,null,null,null,null,{"$f":"SUMPRODUCT(--($B36&$D36=$B$2:$B36&$D$2:$D36)*($B36<>\"\"))","v":0}]
[null,null,null,null,null,{"$f":"SUMPRODUCT(--($B37&$D37=$B$2:$B37&$D$2:$D37)*($B37<>\"\"))","v":0}]
[null,null,null,null,null,{"$f":"SUMPRODUCT(--($B38&$D38=$B$2:$B38&$D$2:$D38)*($B38<>\"\"))","v":0}]
[null,null,null,null,null,{"$f":"SUMPRODUCT(--($B39&$D39=$B$2:$B39&$D$2:$D39)*($B39<>\"\"))","v":0}]
[null,null,null,null,null,{"$f":"SUMPRODUCT(--($B40&$D40=$B$2:$B40&$D$2:$D40)*($B40<>\"\"))","v":0}]
[null,null,null,null,null,{"$f":"SUMPRODUCT(--($B41&$D41=$B$2:$B41&$D$2:$D41)*($B41<>\"\"))","v":0}]
[null,null,null,null,null,{"$f":"SUMPRODUCT(--($B42&$D42=$B$2:$B42&$D$2:$D42)*($B42<>\"\"))","v":0}]
[null,null,null,null,null,{"$f":"SUMPRODUCT(--($B43&$D43=$B$2:$B43&$D$2:$D43)*($B43<>\"\"))","v":0}]
[null,null,null,null,null,{"$f":"SUMPRODUCT(--($B44&$D44=$B$2:$B44&$D$2:$D44)*($B44<>\"\"))","v":0}]
[null,null,null,null,null,{"$f":"SUMPRODUCT(--($B45&$D45=$B$2:$B45&$D$2:$D45)*($B45<>\"\"))","v":0}]
[null,null,null,null,null,{"$f":"SUMPRODUCT(--($B46&$D46=$B$2:$B46&$D$2:$D46)*($B46<>\"\"))","v":0}]
[null,null,null,null,null,{"$f":"SUMPRODUCT(--($B47&$D47=$B$2:$B47&$D$2:$D47)*($B47<>\"\"))","v":0}]
[null,null,null,null,null,{"$f":"SUMPRODUCT(--($B48&$D48=$B$2:$B48&$D$2:$D48)*($B48<>\"\"))","v":0}]
[null,null,null,null,null,{"$f":"SUMPRODUCT(--($B49&$D49=$B$2:$B49&$D$2:$D49)*($B49<>\"\"))","v":0}]
[null,null,null,null,null,{"$f":"SUMPRODUCT(--($B50&$D50=$B$2:$B50&$D$2:$D50)*($B50<>\"\"))","v":0}]
[null,null,null,null,null,{"$f":"SUMPRODUCT(--($B51&$D51=$B$2:$B51&$D$2:$D51)*($B51<>\"\"))","v":0}]
[null,null,null,null,null,{"$f":"SUMPRODUCT(--($B52&$D52=$B$2:$B52&$D$2:$D52)*($B52<>\"\"))","v":0}]
[null,null,null,null,null,{"$f":"SUMPRODUCT(--($B53&$D53=$B$2:$B53&$D$2:$D53)*($B53<>\"\"))","v":0}]
[null,null,null,null,null,{"$f":"SUMPRODUCT(--($B54&$D54=$B$2:$B54&$D$2:$D54)*($B54<>\"\"))","v":0}]
[null,null,null,null,null,{"$f":"SUMPRODUCT(--($B55&$D55=$B$2:$B55&$D$2:$D55)*($B55<>\"\"))","v":0}]
[null,null,null,null,null,{"$f":"SUMPRODUCT(--($B56&$D56=$B$2:$B56&$D$2:$D56)*($B56<>\"\"))","v":0}]
[null,null,null,null,null,{"$f":"SUMPRODUCT(--($B57&$D57=$B$2:$B57&$D$2:$D57)*($B57<>\"\"))","v":0}]
[null,null,null,null,null,{"$f":"SUMPRODUCT(--($B58&$D58=$B$2:$B58&$D$2:$D58)*($B58<>\"\"))","v":0}]
[null,null,null,null,null,{"$f":"SUMPRODUCT(--($B59&$D59=$B$2:$B59&$D$2:$D59)*($B59<>\"\"))","v":0}]
[null,null,null,null,null,{"$f":"SUMPRODUCT(--($B60&$D60=$B$2:$B60&$D$2:$D60)*($B60<>\"\"))","v":0}]
[null,null,null,null,null,{"$f":"SUMPRODUCT(--($B61&$D61=$B$2:$B61&$D$2:$D61)*($B61<>\"\"))","v":0}]
[null,null,null,null,null,{"$f":"SUMPRODUCT(--($B62&$D62=$B$2:$B62&$D$2:$D62)*($B62<>\"\"))","v":0}]
[null,null,null,null,null,{"$f":"SUMPRODUCT(--($B63&$D63=$B$2:$B63&$D$2:$D63)*($B63<>\"\"))","v":0}]
[null,null,null,null,null,{"$f":"SUMPRODUCT(--($B64&$D64=$B$2:$B64&$D$2:$D64)*($B64<>\"\"))","v":0}]
[null,null,null,null,null,{"$f":"SUMPRODUCT(--($B65&$D65=$B$2:$B65&$D$2:$D65)*($B65<>\"\"))","v":0}]
[null,null,null,null,null,{"$f":"SUMPRODUCT(--($B66&$D66=$B$2:$B66&$D$2:$D66)*($B66<>\"\"))","v":0}]
[null,null,null,null,null,{"$f":"SUMPRODUCT(--($B67&$D67=$B$2:$B67&$D$2:$D67)*($B67<>\"\"))","v":0}]
[null,null,null,null,null,{"$f":"SUMPRODUCT(--($B68&$D68=$B$2:$B68&$D$2:$D68)*($B68<>\"\"))","v":0}]
[null,null,null,null,null,{"$f":"SUMPRODUCT(--($B69&$D69=$B$2:$B69&$D$2:$D69)*($B69<>\"\"))","v":0}]
[null,null,null,null,null,{"$f":"SUMPRODUCT(--($B70&$D70=$B$2:$B70&$D$2:$D70)*($B70<>\"\"))","v":0}]
[null,null,null,null,null,{"$f":"SUMPRODUCT(--($B71&$D71=$B$2:$B71&$D$2:$D71)*($B71<>\"\"))","v":0}]
[null,null,null,null,null,{"$f":"SUMPRODUCT(--($B72&$D72=$B$2:$B72&$D$2:$D72)*($B72<>\"\"))","v":0}]
[null,null,null,null,null,{"$f":"SUMPRODUCT(--($B73&$D73=$B$2:$B73&$D$2:$D73)*($B73<>\"\"))","v":0}]
[null,null,null,null,null,{"$f":"SUMPRODUCT(--($B74&$D74=$B$2:$B74&$D$2:$D74)*($B74<>\"\"))","v":0}]
[null,null,null,null,null,{"$f":"SUMPRODUCT(--($B75&$D75=$B$2:$B75&$D$2:$D75)*($B75<>\"\"))","v":0}]
[null,null,null,null,null,{"$f":"SUMPRODUCT(--($B76&$D76=$B$2:$B76&$D$2:$D76)*($B76<>\"\"))","v":0}]
[null,null,null,null,null,{"$f":"SUMPRODUCT(--($B77&$D77=$B$2:$B77&$D$2:$D77)*($B77<>\"\"))","v":0}]
[null,null,null,null,null,{"$f":"SUMPRODUCT(--($B78&$D78=$B$2:$B78&$D$2:$D78)*($B78<>\"\"))","v":0}]
[null,null,null,null,null,{"$f":"SUMPRODUCT(--($B79&$D79=$B$2:$B79&$D$2:$D79)*($B79<>\"\"))","v":0}]
[null,null,null,null,null,{"$f":"SUMPRODUCT(--($B80&$D80=$B$2:$B80&$D$2:$D80)*($B80<>\"\"))","v":0}]
[null,null,null,null,null,{"$f":"SUMPRODUCT(--($B81&$D81=$B$2:$B81&$D$2:$D81)*($B81<>\"\"))","v":0}]
[null,null,null,null,null,{"$f":"SUMPRODUCT(--($B82&$D82=$B$2:$B82&$D$2:$D82)*($B82<>\"\"))","v":0}]
[null,null,null,null,null,{"$f":"SUMPRODUCT(--($B83&$D83=$B$2:$B83&$D$2:$D83)*($B83<>\"\"))","v":0}]
[null,null,null,null,null,{"$f":"SUMPRODUCT(--($B84&$D84=$B$2:$B84&$D$2:$D84)*($B84<>\"\"))","v":0}]
[null,null,null,null,null,{"$f":"SUMPRODUCT(--($B85&$D85=$B$2:$B85&$D$2:$D85)*($B85<>\"\"))","v":0}]
[null,null,null,null,null,{"$f":"SUMPRODUCT(--($B86&$D86=$B$2:$B86&$D$2:$D86)*($B86<>\"\"))","v":0}]
[null,null,null,null,null,{"$f":"SUMPRODUCT(--($B87&$D87=$B$2:$B87&$D$2:$D87)*($B87<>\"\"))","v":0}]
[null,null,null,null,null,{"$f":"SUMPRODUCT(--($B88&$D88=$B$2:$B88&$D$2:$D88)*($B88<>\"\"))","v":0}]
[null,null,null,null,null,{"$f":"SUMPRODUCT(--($B89&$D89=$B$2:$B89&$D$2:$D89)*($B89<>\"\"))","v":0}]
[null,null,null,null,null,{"$f":"SUMPRODUCT(--($B90&$D90=$B$2:$B90&$D$2:$D90)*($B90<>\"\"))","v":0}]
[null,null,null,null,null,{"$f":"SUMPRODUCT(--($B91&$D91=$B$2:$B91&$D$2:$D91)*($B91<>\"\"))","v":0}]
[null,null,null,null,null,{"$f":"SUMPRODUCT(--($B92&$D92=$B$2:$B92&$D$2:$D92)*($B92<>\"\"))","v":0}]
[null,null,null,null,null,{"$f":"SUMPRODUCT(--($B93&$D93=$B$2:$B93&$D$2:$D93)*($B93<>\"\"))","v":0}]
[null,null,null,null,null,{"$f":"SUMPRODUCT(--($B94&$D94=$B$2:$B94&$D$2:$D94)*($B94<>\"\"))","v":0}]
[null,null,null,null,null,{"$f":"SUMPRODUCT(--($B95&$D95=$B$2:$B95&$D$2:$D95)*($B95<>\"\"))","v":0}]
[null,null,null,null,null,{"$f":"SUMPRODUCT(--($B96&$D96=$B$2:$B96&$D$2:$D96)*($B96<>\"\"))","v":0}]
[null,null,null,null,null,{"$f":"SUMPRODUCT(--($B97&$D97=$B$2:$B97&$D$2:$D97)*($B97<>\"\"))","v":0}]
[null,null,null,null,null,{"$f":"SUMPRODUCT(--($B98&$D98=$B$2:$B98&$D$2:$D98)*($B98<>\"\"))","v":0}]
[null,null,null,null,null,{"$f":"SUMPRODUCT(--($B99&$D99=$B$2:$B99&$D$2:$D99)*($B99<>\"\"))","v":0}]
[null,null,null,null,null,{"$f":"SUMPRODUCT(--($B100&$D100=$B$2:$B100&$D$2:$D100)*($B100<>\"\"))","v":0}]