{"text_format":"1","workbook":"xlsx","n_sheets":4,"sheets":["واجهة حجز","القائمة ","حالة الاستخلاف","الشبكة الاستدلالية للمرتبات"],"not_rendered":{"charts":0,"images":0,"macros":1,"external_links":0,"defined_names":0,"comments":0,"pivot_tables":0},"unopened":[],"bounds":{"document_bytes":16777216,"sheet_cells":100000,"rows_first":2000,"rows_last":500,"rows_between":2000,"halvings":0,"cell_chars":16384,"cell_head_chars":4096},"cells_cut":0,"cells_raw":0,"read":"whole","date_system":"1900"}

{"sheet":"واجهة حجز","index":0,"n_rows":35,"n_cols":17,"rows_kept":35,"cut":false,"hidden":false,"merged":[[2,5,2,16]]}
[]
[]
["دون اسم المؤسسة:",null,"      المؤسسة : ","متوسطة بلطرش ثامر",null,"ضع في الخانات الخضر أيام العطل من كل شهر ماعدا عطل نهاية الأسبوع، وإن أضفتها فلا بأس."]
["بلدية المؤسسة:",null,"عين الحجل",null,null,"جانفي","فيفري","مارس ","أفريل","ماي","جوان","جويلية","أوت","سبتمبر","أكتوبر","نوفمبر","ديسمبر"]
["الولاية:",null,"المسيلة",null,null,"2018-01-01",null,"2018-03-25","2018-04-01","2018-05-01","2018-06-01","2018-07-01","2018-08-01","2017-09-01",null,"2017-11-01","2017-12-22"]
["المكان والتاريخ:",null,"عين الحجل في : ","2018-02-14",null,"2018-01-02",null,"2018-03-26","2018-04-02",null,"2018-06-02","2018-07-02","2018-08-02","2017-09-02",null,"2017-11-02","2017-12-23"]
[null,null,null,null,null,"2018-01-03",null,"2018-03-27","2018-04-03",null,"2018-06-03","2018-07-03","2018-08-03","2017-09-03",null,null,"2017-12-24"]
[null,null,null,null,null,"2018-01-04",null,"2018-03-28","2018-04-04",null,"2018-06-04","2018-07-04","2018-08-04","2017-09-04",null,null,"2017-12-25"]
[null,null,null,null,null,"2018-01-05",null,"2018-03-29","2018-04-05",null,"2018-06-05","2018-07-05","2018-08-05",null,null,null,"2017-12-26"]
[null,null,null,null,null,"2018-01-06",null,"2018-03-30","2018-04-06",null,"2018-06-06","2018-07-06","2018-08-06",null,null,null,"2017-12-27"]
{"$rows_left_out":26}
{"sheet":"القائمة ","index":1,"n_rows":21,"n_cols":254,"rows_kept":21,"cut":false,"hidden":false,"merged":[]}
["الرقم","اسم ولقب الأستاذ\nفي الحالة المرضية","رقم حسابه","وظيفتــــــــــــــــــــــــه","المنحة\nالتحفيزية","الصنف","النقطة\nالاستدلالية","القسم","اسم \nالمستخلف","اللقب","تاريخ الميلاد","مكان الميلاد","ولاية الميلاد","الحالة \nالعائلية","عدد الأولاد","المؤهل\n العلمي","التخصص","الوظائف السابقة","فترة \nالاستخلاف\nمن","فترة\n الاستخلاف\nإلى","رقم\nالحساب","مفتاح\nالحساب","Colonne24","Colonne25","Colonne26","Colonne27","Colonne28","Colonne29","Colonne30","Colonne31","Colonne32","Colonne33","Colonne34","Colonne35","Colonne36","Colonne37","Colonne38","Colonne39","Colonne40","Colonne41","Colonne42","Colonne43","Colonne44","Colonne45","Colonne46","Colonne47","Colonne48","Colonne49","Colonne50","Colonne51","Colonne52","Colonne53","Colonne54","Colonne55","Colonne56","Colonne57","Colonne58","Colonne59","Colonne60","Colonne61","Colonne62","Colonne63","Colonne64","Colonne65","Colonne66","Colonne67","Colonne68","Colonne69","Colonne70","Colonne71","Colonne72","Colonne73","Colonne74","Colonne75","تاريخ إنجاز \nالوثيقة","Colonne77","Colonne78","Colonne79","Colonne80","Colonne81","Colonne82","Colonne83","Colonne84","Colonne85","Colonne86","Colonne87","Colonne88","Colonne89","Colonne90","Colonne91","Colonne92","Colonne93","Colonne94","Colonne95","Colonne96","Colonne97","Colonne98","Colonne99","Colonne100","Colonne101","Colonne102","Colonne103","Colonne104","Colonne105","Colonne106","Colonne107","Colonne108","Colonne109","Colonne110","Colonne111","Colonne112","Colonne113","Colonne114","Colonne115","Colonne116","Colonne117","Colonne118","Colonne119","Colonne120","Colonne121","Colonne122","Colonne123","Colonne124","Colonne125","Colonne126","Colonne127","Colonne128","Colonne129","Colonne130","Colonne131","Colonne132","Colonne133","Colonne134","Colonne135","Colonne136","Colonne137","Colonne138","Colonne139","Colonne140","Colonne141","Colonne142","Colonne143","Colonne144","Colonne145","Colonne146","Colonne147","Colonne148","Colonne149","Colonne150","Colonne151","Colonne152","Colonne153","Colonne154","Colonne155","Colonne156","Colonne157","Colonne158","Colonne159","Colonne160","Colonne161","Colonne162","Colonne163","Colonne164","Colonne165","Colonne166","Colonne167","Colonne168","Colonne169","Colonne170","Colonne171","Colonne172","Colonne173","Colonne174","Colonne175","Colonne176","Colonne177","Colonne178","Colonne179","Colonne180","Colonne181","Colonne182","Colonne183","Colonne184","Colonne185","Colonne186","Colonne187","Colonne188","Colonne189","Colonne190","Colonne191","Colonne192","Colonne193","Colonne194","Colonne195","Colonne196","Colonne197","Colonne198","Colonne199","Colonne200","Colonne201","Colonne202","Colonne203","Colonne204","Colonne205","Colonne206","Colonne207","Colonne208","Colonne209","Colonne210","Colonne211","Colonne212","Colonne213","Colonne214","Colonne215","Colonne216","Colonne217","Colonne218","Colonne219","Colonne220","Colonne221","Colonne222","Colonne223","Colonne224","Colonne225","Colonne226","Colonne227","Colonne228","Colonne229","Colonne230","Colonne231","Colonne232","Colonne233","Colonne234","Colonne235","Colonne236","Colonne237","Colonne238","Colonne239","Colonne240","Colonne241","Colonne242","Colonne243","Colonne244","Colonne245","Colonne246","Colonne247","Colonne248","Colonne249","Colonne250","Colonne251","Colonne252","Colonne253","Colonne254","Colonne255"]
[1,null,null,null,null,null,null,null,null,null,null,null,null,null,null,null,null,null,null,null,null,{"$f":"AI4","v":0},{"$f":"Tableau13[[#This Row],[رقم\nالحساب]]+10000000000","v":10000000000},4,5,6,7,8,9,10,11,12,13,{"$f":"SUM(Tableau13[[#This Row],[Colonne25]:[Colonne34]])","v":85},null,{"$f":"U8+10000000000","v":10000000000},4,5,6,7,8,9,10,11,12,13,{"$f":"SUM(Tableau13[[#This Row],[Colonne38]:[Colonne47]])","v":85},null,{"$f":"U14+10000000000","v":10000000000},4,5,6,7,8,9,10,11,12,13,{"$f":"SUM(Tableau13[[#This Row],[Colonne51]:[Colonne60]])","v":85},null,{"$f":"U20+10000000000","v":10000000000},4,5,6,7,8,9,10,11,12,13,{"$f":"SUM(Tableau13[[#This Row],[Colonne64]:[Colonne73]])","v":85}]
[2,null,null,null,{"$f":"VLOOKUP(Tableau13[[#This Row],[الصنف]],'الشبكة الاستدلالية للمرتبات'!R3:S9,2,0)","v":{"$error":"#N/A"}},null,{"$f":"IF(F3=\"\",\"\",VLOOKUP('القائمة '!F3,'الشبكة الاستدلالية للمرتبات'!B3:C19,2,0))","v":""},null,null,null,null,null,null,null,null,null,null,null,null,null,null,{"$f":"AI7","v":0},null,{"$f":"MID(W2,11,1)","v":"0"},{"$f":"MID(W2,10,1)","v":"0"},{"$f":"MID(W2,9,1)","v":"0"},{"$f":"MID(W2,8,1)","v":"0"},{"$f":"MID(W2,7,1)","v":"0"},{"$f":"MID(W2,6,1)","v":"0"},{"$f":"MID(W2,5,1)","v":"0"},{"$f":"MID(W2,4,1)","v":"0"},{"$f":"MID(W2,3,1)","v":"0"},{"$f":"MID(W2,2,1)","v":"0"},{"$f":"SUM(Tableau13[[#This Row],[Colonne25]:[Colonne34]])","v":0},null,null,{"$f":"MID(AJ2,11,1)","v":"0"},{"$f":"MID(AJ2,10,1)","v":"0"},{"$f":"MID(AJ2,9,1)","v":"0"},{"$f":"MID(AJ2,8,1)","v":"0"},{"$f":"MID(AJ2,7,1)","v":"0"},{"$f":"MID(AJ2,6,1)","v":"0"},{"$f":"MID(AJ2,5,1)","v":"0"},{"$f":"MID(AJ2,4,1)","v":"0"},{"$f":"MID(AJ2,3,1)","v":"0"},{"$f":"MID(AJ2,2,1)","v":"0"},{"$f":"SUM(Tableau13[[#This Row],[Colonne38]:[Colonne47]])","v":0},null,null,{"$f":"MID(AW2,11,1)","v":"0"},{"$f":"MID(AW2,10,1)","v":"0"},{"$f":"MID(AW2,9,1)","v":"0"},{"$f":"MID(AW2,8,1)","v":"0"},{"$f":"MID(AW2,7,1)","v":"0"},{"$f":"MID(AW2,6,1)","v":"0"},{"$f":"MID(AW2,5,1)","v":"0"},{"$f":"MID(AW2,4,1)","v":"0"},{"$f":"MID(AW2,3,1)","v":"0"},{"$f":"MID(AW2,2,1)","v":"0"},{"$f":"SUM(Tableau13[[#This Row],[Colonne51]:[Colonne60]])","v":0},null,null,{"$f":"MID(BJ2,11,1)","v":"0"},{"$f":"MID(BJ2,10,1)","v":"0"},{"$f":"MID(BJ2,9,1)","v":"0"},{"$f":"MID(BJ2,8,1)","v":"0"},{"$f":"MID(BJ2,7,1)","v":"0"},{"$f":"MID(BJ2,6,1)","v":"0"},{"$f":"MID(BJ2,5,1)","v":"0"},{"$f":"MID(BJ2,4,1)","v":"0"},{"$f":"MID(BJ2,3,1)","v":"0"},{"$f":"MID(BJ2,2,1)","v":"0"},{"$f":"SUM(Tableau13[[#This Row],[Colonne64]:[Colonne73]])","v":0}]
[3,null,null,null,{"$f":"VLOOKUP(Tableau13[[#This Row],[الصنف]],'الشبكة الاستدلالية للمرتبات'!R3:S9,2,0)","v":{"$error":"#N/A"}},null,{"$f":"IF(F4=\"\",\"\",VLOOKUP('القائمة '!F4,'الشبكة الاستدلالية للمرتبات'!B3:C19,2,0))","v":""},null,null,null,null,null,null,null,null,null,null,null,null,null,null,{"$f":"AI10","v":0},null,{"$f":"X2*X3","v":0},{"$f":"Y2*Y3","v":0},{"$f":"Z2*Z3","v":0},0,0,0,0,0,0,0,{"$f":"SUM(Tableau13[[#This Row],[Colonne25]:[Colonne34]])","v":0},{"$f":"MOD(Tableau13[[#This Row],[Colonne35]],100)","v":0},null,{"$f":"AK2*AK3","v":0},{"$f":"AL2*AL3","v":0},{"$f":"AM2*AM3","v":0},{"$f":"AN2*AN3","v":0},{"$f":"AO2*AO3","v":0},{"$f":"AP2*AP3","v":0},{"$f":"AQ2*AQ3","v":0},{"$f":"AR2*AR3","v":0},{"$f":"AS2*AS3","v":0},{"$f":"AT2*AT3","v":0},{"$f":"SUM(Tableau13[[#This Row],[Colonne38]:[Colonne47]])","v":0},{"$f":"MOD(Tableau13[[#This Row],[Colonne48]],100)","v":0},null,{"$f":"AX2*AX3","v":0},{"$f":"AY2*AY3","v":0},{"$f":"AZ2*AZ3","v":0},{"$f":"BA2*BA3","v":0},{"$f":"BB2*BB3","v":0},{"$f":"BC2*BC3","v":0},{"$f":"BD2*BD3","v":0},{"$f":"BE2*BE3","v":0},{"$f":"BF2*BF3","v":0},{"$f":"BG2*BG3","v":0},{"$f":"SUM(Tableau13[[#This Row],[Colonne51]:[Colonne60]])","v":0},{"$f":"MOD(Tableau13[[#This Row],[Colonne61]],100)","v":0},null,{"$f":"BK2*BK3","v":0},{"$f":"BL2*BL3","v":0},{"$f":"BM2*BM3","v":0},{"$f":"BN2*BN3","v":0},{"$f":"BO2*BO3","v":0},{"$f":"BP2*BP3","v":0},{"$f":"BQ2*BQ3","v":0},{"$f":"BR2*BR3","v":0},{"$f":"BS2*BS3","v":0},{"$f":"BT2*BT3","v":0},{"$f":"SUM(Tableau13[[#This Row],[Colonne64]:[Colonne73]])","v":0},{"$f":"MOD(Tableau13[[#This Row],[Colonne74]],100)","v":0}]
[4,null,null,null,{"$f":"VLOOKUP(Tableau13[[#This Row],[الصنف]],'الشبكة الاستدلالية للمرتبات'!R3:S9,2,0)","v":{"$error":"#N/A"}},null,{"$f":"IF(F5=\"\",\"\",VLOOKUP('القائمة '!F5,'الشبكة الاستدلالية للمرتبات'!B3:C19,2,0))","v":""},null,null,null,null,null,null,null,null,null,null,null,null,null,null,{"$f":"AI13","v":0},{"$f":"U3+10000000000","v":10000000000},4,5,6,7,8,9,10,11,12,13,{"$f":"SUM(Tableau13[[#This Row],[Colonne25]:[Colonne34]])","v":85},null,{"$f":"U9+10000000000","v":10000000000},4,5,6,7,8,9,10,11,12,13,{"$f":"SUM(Tableau13[[#This Row],[Colonne38]:[Colonne47]])","v":85},null,{"$f":"U15+10000000000","v":10000000000},4,5,6,7,8,9,10,11,12,13,{"$f":"SUM(Tableau13[[#This Row],[Colonne51]:[Colonne60]])","v":85},null,{"$f":"U21+10000000000","v":10000000000},4,5,6,7,8,9,10,11,12,13,{"$f":"SUM(Tableau13[[#This Row],[Colonne64]:[Colonne73]])","v":85}]
[5,null,null,null,{"$f":"VLOOKUP(Tableau13[[#This Row],[الصنف]],'الشبكة الاستدلالية للمرتبات'!R3:S9,2,0)","v":{"$error":"#N/A"}},null,{"$f":"IF(F6=\"\",\"\",VLOOKUP('القائمة '!F6,'الشبكة الاستدلالية للمرتبات'!B3:C19,2,0))","v":""},null,null,null,null,null,null,null,null,null,null,null,null,null,null,{"$f":"AI16","v":0},null,{"$f":"MID(W5,11,1)","v":"0"},{"$f":"MID(W5,10,1)","v":"0"},{"$f":"MID(W5,9,1)","v":"0"},{"$f":"MID(W5,8,1)","v":"0"},{"$f":"MID(W5,7,1)","v":"0"},{"$f":"MID(W5,6,1)","v":"0"},{"$f":"MID(W5,5,1)","v":"0"},{"$f":"MID(W5,4,1)","v":"0"},{"$f":"MID(W5,3,1)","v":"0"},{"$f":"MID(W5,2,1)","v":"0"},{"$f":"SUM(Tableau13[[#This Row],[Colonne25]:[Colonne34]])","v":0},null,null,{"$f":"MID(AJ5,11,1)","v":"0"},{"$f":"MID(AJ5,10,1)","v":"0"},{"$f":"MID(AJ5,9,1)","v":"0"},{"$f":"MID(AJ5,8,1)","v":"0"},{"$f":"MID(AJ5,7,1)","v":"0"},{"$f":"MID(AJ5,6,1)","v":"0"},{"$f":"MID(AJ5,5,1)","v":"0"},{"$f":"MID(AJ5,4,1)","v":"0"},{"$f":"MID(AJ5,3,1)","v":"0"},{"$f":"MID(AJ5,2,1)","v":"0"},{"$f":"SUM(Tableau13[[#This Row],[Colonne38]:[Colonne47]])","v":0},null,null,{"$f":"MID(AW5,11,1)","v":"0"},{"$f":"MID(AW5,10,1)","v":"0"},{"$f":"MID(AW5,9,1)","v":"0"},{"$f":"MID(AW5,8,1)","v":"0"},{"$f":"MID(AW5,7,1)","v":"0"},{"$f":"MID(AW5,6,1)","v":"0"},{"$f":"MID(AW5,5,1)","v":"0"},{"$f":"MID(AW5,4,1)","v":"0"},{"$f":"MID(AW5,3,1)","v":"0"},{"$f":"MID(AW5,2,1)","v":"0"},{"$f":"SUM(Tableau13[[#This Row],[Colonne51]:[Colonne60]])","v":0},null,null,{"$f":"MID(BJ5,11,1)","v":"0"},{"$f":"MID(BJ5,10,1)","v":"0"},{"$f":"MID(BJ5,9,1)","v":"0"},{"$f":"MID(BJ5,8,1)","v":"0"},{"$f":"MID(BJ5,7,1)","v":"0"},{"$f":"MID(BJ5,6,1)","v":"0"},{"$f":"MID(BJ5,5,1)","v":"0"},{"$f":"MID(BJ5,4,1)","v":"0"},{"$f":"MID(BJ5,3,1)","v":"0"},{"$f":"MID(BJ5,2,1)","v":"0"},{"$f":"SUM(Tableau13[[#This Row],[Colonne64]:[Colonne73]])","v":0}]
[6,null,null,null,{"$f":"VLOOKUP(Tableau13[[#This Row],[الصنف]],'الشبكة الاستدلالية للمرتبات'!R3:S9,2,0)","v":{"$error":"#N/A"}},null,{"$f":"IF(F7=\"\",\"\",VLOOKUP('القائمة '!F7,'الشبكة الاستدلالية للمرتبات'!B3:C19,2,0))","v":""},null,null,null,null,null,null,null,null,null,null,null,null,null,null,{"$f":"AI19","v":0},null,{"$f":"X5*X6","v":0},{"$f":"Y5*Y6","v":0},{"$f":"Z5*Z6","v":0},{"$f":"AA5*AA6","v":0},{"$f":"AB5*AB6","v":0},{"$f":"AC5*AC6","v":0},{"$f":"AD5*AD6","v":0},{"$f":"AE5*AE6","v":0},{"$f":"AF5*AF6","v":0},{"$f":"AG5*AG6","v":0},{"$f":"SUM(Tableau13[[#This Row],[Colonne25]:[Colonne34]])","v":0},{"$f":"MOD(Tableau13[[#This Row],[Colonne35]],100)","v":0},null,{"$f":"AK5*AK6","v":0},{"$f":"AL5*AL6","v":0},{"$f":"AM5*AM6","v":0},{"$f":"AN5*AN6","v":0},{"$f":"AO5*AO6","v":0},{"$f":"AP5*AP6","v":0},{"$f":"AQ5*AQ6","v":0},{"$f":"AR5*AR6","v":0},{"$f":"AS5*AS6","v":0},{"$f":"AT5*AT6","v":0},{"$f":"SUM(Tableau13[[#This Row],[Colonne38]:[Colonne47]])","v":0},{"$f":"MOD(Tableau13[[#This Row],[Colonne48]],100)","v":0},null,{"$f":"AX5*AX6","v":0},{"$f":"AY5*AY6","v":0},{"$f":"AZ5*AZ6","v":0},{"$f":"BA5*BA6","v":0},{"$f":"BB5*BB6","v":0},{"$f":"BC5*BC6","v":0},{"$f":"BD5*BD6","v":0},{"$f":"BE5*BE6","v":0},{"$f":"BF5*BF6","v":0},{"$f":"BG5*BG6","v":0},{"$f":"SUM(Tableau13[[#This Row],[Colonne51]:[Colonne60]])","v":0},{"$f":"MOD(Tableau13[[#This Row],[Colonne61]],100)","v":0},null,{"$f":"BK5*BK6","v":0},{"$f":"BL5*BL6","v":0},{"$f":"BM5*BM6","v":0},{"$f":"BN5*BN6","v":0},{"$f":"BO5*BO6","v":0},{"$f":"BP5*BP6","v":0},{"$f":"BQ5*BQ6","v":0},{"$f":"BR5*BR6","v":0},{"$f":"BS5*BS6","v":0},{"$f":"BT5*BT6","v":0},{"$f":"SUM(Tableau13[[#This Row],[Colonne64]:[Colonne73]])","v":0},{"$f":"MOD(Tableau13[[#This Row],[Colonne74]],100)","v":0}]
[7,null,null,null,{"$f":"VLOOKUP(Tableau13[[#This Row],[الصنف]],'الشبكة الاستدلالية للمرتبات'!R3:S9,2,0)","v":{"$error":"#N/A"}},null,{"$f":"IF(F8=\"\",\"\",VLOOKUP('القائمة '!F8,'الشبكة الاستدلالية للمرتبات'!B3:C19,2,0))","v":""},null,null,null,null,null,null,null,null,null,null,null,null,null,null,{"$f":"AV4","v":0},{"$f":"U4+10000000000","v":10000000000},4,5,6,7,8,9,10,11,12,13,{"$f":"SUM(Tableau13[[#This Row],[Colonne25]:[Colonne34]])","v":85},null,{"$f":"U10+10000000000","v":10000000000},4,5,6,7,8,9,10,11,12,13,{"$f":"SUM(Tableau13[[#This Row],[Colonne38]:[Colonne47]])","v":85},null,{"$f":"U16+10000000000","v":10000000000},4,5,6,7,8,9,10,11,12,13,{"$f":"SUM(Tableau13[[#This Row],[Colonne51]:[Colonne60]])","v":85},null,null,null,null,null,null,null,null,null,null,null,null,{"$f":"SUM(Tableau13[[#This Row],[Colonne64]:[Colonne73]])","v":0}]
[8,null,null,null,{"$f":"VLOOKUP(Tableau13[[#This Row],[الصنف]],'الشبكة الاستدلالية للمرتبات'!R3:S9,2,0)","v":{"$error":"#N/A"}},null,{"$f":"IF(F9=\"\",\"\",VLOOKUP('القائمة '!F9,'الشبكة الاستدلالية للمرتبات'!B3:C19,2,0))","v":""},null,null,null,null,null,null,null,null,null,null,null,null,null,null,{"$f":"AV7","v":0},null,{"$f":"MID(W8,11,1)","v":"0"},{"$f":"MID(W8,10,1)","v":"0"},{"$f":"MID(W8,9,1)","v":"0"},{"$f":"MID(W8,8,1)","v":"0"},{"$f":"MID(W8,7,1)","v":"0"},{"$f":"MID(W8,6,1)","v":"0"},{"$f":"MID(W8,5,1)","v":"0"},{"$f":"MID(W8,4,1)","v":"0"},{"$f":"MID(W8,3,1)","v":"0"},{"$f":"MID(W8,2,1)","v":"0"},{"$f":"SUM(Tableau13[[#This Row],[Colonne25]:[Colonne34]])","v":0},null,null,{"$f":"MID(AJ8,11,1)","v":"0"},{"$f":"MID(AJ8,10,1)","v":"0"},{"$f":"MID(AJ8,9,1)","v":"0"},{"$f":"MID(AJ8,8,1)","v":"0"},{"$f":"MID(AJ8,7,1)","v":"0"},{"$f":"MID(AJ8,6,1)","v":"0"},{"$f":"MID(AJ8,5,1)","v":"0"},{"$f":"MID(AJ8,4,1)","v":"0"},{"$f":"MID(AJ8,3,1)","v":"0"},{"$f":"MID(AJ8,2,1)","v":"0"},{"$f":"SUM(Tableau13[[#This Row],[Colonne38]:[Colonne47]])","v":0},null,null,{"$f":"MID(AW8,11,1)","v":"0"},{"$f":"MID(AW8,10,1)","v":"0"},{"$f":"MID(AW8,9,1)","v":"0"},{"$f":"MID(AW8,8,1)","v":"0"},{"$f":"MID(AW8,7,1)","v":"0"},{"$f":"MID(AW8,6,1)","v":"0"},{"$f":"MID(AW8,5,1)","v":"0"},{"$f":"MID(AW8,4,1)","v":"0"},{"$f":"MID(AW8,3,1)","v":"0"},{"$f":"MID(AW8,2,1)","v":"0"},{"$f":"SUM(Tableau13[[#This Row],[Colonne51]:[Colonne60]])","v":0},null,null,null,null,null,null,null,null,null,null,null,null,{"$f":"SUM(Tableau13[[#This Row],[Colonne64]:[Colonne73]])","v":0}]
[9,null,null,null,{"$f":"VLOOKUP(Tableau13[[#This Row],[الصنف]],'الشبكة الاستدلالية للمرتبات'!R3:S9,2,0)","v":{"$error":"#N/A"}},null,{"$f":"IF(F10=\"\",\"\",VLOOKUP('القائمة '!F10,'الشبكة الاستدلالية للمرتبات'!B3:C19,2,0))","v":""},null,null,null,null,null,null,null,null,null,null,null,null,null,null,{"$f":"Tableau13[[#This Row],[Colonne49]]","v":0},null,{"$f":"X8*X9","v":0},{"$f":"Y8*Y9","v":0},{"$f":"Z8*Z9","v":0},{"$f":"AA8*AA9","v":0},{"$f":"AB8*AB9","v":0},{"$f":"AC8*AC9","v":0},{"$f":"AD8*AD9","v":0},{"$f":"AE8*AE9","v":0},{"$f":"AF8*AF9","v":0},{"$f":"AG8*AG9","v":0},{"$f":"SUM(Tableau13[[#This Row],[Colonne25]:[Colonne34]])","v":0},{"$f":"MOD(Tableau13[[#This Row],[Colonne35]],100)","v":0},null,{"$f":"AK8*AK9","v":0},{"$f":"AL8*AL9","v":0},{"$f":"AM8*AM9","v":0},{"$f":"AN8*AN9","v":0},{"$f":"AO8*AO9","v":0},{"$f":"AP8*AP9","v":0},{"$f":"AQ8*AQ9","v":0},{"$f":"AR8*AR9","v":0},{"$f":"AS8*AS9","v":0},{"$f":"AT8*AT9","v":0},{"$f":"SUM(Tableau13[[#This Row],[Colonne38]:[Colonne47]])","v":0},{"$f":"MOD(Tableau13[[#This Row],[Colonne48]],100)","v":0},null,{"$f":"AX8*AX9","v":0},{"$f":"AY8*AY9","v":0},{"$f":"AZ8*AZ9","v":0},{"$f":"BA8*BA9","v":0},{"$f":"BB8*BB9","v":0},{"$f":"BC8*BC9","v":0},{"$f":"BD8*BD9","v":0},{"$f":"BE8*BE9","v":0},{"$f":"BF8*BF9","v":0},{"$f":"BG8*BG9","v":0},{"$f":"SUM(Tableau13[[#This Row],[Colonne51]:[Colonne60]])","v":0},{"$f":"MOD(Tableau13[[#This Row],[Colonne61]],100)","v":0},null,null,null,null,null,null,null,null,null,null,null,{"$f":"SUM(Tableau13[[#This Row],[Colonne64]:[Colonne73]])","v":0}]
{"$rows_left_out":12}
{"sheet":"حالة الاستخلاف","index":2,"n_rows":23,"n_cols":22,"rows_kept":23,"cut":false,"hidden":false,"merged":[[19,1,19,18],[17,1,17,10],[20,17,20,18],[20,12,20,16],[21,12,21,18],[21,1,21,3],[7,1,7,10],[13,2,13,7],[12,6,12,10],[15,5,15,7],[16,2,16,4],[16,5,16,6],[16,9,16,10],[12,2,12,3],[12,4,12,5],[11,2,11,3],[11,4,11,5],[10,2,10,3],[10,9,10,10],[4,5,4,11],[6,1,6,3],[6,4,6,5],[6,12,6,18],[6,6,6,7],[6,8,6,10],[8,11,8,18],[8,5,8,7],[8,2,8,3],[9,5,9,7],[9,2,9,3],[0,1,0,18],[1,1,1,18],[3,1,3,5],[2,15,2,18],[2,12,2,14],[3,15,3,18]]}
[null,"الجمهورية الجزائرية الديمقراطية الشعبية"]
[null,"وزارة التربية الوطنية"]
[null,"مديرية التربية لــولاية : ",{"$f":"'واجهة حجز'!C5","v":"المسيلة"},null,null,null,null,null,null,null,null,null,"المؤسسة : ",null,null,{"$f":"'واجهة حجز'!D3","v":"متوسطة بلطرش ثامر"},null,null,null,null,null,1]
[null,"مصلـحة تسيير نفقات المستخدمين",null,null,null,null,null,null,null,null,null,null," ",null,null,{"$f":"'واجهة حجز'!C4","v":"عين الحجل"}]
[null,null,null,null,null,"حـــــــالة  الاستـخـــــــلاف",null,null,null,null,null,null,null,null,null,null,null,null,null,null,null,"باشا توفيق"]
[]
[null,"مرفقة لطلب عطلة مرضية للسيد(ة) :",null,null,{"$f":"LOOKUP(V3,'القائمة '!A2:A21,'القائمة '!B2:B21)","v":0},null,"    رقم ح ج ب :   ",null,{"$f":"LOOKUP(V3,'القائمة '!A2:A21,'القائمة '!C2:C21)","v":0},null,null,"الوظيفة :  ",{"$f":"LOOKUP(V3,'القائمة '!A2:A21,'القائمة '!D2:D21)","v":0}]
[]
[null,"اسم  المستخلف :   ",{"$f":"LOOKUP(V3,'القائمة '!A2:A21,'القائمة '!I2:I21)","v":0},null,null,null,null,null,null,null,null,"حــالة تعويضات الاستخلاف المسددة  :"]
[null,"اللـقـب  :  ",{"$f":"LOOKUP(V3,'القائمة '!A2:A21,'القائمة '!J2:J21)","v":0},null,null,null,null,null,null,null,null,"المرتب الأساسي:",{"$f":"K16*45","v":0},"×",{"$f":"NETWORKDAYS.INTL(D15,F15,7,'واجهة حجز'!F5:Q505)","v":0},"/",30,"=",{"$f":"M10*O10/Q10","v":0}]
{"$rows_left_out":14}
{"sheet":"الشبكة الاستدلالية للمرتبات","index":3,"n_rows":31,"n_cols":19,"rows_kept":31,"cut":false,"hidden":true,"merged":[[24,0,26,16],[27,0,29,16],[30,0,32,16]]}
[null,null,"ر ا الأدنى",null,"الدرجات"]
["الرقم","الصنف",null,0,1,2,3,4,5,6,7,8,9,10,11,12,null,"الصنف","م  ت تعويضية"]
[1,1,200,0,10,20,30,40,50,60,70,80,90,100,110,120,null,11,1500]
[2,2,219,0,11,22,33,44,55,66,77,88,99,110,120,131,null,12,1500]
[3,3,240,0,12,24,36,48,60,72,84,96,108,120,132,144,null,13,1500]
[4,4,263,0,13,26,39,53,66,79,92,105,118,132,145,158,null,14,1500]
[5,5,288,0,14,29,43,58,72,86,101,115,130,144,158,173,null,15,1500]
[6,6,315,0,16,32,47,63,79,95,110,126,142,158,173,189,null,16,1500]
[7,7,348,0,17,35,52,70,87,104,122,139,157,174,191,209,null,17,1500]
[8,8,379,0,19,38,57,76,95,114,133,152,171,190,208,225]
{"$rows_left_out":21}