{"text_format":"1","workbook":"xlsx","n_sheets":4,"sheets":["واجهة حجز","قائمة","كشف الراتب","الشبكة الاستدلالية للمرتبات"],"not_rendered":{"charts":0,"images":0,"macros":1,"external_links":0,"defined_names":2,"comments":0,"pivot_tables":0},"unopened":[],"bounds":{"document_bytes":16777216,"sheet_cells":100000,"rows_first":2000,"rows_last":500,"rows_between":2000,"halvings":0,"cell_chars":16384,"cell_head_chars":4096},"cells_cut":0,"cells_raw":0,"read":"whole","date_system":"1900"}

{"sheet":"واجهة حجز","index":0,"n_rows":11,"n_cols":15,"rows_kept":11,"cut":false,"hidden":false,"merged":[[9,2,9,6],[10,2,10,6]]}
[]
["دون اسم المؤسسة:",null,"      المؤسسة : متوسطة بلطرش ثامر"]
["بلدية المؤسسة:",null,"عين الحجل",null,null,"أساتذة",1,"منحة الخبرة البيداغوجية","منحة تحفيزية تعويضية",null,"منحة السكن","منحة التأهيل","منحة نوعية للمنصب","منحة الدعم المدرسي","منحة التوثيق التربوي"]
["دون الشهر الموافق:",null,"فيفري 2018",null,null,"اداريين 1",2,"منحة التسيير المالي والمادي","منحة تحفيزية تعويضية",null,"منحة السكن","منحة التأهيل","منحة نوعية للمنصب","منحة الدعم المدرسي","منحة التوثيق التربوي"]
["المكان والتاريخ:",null,"عين الحجل في : ",{"$f":"TODAY()","v":"2018-02-21"},null,"اداريين 2",3,"منحة الخبرة البيداغوجية","منحة تحفيزية تعويضية","تعويض تسيير مؤسسة تعليمية","منحة السكن","منحة التأهيل","منحة نوعية للمنصب","منحة الدعم المدرسي","منحة التوثيق التربوي"]
["صفة الموقع:",null,"المسير المالي"]
[]
[]
[null,null,"ملاحظة هامة:"]
[null,null,"دون الرقم: 01 في خانة الأجر الوحيد واقتطاع التعاضدية إن وجدا"]
[null,null,"يتوافق مع نسخة 2010 فما فوق"]

{"sheet":"قائمة","index":1,"n_rows":583,"n_cols":27,"rows_kept":583,"cut":false,"hidden":false,"merged":[]}
["الرقم","اللقب والاسم","الرتبة","ح العائلية","ع \nالأولاد","<\n10","أ\nالوحيد","ت أ\n الوحيد","رقم الحساب","الصنف","الرقم إ الأدنى",null,"الرقم الاستدلالي","الدرجة",null,"الرقم إ للدرجات","م ت تعويضية","علاوة المنصب\nت ت م تعليمية","م التوثيق","م\n السكن","م التأهيل","م ن للمنصب","م د المدرسي",null,"إ \nالتعاضدية","إ \nالخدمات","إ \nأخرى"]
[1,"بن عامر حدة","أستاذ في التعليم المتوسط","متزوجة",null,null,null,null,"9223194/12",12,{"$f":"IF(J2=\"\",\"\",VLOOKUP(J2,'الشبكة الاستدلالية للمرتبات'!A:C,3,0))","v":537},{"$f":"MATCH(K2,'الشبكة الاستدلالية للمرتبات'!C2:C19,0)","v":13},{"$f":"K2+P2","v":537},null,{"$f":"MATCH(N2,'الشبكة الاستدلالية للمرتبات'!C2:P2,0)","v":2},{"$f":"INDEX('الشبكة الاستدلالية للمرتبات'!C2:P19,L2,O2)","v":0},{"$f":"VLOOKUP(J2,'الشبكة الاستدلالية للمرتبات'!R3:V19,5,0)","v":1500},null,{"$f":"VLOOKUP(J2,'الشبكة الاستدلالية للمرتبات'!R3:S19,2,0)","v":2500},{"$f":"VLOOKUP(J2,'الشبكة الاستدلالية للمرتبات'!R3:X19,7,0)","v":1000},{"$f":"VLOOKUP(J2,'الشبكة الاستدلالية للمرتبات'!R3:T19,3,0)","v":40},{"$f":"VLOOKUP(J2,'الشبكة الاستدلالية للمرتبات'!R3:U19,4,0)","v":10},{"$f":"VLOOKUP(J2,'الشبكة الاستدلالية للمرتبات'!R3:W19,6,0)","v":15}]
[2,"بوعافية خديجة","أستاذ في التعليم المتوسط","عازبة",null,null,null,null,"16354459/51",12,{"$f":"IF(J3=\"\",\"\",VLOOKUP(J3,'الشبكة الاستدلالية للمرتبات'!A:C,3,0))","v":537},{"$f":"MATCH(K3,'الشبكة الاستدلالية للمرتبات'!C2:C19,0)","v":13},537,null,{"$f":"MATCH(N3,'الشبكة الاستدلالية للمرتبات'!C2:P2,0)","v":2},{"$f":"INDEX('الشبكة الاستدلالية للمرتبات'!C2:P19,L3,O3)","v":0},{"$f":"VLOOKUP(J3,'الشبكة الاستدلالية للمرتبات'!R3:V19,5,0)","v":1500},null,{"$f":"VLOOKUP(J3,'الشبكة الاستدلالية للمرتبات'!R3:S19,2,0)","v":2500},{"$f":"VLOOKUP(J3,'الشبكة الاستدلالية للمرتبات'!R3:X19,7,0)","v":1000},{"$f":"VLOOKUP(J3,'الشبكة الاستدلالية للمرتبات'!R3:T19,3,0)","v":40},{"$f":"VLOOKUP(J3,'الشبكة الاستدلالية للمرتبات'!R3:U19,4,0)","v":10},{"$f":"VLOOKUP(J3,'الشبكة الاستدلالية للمرتبات'!R3:W19,6,0)","v":15}]
[3,"حرحوز عيسى","أستاذ التعليم الأساسي","متزوج",3,null,1,null,"2394609/19",11,{"$f":"IF(J4=\"\",\"\",VLOOKUP(J4,'الشبكة الاستدلالية للمرتبات'!A:C,3,0))","v":498},{"$f":"MATCH(K4,'الشبكة الاستدلالية للمرتبات'!C2:C19,0)","v":12},747,10,{"$f":"MATCH(N4,'الشبكة الاستدلالية للمرتبات'!C2:P2,0)","v":12},{"$f":"INDEX('الشبكة الاستدلالية للمرتبات'!C2:P19,L4,O4)","v":249},{"$f":"VLOOKUP(J4,'الشبكة الاستدلالية للمرتبات'!R3:V19,5,0)","v":1500},null,{"$f":"VLOOKUP(J4,'الشبكة الاستدلالية للمرتبات'!R3:S19,2,0)","v":2500},{"$f":"VLOOKUP(J4,'الشبكة الاستدلالية للمرتبات'!R3:X19,7,0)","v":0},{"$f":"VLOOKUP(J4,'الشبكة الاستدلالية للمرتبات'!R3:T19,3,0)","v":40},{"$f":"VLOOKUP(J4,'الشبكة الاستدلالية للمرتبات'!R3:U19,4,0)","v":0},{"$f":"VLOOKUP(J4,'الشبكة الاستدلالية للمرتبات'!R3:W19,6,0)","v":15}]
[4,"حرحوز لخضر","أستاذ رئيسي للتعليم المتوسط","متزوج",1,null,1,null,"6275828/59",13,{"$f":"IF(J5=\"\",\"\",VLOOKUP(J5,'الشبكة الاستدلالية للمرتبات'!A:C,3,0))","v":578},{"$f":"MATCH(K5,'الشبكة الاستدلالية للمرتبات'!C2:C19,0)","v":14},665,3,{"$f":"MATCH(N5,'الشبكة الاستدلالية للمرتبات'!C2:P2,0)","v":5},{"$f":"INDEX('الشبكة الاستدلالية للمرتبات'!C2:P19,L5,O5)","v":87},{"$f":"VLOOKUP(J5,'الشبكة الاستدلالية للمرتبات'!R3:V19,5,0)","v":1500},null,{"$f":"VLOOKUP(J5,'الشبكة الاستدلالية للمرتبات'!R3:S19,2,0)","v":3000},{"$f":"VLOOKUP(J5,'الشبكة الاستدلالية للمرتبات'!R3:X19,7,0)","v":1000},{"$f":"VLOOKUP(J5,'الشبكة الاستدلالية للمرتبات'!R3:T19,3,0)","v":45},{"$f":"VLOOKUP(J5,'الشبكة الاستدلالية للمرتبات'!R3:U19,4,0)","v":10},{"$f":"VLOOKUP(J5,'الشبكة الاستدلالية للمرتبات'!R3:W19,6,0)","v":15},null,1]
[5,"حرحوز نبيل","أستاذ في التعليم المتوسط","عازب",null,null,null,null,"11715250/64",12,{"$f":"IF(J6=\"\",\"\",VLOOKUP(J6,'الشبكة الاستدلالية للمرتبات'!A:C,3,0))","v":537},{"$f":"MATCH(K6,'الشبكة الاستدلالية للمرتبات'!C2:C19,0)","v":13},537,null,{"$f":"MATCH(N6,'الشبكة الاستدلالية للمرتبات'!C2:P2,0)","v":2},{"$f":"INDEX('الشبكة الاستدلالية للمرتبات'!C2:P19,L6,O6)","v":0},{"$f":"VLOOKUP(J6,'الشبكة الاستدلالية للمرتبات'!R3:V19,5,0)","v":1500},null,{"$f":"VLOOKUP(J6,'الشبكة الاستدلالية للمرتبات'!R3:S19,2,0)","v":2500},{"$f":"VLOOKUP(J6,'الشبكة الاستدلالية للمرتبات'!R3:X19,7,0)","v":1000},{"$f":"VLOOKUP(J6,'الشبكة الاستدلالية للمرتبات'!R3:T19,3,0)","v":40},{"$f":"VLOOKUP(J6,'الشبكة الاستدلالية للمرتبات'!R3:U19,4,0)","v":10},{"$f":"VLOOKUP(J6,'الشبكة الاستدلالية للمرتبات'!R3:W19,6,0)","v":15}]
[6,"خبال سعدية","أستاذ في التعليم المتوسط","متزوجة",2,null,1,null,"9388569/33",12,{"$f":"IF(J7=\"\",\"\",VLOOKUP(J7,'الشبكة الاستدلالية للمرتبات'!A:C,3,0))","v":537},{"$f":"MATCH(K7,'الشبكة الاستدلالية للمرتبات'!C2:C19,0)","v":13},591,2,{"$f":"MATCH(N7,'الشبكة الاستدلالية للمرتبات'!C2:P2,0)","v":4},{"$f":"INDEX('الشبكة الاستدلالية للمرتبات'!C2:P19,L7,O7)","v":54},{"$f":"VLOOKUP(J7,'الشبكة الاستدلالية للمرتبات'!R3:V19,5,0)","v":1500},null,{"$f":"VLOOKUP(J7,'الشبكة الاستدلالية للمرتبات'!R3:S19,2,0)","v":2500},{"$f":"VLOOKUP(J7,'الشبكة الاستدلالية للمرتبات'!R3:X19,7,0)","v":1000},{"$f":"VLOOKUP(J7,'الشبكة الاستدلالية للمرتبات'!R3:T19,3,0)","v":40},{"$f":"VLOOKUP(J7,'الشبكة الاستدلالية للمرتبات'!R3:U19,4,0)","v":10},{"$f":"VLOOKUP(J7,'الشبكة الاستدلالية للمرتبات'!R3:W19,6,0)","v":15}]
[7,"دبوسي نوال","أستاذ في التعليم المتوسط","عازبة",null,null,null,null,"6162574/12",12,{"$f":"IF(J8=\"\",\"\",VLOOKUP(J8,'الشبكة الاستدلالية للمرتبات'!A:C,3,0))","v":537},{"$f":"MATCH(K8,'الشبكة الاستدلالية للمرتبات'!C2:C19,0)","v":13},537,null,{"$f":"MATCH(N8,'الشبكة الاستدلالية للمرتبات'!C2:P2,0)","v":2},{"$f":"INDEX('الشبكة الاستدلالية للمرتبات'!C2:P19,L8,O8)","v":0},{"$f":"VLOOKUP(J8,'الشبكة الاستدلالية للمرتبات'!R3:V19,5,0)","v":1500},null,{"$f":"VLOOKUP(J8,'الشبكة الاستدلالية للمرتبات'!R3:S19,2,0)","v":2500},{"$f":"VLOOKUP(J8,'الشبكة الاستدلالية للمرتبات'!R3:X19,7,0)","v":1000},{"$f":"VLOOKUP(J8,'الشبكة الاستدلالية للمرتبات'!R3:T19,3,0)","v":40},{"$f":"VLOOKUP(J8,'الشبكة الاستدلالية للمرتبات'!R3:U19,4,0)","v":10},{"$f":"VLOOKUP(J8,'الشبكة الاستدلالية للمرتبات'!R3:W19,6,0)","v":15},null,1]
[8,"دوسن فطيمة زهرة","أستاذ في التعليم المتوسط","عازبة",null,null,null,null,"9391377/77",12,{"$f":"IF(J9=\"\",\"\",VLOOKUP(J9,'الشبكة الاستدلالية للمرتبات'!A:C,3,0))","v":537},{"$f":"MATCH(K9,'الشبكة الاستدلالية للمرتبات'!C2:C19,0)","v":13},564,1,{"$f":"MATCH(N9,'الشبكة الاستدلالية للمرتبات'!C2:P2,0)","v":3},{"$f":"INDEX('الشبكة الاستدلالية للمرتبات'!C2:P19,L9,O9)","v":27},{"$f":"VLOOKUP(J9,'الشبكة الاستدلالية للمرتبات'!R3:V19,5,0)","v":1500},null,{"$f":"VLOOKUP(J9,'الشبكة الاستدلالية للمرتبات'!R3:S19,2,0)","v":2500},{"$f":"VLOOKUP(J9,'الشبكة الاستدلالية للمرتبات'!R3:X19,7,0)","v":1000},{"$f":"VLOOKUP(J9,'الشبكة الاستدلالية للمرتبات'!R3:T19,3,0)","v":40},{"$f":"VLOOKUP(J9,'الشبكة الاستدلالية للمرتبات'!R3:U19,4,0)","v":10},{"$f":"VLOOKUP(J9,'الشبكة الاستدلالية للمرتبات'!R3:W19,6,0)","v":15}]
[9,"زايدي صخرية","أستاذ في التعليم المتوسط","متزوجة",null,null,null,null,"6400605/52",12,{"$f":"IF(J10=\"\",\"\",VLOOKUP(J10,'الشبكة الاستدلالية للمرتبات'!A:C,3,0))","v":537},{"$f":"MATCH(K10,'الشبكة الاستدلالية للمرتبات'!C2:C19,0)","v":13},591,2,{"$f":"MATCH(N10,'الشبكة الاستدلالية للمرتبات'!C2:P2,0)","v":4},{"$f":"INDEX('الشبكة الاستدلالية للمرتبات'!C2:P19,L10,O10)","v":54},{"$f":"VLOOKUP(J10,'الشبكة الاستدلالية للمرتبات'!R3:V19,5,0)","v":1500},null,{"$f":"VLOOKUP(J10,'الشبكة الاستدلالية للمرتبات'!R3:S19,2,0)","v":2500},{"$f":"VLOOKUP(J10,'الشبكة الاستدلالية للمرتبات'!R3:X19,7,0)","v":1000},{"$f":"VLOOKUP(J10,'الشبكة الاستدلالية للمرتبات'!R3:T19,3,0)","v":40},{"$f":"VLOOKUP(J10,'الشبكة الاستدلالية للمرتبات'!R3:U19,4,0)","v":10},{"$f":"VLOOKUP(J10,'الشبكة الاستدلالية للمرتبات'!R3:W19,6,0)","v":15}]
[10,"زيان لويزة","أستاذ في التعليم المتوسط","عازبة",null,null,null,null,"9878267/44",12,{"$f":"IF(J11=\"\",\"\",VLOOKUP(J11,'الشبكة الاستدلالية للمرتبات'!A:C,3,0))","v":537},{"$f":"MATCH(K11,'الشبكة الاستدلالية للمرتبات'!C2:C19,0)","v":13},564,1,{"$f":"MATCH(N11,'الشبكة الاستدلالية للمرتبات'!C2:P2,0)","v":3},{"$f":"INDEX('الشبكة الاستدلالية للمرتبات'!C2:P19,L11,O11)","v":27},{"$f":"VLOOKUP(J11,'الشبكة الاستدلالية للمرتبات'!R3:V19,5,0)","v":1500},null,{"$f":"VLOOKUP(J11,'الشبكة الاستدلالية للمرتبات'!R3:S19,2,0)","v":2500},{"$f":"VLOOKUP(J11,'الشبكة الاستدلالية للمرتبات'!R3:X19,7,0)","v":1000},{"$f":"VLOOKUP(J11,'الشبكة الاستدلالية للمرتبات'!R3:T19,3,0)","v":40},{"$f":"VLOOKUP(J11,'الشبكة الاستدلالية للمرتبات'!R3:U19,4,0)","v":10},{"$f":"VLOOKUP(J11,'الشبكة الاستدلالية للمرتبات'!R3:W19,6,0)","v":15}]
[11,"زيواش محمد","أستاذ مكون للتعليم المتوسط","متزوج",4,null,null,null,"6160522/65",15,{"$f":"IF(J12=\"\",\"\",VLOOKUP(J12,'الشبكة الاستدلالية للمرتبات'!A:C,3,0))","v":666},{"$f":"MATCH(K12,'الشبكة الاستدلالية للمرتبات'!C2:C19,0)","v":16},833,5,{"$f":"MATCH(N12,'الشبكة الاستدلالية للمرتبات'!C2:P2,0)","v":7},{"$f":"INDEX('الشبكة الاستدلالية للمرتبات'!C2:P19,L12,O12)","v":167},{"$f":"VLOOKUP(J12,'الشبكة الاستدلالية للمرتبات'!R3:V19,5,0)","v":1500},null,{"$f":"VLOOKUP(J12,'الشبكة الاستدلالية للمرتبات'!R3:S19,2,0)","v":3000},{"$f":"VLOOKUP(J12,'الشبكة الاستدلالية للمرتبات'!R3:X19,7,0)","v":1000},{"$f":"VLOOKUP(J12,'الشبكة الاستدلالية للمرتبات'!R3:T19,3,0)","v":45},{"$f":"VLOOKUP(J12,'الشبكة الاستدلالية للمرتبات'!R3:U19,4,0)","v":10},{"$f":"VLOOKUP(J12,'الشبكة الاستدلالية للمرتبات'!R3:W19,6,0)","v":15}]
[12,"سعداوي بلخير","أستاذ مكون للتعليم المتوسط","متزوج",1,1,1,null,"2117517/49",15,{"$f":"IF(J13=\"\",\"\",VLOOKUP(J13,'الشبكة الاستدلالية للمرتبات'!A:C,3,0))","v":666},{"$f":"MATCH(K13,'الشبكة الاستدلالية للمرتبات'!C2:C19,0)","v":16},999,10,{"$f":"MATCH(N13,'الشبكة الاستدلالية للمرتبات'!C2:P2,0)","v":12},{"$f":"INDEX('الشبكة الاستدلالية للمرتبات'!C2:P19,L13,O13)","v":333},{"$f":"VLOOKUP(J13,'الشبكة الاستدلالية للمرتبات'!R3:V19,5,0)","v":1500},null,{"$f":"VLOOKUP(J13,'الشبكة الاستدلالية للمرتبات'!R3:S19,2,0)","v":3000},{"$f":"VLOOKUP(J13,'الشبكة الاستدلالية للمرتبات'!R3:X19,7,0)","v":1000},{"$f":"VLOOKUP(J13,'الشبكة الاستدلالية للمرتبات'!R3:T19,3,0)","v":45},{"$f":"VLOOKUP(J13,'الشبكة الاستدلالية للمرتبات'!R3:U19,4,0)","v":10},{"$f":"VLOOKUP(J13,'الشبكة الاستدلالية للمرتبات'!R3:W19,6,0)","v":15},null,1]
[13,"سويب سميرة","أستاذ رئيسي للتعليم المتوسط","متزوجة",null,null,null,null,"1643787/27",13,{"$f":"IF(J14=\"\",\"\",VLOOKUP(J14,'الشبكة الاستدلالية للمرتبات'!A:C,3,0))","v":578},{"$f":"MATCH(K14,'الشبكة الاستدلالية للمرتبات'!C2:C19,0)","v":14},751,6,{"$f":"MATCH(N14,'الشبكة الاستدلالية للمرتبات'!C2:P2,0)","v":8},{"$f":"INDEX('الشبكة الاستدلالية للمرتبات'!C2:P19,L14,O14)","v":173},{"$f":"VLOOKUP(J14,'الشبكة الاستدلالية للمرتبات'!R3:V19,5,0)","v":1500},null,{"$f":"VLOOKUP(J14,'الشبكة الاستدلالية للمرتبات'!R3:S19,2,0)","v":3000},{"$f":"VLOOKUP(J14,'الشبكة الاستدلالية للمرتبات'!R3:X19,7,0)","v":1000},{"$f":"VLOOKUP(J14,'الشبكة الاستدلالية للمرتبات'!R3:T19,3,0)","v":45},{"$f":"VLOOKUP(J14,'الشبكة الاستدلالية للمرتبات'!R3:U19,4,0)","v":10},{"$f":"VLOOKUP(J14,'الشبكة الاستدلالية للمرتبات'!R3:W19,6,0)","v":15},null,1]
[14,"شريفي ليندة","أستاذ في التعليم المتوسط","متزوجة",null,null,null,null,"14742197/39",12,{"$f":"IF(J15=\"\",\"\",VLOOKUP(J15,'الشبكة الاستدلالية للمرتبات'!A:C,3,0))","v":537},{"$f":"MATCH(K15,'الشبكة الاستدلالية للمرتبات'!C2:C19,0)","v":13},537,null,{"$f":"MATCH(N15,'الشبكة الاستدلالية للمرتبات'!C2:P2,0)","v":2},{"$f":"INDEX('الشبكة الاستدلالية للمرتبات'!C2:P19,L15,O15)","v":0},{"$f":"VLOOKUP(J15,'الشبكة الاستدلالية للمرتبات'!R3:V19,5,0)","v":1500},null,{"$f":"VLOOKUP(J15,'الشبكة الاستدلالية للمرتبات'!R3:S19,2,0)","v":2500},{"$f":"VLOOKUP(J15,'الشبكة الاستدلالية للمرتبات'!R3:X19,7,0)","v":1000},{"$f":"VLOOKUP(J15,'الشبكة الاستدلالية للمرتبات'!R3:T19,3,0)","v":40},{"$f":"VLOOKUP(J15,'الشبكة الاستدلالية للمرتبات'!R3:U19,4,0)","v":10},{"$f":"VLOOKUP(J15,'الشبكة الاستدلالية للمرتبات'!R3:W19,6,0)","v":15},null,1]
[15,"فايد عائشة","أستاذ في التعليم المتوسط","متزوجة",null,null,null,null,"9802485/60",12,{"$f":"IF(J16=\"\",\"\",VLOOKUP(J16,'الشبكة الاستدلالية للمرتبات'!A:C,3,0))","v":537},{"$f":"MATCH(K16,'الشبكة الاستدلالية للمرتبات'!C2:C19,0)","v":13},564,1,{"$f":"MATCH(N16,'الشبكة الاستدلالية للمرتبات'!C2:P2,0)","v":3},{"$f":"INDEX('الشبكة الاستدلالية للمرتبات'!C2:P19,L16,O16)","v":27},{"$f":"VLOOKUP(J16,'الشبكة الاستدلالية للمرتبات'!R3:V19,5,0)","v":1500},null,{"$f":"VLOOKUP(J16,'الشبكة الاستدلالية للمرتبات'!R3:S19,2,0)","v":2500},{"$f":"VLOOKUP(J16,'الشبكة الاستدلالية للمرتبات'!R3:X19,7,0)","v":1000},{"$f":"VLOOKUP(J16,'الشبكة الاستدلالية للمرتبات'!R3:T19,3,0)","v":40},{"$f":"VLOOKUP(J16,'الشبكة الاستدلالية للمرتبات'!R3:U19,4,0)","v":10},{"$f":"VLOOKUP(J16,'الشبكة الاستدلالية للمرتبات'!R3:W19,6,0)","v":15}]
[16,"قاقي عبد الكريم","أستاذ في التعليم المتوسط","عازب",null,null,null,null,"9388228/91",12,{"$f":"IF(J17=\"\",\"\",VLOOKUP(J17,'الشبكة الاستدلالية للمرتبات'!A:C,3,0))","v":537},{"$f":"MATCH(K17,'الشبكة الاستدلالية للمرتبات'!C2:C19,0)","v":13},537,null,{"$f":"MATCH(N17,'الشبكة الاستدلالية للمرتبات'!C2:P2,0)","v":2},{"$f":"INDEX('الشبكة الاستدلالية للمرتبات'!C2:P19,L17,O17)","v":0},{"$f":"VLOOKUP(J17,'الشبكة الاستدلالية للمرتبات'!R3:V19,5,0)","v":1500},null,{"$f":"VLOOKUP(J17,'الشبكة الاستدلالية للمرتبات'!R3:S19,2,0)","v":2500},{"$f":"VLOOKUP(J17,'الشبكة الاستدلالية للمرتبات'!R3:X19,7,0)","v":1000},{"$f":"VLOOKUP(J17,'الشبكة الاستدلالية للمرتبات'!R3:T19,3,0)","v":40},{"$f":"VLOOKUP(J17,'الشبكة الاستدلالية للمرتبات'!R3:U19,4,0)","v":10},{"$f":"VLOOKUP(J17,'الشبكة الاستدلالية للمرتبات'!R3:W19,6,0)","v":15}]
[17,"قانة مريم","أستاذ في التعليم المتوسط","عازبة",null,null,null,null,"17553365/55",12,{"$f":"IF(J18=\"\",\"\",VLOOKUP(J18,'الشبكة الاستدلالية للمرتبات'!A:C,3,0))","v":537},{"$f":"MATCH(K18,'الشبكة الاستدلالية للمرتبات'!C2:C19,0)","v":13},537,null,{"$f":"MATCH(N18,'الشبكة الاستدلالية للمرتبات'!C2:P2,0)","v":2},{"$f":"INDEX('الشبكة الاستدلالية للمرتبات'!C2:P19,L18,O18)","v":0},{"$f":"VLOOKUP(J18,'الشبكة الاستدلالية للمرتبات'!R3:V19,5,0)","v":1500},null,{"$f":"VLOOKUP(J18,'الشبكة الاستدلالية للمرتبات'!R3:S19,2,0)","v":2500},{"$f":"VLOOKUP(J18,'الشبكة الاستدلالية للمرتبات'!R3:X19,7,0)","v":1000},{"$f":"VLOOKUP(J18,'الشبكة الاستدلالية للمرتبات'!R3:T19,3,0)","v":40},{"$f":"VLOOKUP(J18,'الشبكة الاستدلالية للمرتبات'!R3:U19,4,0)","v":10},{"$f":"VLOOKUP(J18,'الشبكة الاستدلالية للمرتبات'!R3:W19,6,0)","v":15}]
[18,"لباشي محمد","أستاذ رئيسي للتعليم المتوسط","متزوج",3,null,1,null,"6274485/46",13,{"$f":"IF(J19=\"\",\"\",VLOOKUP(J19,'الشبكة الاستدلالية للمرتبات'!A:C,3,0))","v":578},{"$f":"MATCH(K19,'الشبكة الاستدلالية للمرتبات'!C2:C19,0)","v":14},665,3,{"$f":"MATCH(N19,'الشبكة الاستدلالية للمرتبات'!C2:P2,0)","v":5},{"$f":"INDEX('الشبكة الاستدلالية للمرتبات'!C2:P19,L19,O19)","v":87},{"$f":"VLOOKUP(J19,'الشبكة الاستدلالية للمرتبات'!R3:V19,5,0)","v":1500},null,{"$f":"VLOOKUP(J19,'الشبكة الاستدلالية للمرتبات'!R3:S19,2,0)","v":3000},{"$f":"VLOOKUP(J19,'الشبكة الاستدلالية للمرتبات'!R3:X19,7,0)","v":1000},{"$f":"VLOOKUP(J19,'الشبكة الاستدلالية للمرتبات'!R3:T19,3,0)","v":45},{"$f":"VLOOKUP(J19,'الشبكة الاستدلالية للمرتبات'!R3:U19,4,0)","v":10},{"$f":"VLOOKUP(J19,'الشبكة الاستدلالية للمرتبات'!R3:W19,6,0)","v":15}]
[19,"لبزة يمينة","أستاذ في التعليم المتوسط","متزوجة",null,null,null,null,"9398669/47",12,{"$f":"IF(J20=\"\",\"\",VLOOKUP(J20,'الشبكة الاستدلالية للمرتبات'!A:C,3,0))","v":537},{"$f":"MATCH(K20,'الشبكة الاستدلالية للمرتبات'!C2:C19,0)","v":13},591,2,{"$f":"MATCH(N20,'الشبكة الاستدلالية للمرتبات'!C2:P2,0)","v":4},{"$f":"INDEX('الشبكة الاستدلالية للمرتبات'!C2:P19,L20,O20)","v":54},{"$f":"VLOOKUP(J20,'الشبكة الاستدلالية للمرتبات'!R3:V19,5,0)","v":1500},null,{"$f":"VLOOKUP(J20,'الشبكة الاستدلالية للمرتبات'!R3:S19,2,0)","v":2500},{"$f":"VLOOKUP(J20,'الشبكة الاستدلالية للمرتبات'!R3:X19,7,0)","v":1000},{"$f":"VLOOKUP(J20,'الشبكة الاستدلالية للمرتبات'!R3:T19,3,0)","v":40},{"$f":"VLOOKUP(J20,'الشبكة الاستدلالية للمرتبات'!R3:U19,4,0)","v":10},{"$f":"VLOOKUP(J20,'الشبكة الاستدلالية للمرتبات'!R3:W19,6,0)","v":15}]
{"$rows_left_out":564}
{"sheet":"كشف الراتب","index":2,"n_rows":41,"n_cols":18,"rows_kept":41,"cut":false,"hidden":false,"merged":[[10,14,11,15],[5,1,5,8],[5,9,5,10],[40,10,40,11],[13,1,22,1],[25,1,28,1],[31,1,36,1],[36,3,36,5],[38,6,38,10],[10,5,10,6],[6,6,6,10],[12,1,12,9],[8,2,8,4],[7,2,7,4],[1,1,1,11],[2,1,2,11],[3,1,3,3],[3,10,3,11],[4,1,4,3],[4,10,4,11]]}
[]
[null,"الجمهورية الجزائرية الديمقراطية الشعبية"]
[null,"وزارة التربية الوطنية",null,null,null,null,null,null,null,null,null,null,null,null,1,null,null," "]
[null,"مديرية التربية ",null,null,null,null,null,null,null,null,{"$f":"'واجهة حجز'!C2","v":"      المؤسسة : متوسطة بلطرش ثامر"},null,null,null,null,null,1]
[null,"لولاية : المسيلة",null,null,null,null,null,null,null,null,{"$f":"'واجهة حجز'!C3","v":"عين الحجل"}]
[null,"كشف الراتب لشهر : ",null,null,null,null,null,null,null,{"$f":"'واجهة حجز'!C4","v":"فيفري 2018"}]
[]
[null,"الإسم و اللقب   : ",{"$f":"LOOKUP(O3,قائمة!A2:A151,قائمة!B2:B301)","v":"بن عامر حدة"}]
[null,"الرتبة               : ",{"$f":"LOOKUP(O3,قائمة!A2:A151,قائمة!C2:C301)","v":"أستاذ في التعليم المتوسط"}]
[null,"الصنف            : ",{"$f":"LOOKUP(O3,قائمة!A2:A161,قائمة!J2:J79)","v":12},"الدرجة:",null,null,null,{"$f":"LOOKUP(O3,قائمة!A2:A171,قائمة!N2:N159)","v":0},null,null,"الرقم الإستدلالي :",{"$f":"LOOKUP(O3,قائمة!A2:A151,قائمة!M2:M151)","v":537}]
[null,"الحالة العائلية      : ",{"$f":"LOOKUP(O3,قائمة!A2:A151,قائمة!D2:D66)","v":"متزوجة"},"عدد الأولاد :",null,null,null,{"$f":"LOOKUP(O3,قائمة!A2:A171,قائمة!E2:E273)","v":0},null,{"$f":"LOOKUP(O3,قائمة!A2:A170,قائمة!F2:F161)","v":0},"رقم الحساب :",{"$f":"LOOKUP(O3,قائمة!A2:A41,قائمة!I2:I80)","v":"9223194/12"},null,null,"باشا توفيق"]
[]
[null,"عناصر المرتب",null,null,null,null,null,null,null,null,"المبالغ الشهرية","المبالغ السنوية"]
[null,"الأجر الخاضع للضمان الاجتماعي",null,"الأجر القاعدي",null,{"$f":"LOOKUP(O3,قائمة!A2:A151,قائمة!K2:K199)","v":537},45,null,null,null,{"$f":"F14*G14","v":24165},{"$f":"K14*12","v":289980}]
[null,null,null,"منحة الخبرة المهنية",0,{"$f":"LOOKUP(O3,قائمة!A2:A151,قائمة!P2:P387)","v":0},45,null,null,null,{"$f":"F15*G15","v":0},0]
[null,null,null,{"$f":"LOOKUP(Q4,'واجهة حجز'!G3:G5,'واجهة حجز'!H3:H4)","v":"منحة الخبرة البيداغوجية"},{"$f":"LOOKUP(O3,قائمة!A2:A151,قائمة!N2:N151)","v":0},4,{"$f":"E16*F16","v":0},null,null,null,{"$f":"K14*G16/100","v":0},0]
[null,null,null,{"$f":"LOOKUP(Q4,'واجهة حجز'!G3:G6,'واجهة حجز'!I3:I6)","v":"منحة تحفيزية تعويضية"},null,null,null,null,null,null,{"$f":"LOOKUP(O3,قائمة!A2:A151,قائمة!Q2:Q217)","v":1500},18000]
[null,null,null,{"$f":"LOOKUP(Q4,'واجهة حجز'!G3:G9,'واجهة حجز'!J3:J9)","v":0},35,null,45,null,null,null,{"$f":"LOOKUP(O3,قائمة!A2:A161,قائمة!R2:R163)","v":0},0]
[null,null,null,{"$f":"LOOKUP(Q4,'واجهة حجز'!G3:G5,'واجهة حجز'!K3:K6)","v":"منحة السكن"},null,null,null,null,null,null,{"$f":"LOOKUP(O3,قائمة!A2:A151,قائمة!T2:T451)","v":1000},12000]
[null,null,null,{"$f":"LOOKUP(Q4,'واجهة حجز'!G3:G6,'واجهة حجز'!L3:L6)","v":"منحة التأهيل"},null,null,{"$f":"LOOKUP(O3,قائمة!A2:A151,قائمة!U2:U461)","v":40},null,null,null,{"$f":"(K14+K15)*G20/100","v":9666},115992]
{"$rows_left_out":22}
{"sheet":"الشبكة الاستدلالية للمرتبات","index":3,"n_rows":30,"n_cols":24,"rows_kept":30,"cut":false,"hidden":true,"merged":[[29,15,31,23],[0,4,0,15],[23,15,25,23],[26,15,28,23]]}
[null,null,"ر ا الأدنى",null,"الدرجات"]
["الرقم","الصنف",null,0,1,2,3,4,5,6,7,8,9,10,11,12,null,"الصنف","م ت التربوي","م التأهيل","م  ن للمنصب","م  ت تعويضية","م  د المدرسي","م  السكن"]
[1,1,200,0,10,20,30,40,50,60,70,80,90,100,110,120,null,1,2000,40]
[2,2,219,0,11,22,33,44,55,66,77,88,99,110,120,131,null,2,2000,40]
[3,3,240,0,12,24,36,48,60,72,84,96,108,120,132,144,null,3,2000,40]
[4,4,263,0,13,26,39,53,66,79,92,105,118,132,145,158,null,4,2000,40]
[5,5,288,0,14,29,43,58,72,86,101,115,130,144,158,173,null,5,2000,40]
[6,6,315,0,16,32,47,63,79,95,110,126,142,158,173,189,null,6,2000,40]
[7,7,348,0,17,35,52,70,87,104,122,139,157,174,191,209,null,7,2000,40]
[8,8,379,0,19,38,57,76,95,114,133,152,171,190,208,225,null,8,2000,40]
[9,9,418,0,21,42,63,84,105,125,146,167,188,209,230,251,null,9,2000,40]
[10,10,453,0,23,45,68,91,113,136,159,181,204,227,249,272,null,10,2000,40]
[11,11,498,0,25,50,75,100,125,149,174,199,224,249,274,299,null,11,2500,40,null,1500,15]
[12,12,537,0,27,54,81,107,134,161,188,215,242,269,295,322,null,12,2500,40,10,1500,15,1000]
[13,13,578,0,29,58,87,116,145,173,202,231,260,289,318,347,null,13,3000,45,10,1500,15,1000]
[14,14,621,0,31,62,93,124,155,186,217,248,279,311,342,373,null,14,3000,45,10,1500,15,1000]
[15,15,666,0,33,67,100,133,167,200,133,266,300,333,366,400,null,15,3000,45,10,1500,15,1000]
[16,16,713,0,36,71,107,143,178,214,250,285,321,357,392,428,null,16,3000,45,10,1500,15,1000]
[17,17,762,0,38,76,114,152,191,229,267,305,343,381,419,457,null,17,3000,45,10,1500,15,1000]
[]
{"$rows_left_out":10}