{"text_format":"1","workbook":"xlsx","n_sheets":4,"sheets":["MAR","Preparation","Signatur","Cod"],"not_rendered":{"charts":0,"images":0,"macros":1,"external_links":1,"defined_names":7,"comments":0,"pivot_tables":0},"unopened":[],"bounds":{"document_bytes":16777216,"sheet_cells":100000,"rows_first":2000,"rows_last":500,"rows_between":2000,"halvings":0,"cell_chars":16384,"cell_head_chars":4096},"cells_cut":0,"cells_raw":0,"read":"whole","date_system":"1900"}

{"sheet":"MAR","index":0,"n_rows":235,"n_cols":41,"rows_kept":235,"cut":false,"hidden":false,"merged":[]}
["S",null,"Name","Tittle","2018-03-01","2018-03-02","2018-03-03","2018-03-04","2018-03-05","2018-03-06","2018-03-07","2018-03-08","2018-03-09","2018-03-10","2018-03-11","2018-03-12","2018-03-13","2018-03-14","2018-03-15","2018-03-16","2018-03-17","2018-03-18","2018-03-19","2018-03-20","2018-03-21","2018-03-22","2018-03-23","2018-03-24","2018-03-25","2018-03-26","2018-03-27","2018-03-28","2018-03-29","2018-03-30","2018-03-31","2018-04-01","2018-04-02","2018-04-03","2018-04-04","2018-04-05","2018-04-06"]
[1,1020100,"Mohammed 1","DUTY","R","H","H","H","H","H","R","R","R","M","M","M","M","M","M","R","R","R","M","M","M","M","M","M","R","R","R","A","A","A","A","A","A","R","R","R","H"]
[2,1020101,"Mohammed 2","DUTY","A","A","A","R","R","R","M","M","M","M","M","M","R","R","R","A","A","A","A","A","A","R","R","R","H","H","H","H","H","H","R","R","R","M","M","M","M"]
[3,1020102,"Mohammed 3","DUTY","R","R","R","M","M","M","R","M","M","R","R","R","M","M","M","M","M","M","R","R","R","A","A","A","A","A","A","R","R","R","H","H","H","H","H","H","R"]
[4,1020103,"Mohammed 4","DUTY","A","A","A","R","R","R","H","H","H","H","H","H","R","R","R","A","A","A","A","A","A","R","R","R","M","M","M","M","M","M","R","R","R","A","A","A","A"]
[5,1020104,"Mohammed 5","DUTY","M","M","M","M","M","M","R","R","R","A","A","A","A","A","A","R","R","R","H","H","H","H","H","H","R","R","R","A","A","A","A","A","A","R","R","R","M"]
[6,1020105,"Mohammed 6","DUTY","R","R","R","A","A","A","A","A","A","R","R","R","H","H","H","H","H","H","R","R","R","A","A","A","A","A","A","R","R","R","M","M","M","M","M","M","R"]
[7,1020106,"Mohammed 7","ASST","H","R","H","H","H","H","R","R","R","R","A","A","A","A","A","R","R","R","M","M","M","M","M","M","R","R","R","R","A","A","A","A","A","R","R","R","H"]
[8,1020107,"Mohammed 8","ASST","R","H","H","H","H","H","R","R","R","H","H","H","H","H","H","R","R","R","M","M","M","M","M","M","R","R","R","A","A","A","A","A","A","R","R","R","H"]
[9,1020108,"Mohammed 9","ASST","M","M","M","R","R","R","M","M","M","M","M","M","R","R","R","A","A","A","A","A","A","R","R","R","H","H","H","H","H","H","R","R","R","A","A","A","A"]
[10,1020109,"Mohammed 10","ASST","H","H","R","R","R","R","M","M","M","M","M","M","R","R","R","A","A","A","A","A","A","R","R","R","H","H","H","H","H","H","R","R","R","H","H","H","H"]
[11,1020110,"Mohammed 11","ASST","R","R","R","A","A","A","A","A","A","R","R","R","M","M","M","M","M","M","R","R","R","A","A","A","A","A","A","R","R","R","H","H","H","H","H","H","R"]
[12,1020111,"Mohammed 12","ASST","R","R","R","H","H","H","H","H","H","R","R","R","M","M","M","M","M","M","R","R","R","A","A","A","A","A","A","R","R","R","H","H","H","H","H","H","R"]
[13,1020112,"Mohammed 13","ASST","R","A","A","R","R","R","H","H","H","H","H","H","R","R","R","H","H","H","H","H","H","R","R","R","M","M","M","M","M","M","R","R","R","A","A","A","A"]
[14,1020113,"Mohammed 14","ASST","R","A","A","R","R","R","H","H","H","H","H","H","R","R","R","A","A","A","A","A","A","R","R","R","M","M","M","M","M","M","R","R","R","A","A","A","A"]
[15,1020114,"Mohammed 15","ASST","R","M","M","M","M","M","R","R","R","A","A","A","A","A","A","R","R","R","H","H","H","H","H","H","R","R","R","H","H","H","H","H","H","R","R","R","M"]
[16,1020115,"Mohammed 16","ASST","M","M","M","M","M","M","R","R","R","A","A","A","A","A","A","R","R","R","H","H","H","H","H","H","R","R","R","A","A","A","A","A","A","R","R","R","M"]
[17,1020116,"Mohammed 17","ASST","R","R","R","A","A","A","A","A","A","R","R","R","H","H","H","H","H","H","R","R","R","H","H","H","H","H","H","R","R","R","M","M","M","M","M","M","R"]
[18,1020117,"Mohammed 18","ASST","R","R","R","T","T","T","T","T","T","R","R","R","H","H","H","H","H","H","R","R","R","A","A","A","A","A","A","R","R","R","M","M","M","M","M","M","R"]
[19,1020118,"Mohammed 19","SQS","R","M","M","M","M","M","R","R","R","R","A","A","A","A","A","R","R","R","R","H","H","H","H","H","R","R","R","H","H","H","H","H","H","R","R","R","M"]
{"$rows_left_out":216}
{"sheet":"Preparation","index":1,"n_rows":62,"n_cols":13,"rows_kept":62,"cut":false,"hidden":false,"merged":[[27,10,27,12],[28,10,28,12],[38,10,38,12],[29,10,29,12],[30,10,30,12],[31,10,31,12],[32,10,32,12],[33,10,33,12],[34,10,34,12],[35,10,35,12],[36,10,36,12],[37,10,37,12],[34,7,34,9],[35,7,35,9],[36,7,36,9],[43,7,43,9],[29,7,29,9],[39,7,39,9],[40,7,40,9],[41,7,41,9],[42,7,42,9],[37,7,37,9],[38,7,38,9],[27,7,27,9],[30,7,30,9],[31,7,31,9],[32,7,32,9],[33,7,33,9],[28,7,28,9],[16,7,16,9],[17,7,17,9],[18,7,18,9],[19,7,19,9],[20,7,20,9],[11,7,11,9],[12,7,12,9],[13,7,13,9],[14,7,14,9],[15,7,15,9],[26,10,26,12],[26,7,26,9],[20,10,20,12],[21,10,21,12],[22,10,22,12],[23,10,23,12],[24,10,24,12],[21,7,21,9],[22,7,22,9],[23,7,23,9],[25,7,25,9],[25,10,25,12],[24,7,24,9],[15,10,15,12],[16,10,16,12],[17,10,17,12],[18,10,18,12],[19,10,19,12],[11,10,11,12],[12,10,12,12],[13,10,13,12],[14,10,14,12],[10,10,10,12],[1,0,2,0],[1,3,2,3],[0,11,0,12],[0,4,2,6],[3,10,3,12],[3,7,3,9],[1,7,2,9],[1,10,2,12],[10,7,10,9],[6,10,6,12],[7,10,7,12],[1,2,2,2],[1,1,2,1],[4,10,4,12],[5,7,5,9],[6,7,6,9],[5,10,5,12],[4,7,4,9],[7,7,7,9],[8,7,8,9],[8,10,8,12],[9,10,9,12],[9,7,9,9],[52,7,52,11],[39,10,39,12],[40,10,40,12],[51,7,51,11],[46,7,46,11],[47,7,47,11],[48,7,48,11],[49,7,49,11],[50,7,50,11],[44,10,44,12],[43,10,43,12],[44,7,44,9],[45,7,45,9],[41,10,41,12],[42,10,42,12]]}
["Duty","M",null,"Date H","Status",null,null,"2018-03-02","Date G",{"$f":"H1","v":"2018-03-02"},"Day",{"$f":"J1","v":"2018-03-02"}]
["No","Prn","Name","Tittel",null,null,null,"ASST",null,null,"DUTY"]
[]
[{"$f":"IF($C4<>\"\",ROW()-3,\"\")","v":1},{"$f":"IFERROR(INDEX(MAR!B$2:B$249,SMALL(IF(INDEX(MAR!$E$2:$AF$249,,MATCH($H$1,MAR!$E$1:$AF$1,0))=$B$1,ROW(MAR!$E$2:$AF$249)-ROW(MAR!$J$2)+1),ROWS(C$3:C3))),\"\")","v":1020104},{"$f":"IFERROR(INDEX(MAR!C$2:C$249,SMALL(IF(INDEX(MAR!$E$2:$AF$249,,MATCH($H$1,MAR!$E$1:$AF$1,0))=$B$1,ROW(MAR!$E$2:$AF$249)-ROW(MAR!$J$2)+1),ROWS(D$3:D3))),\"\")","v":"Mohammed 5"},{"$f":"IFERROR(INDEX(MAR!D$2:D$249,SMALL(IF(INDEX(MAR!$E$2:$AF$249,,MATCH($H$1,MAR!$E$1:$AF$1,0))=$B$1,ROW(MAR!$E$2:$AF$249)-ROW(MAR!$J$2)+1),ROWS(E$3:E3))),\"\")","v":"DUTY"}]
[{"$f":"IF($C5<>\"\",ROW()-3,\"\")","v":2},{"$f":"IFERROR(INDEX(MAR!B$2:B$249,SMALL(IF(INDEX(MAR!$E$2:$AF$249,,MATCH($H$1,MAR!$E$1:$AF$1,0))=$B$1,ROW(MAR!$E$2:$AF$249)-ROW(MAR!$J$2)+1),ROWS(C$3:C4))),\"\")","v":1020108},{"$f":"IFERROR(INDEX(MAR!C$2:C$249,SMALL(IF(INDEX(MAR!$E$2:$AF$249,,MATCH($H$1,MAR!$E$1:$AF$1,0))=$B$1,ROW(MAR!$E$2:$AF$249)-ROW(MAR!$J$2)+1),ROWS(D$3:D4))),\"\")","v":"Mohammed 9"},{"$f":"IFERROR(INDEX(MAR!D$2:D$249,SMALL(IF(INDEX(MAR!$E$2:$AF$249,,MATCH($H$1,MAR!$E$1:$AF$1,0))=$B$1,ROW(MAR!$E$2:$AF$249)-ROW(MAR!$J$2)+1),ROWS(E$3:E4))),\"\")","v":"ASST"}]
[3,{"$f":"IFERROR(INDEX(MAR!B$2:B$249,SMALL(IF(INDEX(MAR!$E$2:$AF$249,,MATCH($H$1,MAR!$E$1:$AF$1,0))=$B$1,ROW(MAR!$E$2:$AF$249)-ROW(MAR!$J$2)+1),ROWS(C$3:C5))),\"\")","v":1020114},{"$f":"IFERROR(INDEX(MAR!C$2:C$249,SMALL(IF(INDEX(MAR!$E$2:$AF$249,,MATCH($H$1,MAR!$E$1:$AF$1,0))=$B$1,ROW(MAR!$E$2:$AF$249)-ROW(MAR!$J$2)+1),ROWS(D$3:D5))),\"\")","v":"Mohammed 15"},{"$f":"IFERROR(INDEX(MAR!D$2:D$249,SMALL(IF(INDEX(MAR!$E$2:$AF$249,,MATCH($H$1,MAR!$E$1:$AF$1,0))=$B$1,ROW(MAR!$E$2:$AF$249)-ROW(MAR!$J$2)+1),ROWS(E$3:E5))),\"\")","v":"ASST"},null,null,null,null,null,null,"OFFICE"]
[4,{"$f":"IFERROR(INDEX(MAR!B$2:B$249,SMALL(IF(INDEX(MAR!$E$2:$AF$249,,MATCH($H$1,MAR!$E$1:$AF$1,0))=$B$1,ROW(MAR!$E$2:$AF$249)-ROW(MAR!$J$2)+1),ROWS(C$3:C6))),\"\")","v":1020115},{"$f":"IFERROR(INDEX(MAR!C$2:C$249,SMALL(IF(INDEX(MAR!$E$2:$AF$249,,MATCH($H$1,MAR!$E$1:$AF$1,0))=$B$1,ROW(MAR!$E$2:$AF$249)-ROW(MAR!$J$2)+1),ROWS(D$3:D6))),\"\")","v":"Mohammed 16"},{"$f":"IFERROR(INDEX(MAR!D$2:D$249,SMALL(IF(INDEX(MAR!$E$2:$AF$249,,MATCH($H$1,MAR!$E$1:$AF$1,0))=$B$1,ROW(MAR!$E$2:$AF$249)-ROW(MAR!$J$2)+1),ROWS(E$3:E6))),\"\")","v":"ASST"},null,null,null,"TOC"]
[5,{"$f":"IFERROR(INDEX(MAR!B$2:B$249,SMALL(IF(INDEX(MAR!$E$2:$AF$249,,MATCH($H$1,MAR!$E$1:$AF$1,0))=$B$1,ROW(MAR!$E$2:$AF$249)-ROW(MAR!$J$2)+1),ROWS(C$3:C7))),\"\")","v":1020118},{"$f":"IFERROR(INDEX(MAR!C$2:C$249,SMALL(IF(INDEX(MAR!$E$2:$AF$249,,MATCH($H$1,MAR!$E$1:$AF$1,0))=$B$1,ROW(MAR!$E$2:$AF$249)-ROW(MAR!$J$2)+1),ROWS(D$3:D7))),\"\")","v":"Mohammed 19"},{"$f":"IFERROR(INDEX(MAR!D$2:D$249,SMALL(IF(INDEX(MAR!$E$2:$AF$249,,MATCH($H$1,MAR!$E$1:$AF$1,0))=$B$1,ROW(MAR!$E$2:$AF$249)-ROW(MAR!$J$2)+1),ROWS(E$3:E7))),\"\")","v":"SQS"}]
[6,{"$f":"IFERROR(INDEX(MAR!B$2:B$249,SMALL(IF(INDEX(MAR!$E$2:$AF$249,,MATCH($H$1,MAR!$E$1:$AF$1,0))=$B$1,ROW(MAR!$E$2:$AF$249)-ROW(MAR!$J$2)+1),ROWS(C$3:C8))),\"\")","v":1020124},{"$f":"IFERROR(INDEX(MAR!C$2:C$249,SMALL(IF(INDEX(MAR!$E$2:$AF$249,,MATCH($H$1,MAR!$E$1:$AF$1,0))=$B$1,ROW(MAR!$E$2:$AF$249)-ROW(MAR!$J$2)+1),ROWS(D$3:D8))),\"\")","v":"Mohammed 25"},{"$f":"IFERROR(INDEX(MAR!D$2:D$249,SMALL(IF(INDEX(MAR!$E$2:$AF$249,,MATCH($H$1,MAR!$E$1:$AF$1,0))=$B$1,ROW(MAR!$E$2:$AF$249)-ROW(MAR!$J$2)+1),ROWS(E$3:E8))),\"\")","v":"SUP"}]
[7,{"$f":"IFERROR(INDEX(MAR!B$2:B$249,SMALL(IF(INDEX(MAR!$E$2:$AF$249,,MATCH($H$1,MAR!$E$1:$AF$1,0))=$B$1,ROW(MAR!$E$2:$AF$249)-ROW(MAR!$J$2)+1),ROWS(C$3:C9))),\"\")","v":1020130},{"$f":"IFERROR(INDEX(MAR!C$2:C$249,SMALL(IF(INDEX(MAR!$E$2:$AF$249,,MATCH($H$1,MAR!$E$1:$AF$1,0))=$B$1,ROW(MAR!$E$2:$AF$249)-ROW(MAR!$J$2)+1),ROWS(D$3:D9))),\"\")","v":"Mohammed 31"},{"$f":"IFERROR(INDEX(MAR!D$2:D$249,SMALL(IF(INDEX(MAR!$E$2:$AF$249,,MATCH($H$1,MAR!$E$1:$AF$1,0))=$B$1,ROW(MAR!$E$2:$AF$249)-ROW(MAR!$J$2)+1),ROWS(E$3:E9))),\"\")","v":"SUP"}]
[8,{"$f":"IFERROR(INDEX(MAR!B$2:B$249,SMALL(IF(INDEX(MAR!$E$2:$AF$249,,MATCH($H$1,MAR!$E$1:$AF$1,0))=$B$1,ROW(MAR!$E$2:$AF$249)-ROW(MAR!$J$2)+1),ROWS(C$3:C10))),\"\")","v":1020135},{"$f":"IFERROR(INDEX(MAR!C$2:C$249,SMALL(IF(INDEX(MAR!$E$2:$AF$249,,MATCH($H$1,MAR!$E$1:$AF$1,0))=$B$1,ROW(MAR!$E$2:$AF$249)-ROW(MAR!$J$2)+1),ROWS(D$3:D10))),\"\")","v":"Mohammed 36"},{"$f":"IFERROR(INDEX(MAR!D$2:D$249,SMALL(IF(INDEX(MAR!$E$2:$AF$249,,MATCH($H$1,MAR!$E$1:$AF$1,0))=$B$1,ROW(MAR!$E$2:$AF$249)-ROW(MAR!$J$2)+1),ROWS(E$3:E10))),\"\")","v":"SUP"}]
[9,{"$f":"IFERROR(INDEX(MAR!B$2:B$249,SMALL(IF(INDEX(MAR!$E$2:$AF$249,,MATCH($H$1,MAR!$E$1:$AF$1,0))=$B$1,ROW(MAR!$E$2:$AF$249)-ROW(MAR!$J$2)+1),ROWS(C$3:C11))),\"\")","v":1020136},{"$f":"IFERROR(INDEX(MAR!C$2:C$249,SMALL(IF(INDEX(MAR!$E$2:$AF$249,,MATCH($H$1,MAR!$E$1:$AF$1,0))=$B$1,ROW(MAR!$E$2:$AF$249)-ROW(MAR!$J$2)+1),ROWS(D$3:D11))),\"\")","v":"Mohammed 37"},{"$f":"IFERROR(INDEX(MAR!D$2:D$249,SMALL(IF(INDEX(MAR!$E$2:$AF$249,,MATCH($H$1,MAR!$E$1:$AF$1,0))=$B$1,ROW(MAR!$E$2:$AF$249)-ROW(MAR!$J$2)+1),ROWS(E$3:E11))),\"\")","v":"SUP"}]
[10,{"$f":"IFERROR(INDEX(MAR!B$2:B$249,SMALL(IF(INDEX(MAR!$E$2:$AF$249,,MATCH($H$1,MAR!$E$1:$AF$1,0))=$B$1,ROW(MAR!$E$2:$AF$249)-ROW(MAR!$J$2)+1),ROWS(C$3:C12))),\"\")","v":1020137},{"$f":"IFERROR(INDEX(MAR!C$2:C$249,SMALL(IF(INDEX(MAR!$E$2:$AF$249,,MATCH($H$1,MAR!$E$1:$AF$1,0))=$B$1,ROW(MAR!$E$2:$AF$249)-ROW(MAR!$J$2)+1),ROWS(D$3:D12))),\"\")","v":"Mohammed 38"},{"$f":"IFERROR(INDEX(MAR!D$2:D$249,SMALL(IF(INDEX(MAR!$E$2:$AF$249,,MATCH($H$1,MAR!$E$1:$AF$1,0))=$B$1,ROW(MAR!$E$2:$AF$249)-ROW(MAR!$J$2)+1),ROWS(E$3:E12))),\"\")","v":"SUP"}]
[11,{"$f":"IFERROR(INDEX(MAR!B$2:B$249,SMALL(IF(INDEX(MAR!$E$2:$AF$249,,MATCH($H$1,MAR!$E$1:$AF$1,0))=$B$1,ROW(MAR!$E$2:$AF$249)-ROW(MAR!$J$2)+1),ROWS(C$3:C13))),\"\")","v":1020138},{"$f":"IFERROR(INDEX(MAR!C$2:C$249,SMALL(IF(INDEX(MAR!$E$2:$AF$249,,MATCH($H$1,MAR!$E$1:$AF$1,0))=$B$1,ROW(MAR!$E$2:$AF$249)-ROW(MAR!$J$2)+1),ROWS(D$3:D13))),\"\")","v":"Mohammed 39"},{"$f":"IFERROR(INDEX(MAR!D$2:D$249,SMALL(IF(INDEX(MAR!$E$2:$AF$249,,MATCH($H$1,MAR!$E$1:$AF$1,0))=$B$1,ROW(MAR!$E$2:$AF$249)-ROW(MAR!$J$2)+1),ROWS(E$3:E13))),\"\")","v":"SUP"}]
[12,{"$f":"IFERROR(INDEX(MAR!B$2:B$249,SMALL(IF(INDEX(MAR!$E$2:$AF$249,,MATCH($H$1,MAR!$E$1:$AF$1,0))=$B$1,ROW(MAR!$E$2:$AF$249)-ROW(MAR!$J$2)+1),ROWS(C$3:C14))),\"\")","v":1020146},{"$f":"IFERROR(INDEX(MAR!C$2:C$249,SMALL(IF(INDEX(MAR!$E$2:$AF$249,,MATCH($H$1,MAR!$E$1:$AF$1,0))=$B$1,ROW(MAR!$E$2:$AF$249)-ROW(MAR!$J$2)+1),ROWS(D$3:D14))),\"\")","v":"Mohammed 47"},{"$f":"IFERROR(INDEX(MAR!D$2:D$249,SMALL(IF(INDEX(MAR!$E$2:$AF$249,,MATCH($H$1,MAR!$E$1:$AF$1,0))=$B$1,ROW(MAR!$E$2:$AF$249)-ROW(MAR!$J$2)+1),ROWS(E$3:E14))),\"\")","v":"TOC"}]
[13,{"$f":"IFERROR(INDEX(MAR!B$2:B$249,SMALL(IF(INDEX(MAR!$E$2:$AF$249,,MATCH($H$1,MAR!$E$1:$AF$1,0))=$B$1,ROW(MAR!$E$2:$AF$249)-ROW(MAR!$J$2)+1),ROWS(C$3:C15))),\"\")","v":1020151},{"$f":"IFERROR(INDEX(MAR!C$2:C$249,SMALL(IF(INDEX(MAR!$E$2:$AF$249,,MATCH($H$1,MAR!$E$1:$AF$1,0))=$B$1,ROW(MAR!$E$2:$AF$249)-ROW(MAR!$J$2)+1),ROWS(D$3:D15))),\"\")","v":"Mohammed 52"},{"$f":"IFERROR(INDEX(MAR!D$2:D$249,SMALL(IF(INDEX(MAR!$E$2:$AF$249,,MATCH($H$1,MAR!$E$1:$AF$1,0))=$B$1,ROW(MAR!$E$2:$AF$249)-ROW(MAR!$J$2)+1),ROWS(E$3:E15))),\"\")","v":"TOC"}]
[14,{"$f":"IFERROR(INDEX(MAR!B$2:B$249,SMALL(IF(INDEX(MAR!$E$2:$AF$249,,MATCH($H$1,MAR!$E$1:$AF$1,0))=$B$1,ROW(MAR!$E$2:$AF$249)-ROW(MAR!$J$2)+1),ROWS(C$3:C16))),\"\")","v":1020158},{"$f":"IFERROR(INDEX(MAR!C$2:C$249,SMALL(IF(INDEX(MAR!$E$2:$AF$249,,MATCH($H$1,MAR!$E$1:$AF$1,0))=$B$1,ROW(MAR!$E$2:$AF$249)-ROW(MAR!$J$2)+1),ROWS(D$3:D16))),\"\")","v":"Mohammed 59"},{"$f":"IFERROR(INDEX(MAR!D$2:D$249,SMALL(IF(INDEX(MAR!$E$2:$AF$249,,MATCH($H$1,MAR!$E$1:$AF$1,0))=$B$1,ROW(MAR!$E$2:$AF$249)-ROW(MAR!$J$2)+1),ROWS(E$3:E16))),\"\")","v":"OFFICE"}]
[15,{"$f":"IFERROR(INDEX(MAR!B$2:B$249,SMALL(IF(INDEX(MAR!$E$2:$AF$249,,MATCH($H$1,MAR!$E$1:$AF$1,0))=$B$1,ROW(MAR!$E$2:$AF$249)-ROW(MAR!$J$2)+1),ROWS(C$3:C17))),\"\")","v":1020161},{"$f":"IFERROR(INDEX(MAR!C$2:C$249,SMALL(IF(INDEX(MAR!$E$2:$AF$249,,MATCH($H$1,MAR!$E$1:$AF$1,0))=$B$1,ROW(MAR!$E$2:$AF$249)-ROW(MAR!$J$2)+1),ROWS(D$3:D17))),\"\")","v":"Mohammed 62"},{"$f":"IFERROR(INDEX(MAR!D$2:D$249,SMALL(IF(INDEX(MAR!$E$2:$AF$249,,MATCH($H$1,MAR!$E$1:$AF$1,0))=$B$1,ROW(MAR!$E$2:$AF$249)-ROW(MAR!$J$2)+1),ROWS(E$3:E17))),\"\")","v":"DOC"}]
[16,{"$f":"IFERROR(INDEX(MAR!B$2:B$249,SMALL(IF(INDEX(MAR!$E$2:$AF$249,,MATCH($H$1,MAR!$E$1:$AF$1,0))=$B$1,ROW(MAR!$E$2:$AF$249)-ROW(MAR!$J$2)+1),ROWS(C$3:C18))),\"\")","v":1020164},{"$f":"IFERROR(INDEX(MAR!C$2:C$249,SMALL(IF(INDEX(MAR!$E$2:$AF$249,,MATCH($H$1,MAR!$E$1:$AF$1,0))=$B$1,ROW(MAR!$E$2:$AF$249)-ROW(MAR!$J$2)+1),ROWS(D$3:D18))),\"\")","v":"Mohammed 65"},{"$f":"IFERROR(INDEX(MAR!D$2:D$249,SMALL(IF(INDEX(MAR!$E$2:$AF$249,,MATCH($H$1,MAR!$E$1:$AF$1,0))=$B$1,ROW(MAR!$E$2:$AF$249)-ROW(MAR!$J$2)+1),ROWS(E$3:E18))),\"\")","v":"DOC"}]
[17,{"$f":"IFERROR(INDEX(MAR!B$2:B$249,SMALL(IF(INDEX(MAR!$E$2:$AF$249,,MATCH($H$1,MAR!$E$1:$AF$1,0))=$B$1,ROW(MAR!$E$2:$AF$249)-ROW(MAR!$J$2)+1),ROWS(C$3:C19))),\"\")","v":1020168},{"$f":"IFERROR(INDEX(MAR!C$2:C$249,SMALL(IF(INDEX(MAR!$E$2:$AF$249,,MATCH($H$1,MAR!$E$1:$AF$1,0))=$B$1,ROW(MAR!$E$2:$AF$249)-ROW(MAR!$J$2)+1),ROWS(D$3:D19))),\"\")","v":"Mohammed 69"},{"$f":"IFERROR(INDEX(MAR!D$2:D$249,SMALL(IF(INDEX(MAR!$E$2:$AF$249,,MATCH($H$1,MAR!$E$1:$AF$1,0))=$B$1,ROW(MAR!$E$2:$AF$249)-ROW(MAR!$J$2)+1),ROWS(E$3:E19))),\"\")","v":"BAGGAGE"}]
{"$rows_left_out":43}
{"sheet":"Signatur","index":2,"n_rows":105,"n_cols":11,"rows_kept":105,"cut":false,"hidden":false,"merged":[[139,5,139,8],[131,5,131,8],[132,5,132,8],[133,5,133,8],[134,5,134,8],[135,5,135,8],[136,5,136,8],[125,5,125,8],[126,5,126,8],[127,5,127,8],[128,5,128,8],[129,5,129,8],[130,5,130,8],[118,5,118,8],[107,5,107,8],[108,5,108,8],[109,5,109,8],[110,5,110,8],[111,5,111,8],[112,5,112,8],[137,5,137,8],[138,5,138,8],[119,5,119,8],[120,5,120,8],[121,5,121,8],[122,5,122,8],[123,5,123,8],[124,5,124,8],[113,5,113,8],[114,5,114,8],[9,5,9,10],[10,5,10,10],[105,5,105,8],[106,5,106,8],[101,5,101,10],[102,5,102,10],[115,5,115,8],[116,5,116,8],[117,5,117,8],[11,5,11,10],[12,5,12,10],[13,5,13,10],[14,5,14,10],[15,5,15,10],[16,5,16,10],[17,5,17,10],[18,5,18,10],[19,5,19,10],[20,5,20,10],[21,5,21,10],[22,5,22,10],[23,5,23,10],[24,5,24,10],[25,5,25,10],[0,0,0,2],[1,0,1,2],[2,0,2,2],[3,0,3,2],[4,0,4,2],[7,5,7,10],[5,5,5,10],[6,5,6,10],[8,5,8,10],[0,6,0,10],[26,5,26,10],[27,5,27,10],[28,5,28,10],[29,5,29,10],[30,5,30,10],[31,5,31,10],[32,5,32,10],[33,5,33,10],[34,5,34,10],[35,5,35,10],[36,5,36,10],[37,5,37,10],[38,5,38,10],[39,5,39,10],[40,5,40,10],[41,5,41,10],[42,5,42,10],[43,5,43,10],[44,5,44,10],[45,5,45,10],[46,5,46,10],[47,5,47,10],[48,5,48,10],[49,5,49,10],[50,5,50,10],[51,5,51,10],[52,5,52,10],[53,5,53,10],[54,5,54,10],[55,5,55,10],[56,5,56,10],[57,5,57,10],[58,5,58,10],[59,5,59,10],[60,5,60,10],[61,5,61,10],[62,5,62,10],[63,5,63,10],[64,5,64,10],[77,5,77,10],[78,5,78,10],[79,5,79,10],[80,5,80,10],[81,5,81,10],[82,5,82,10],[65,5,65,10],[66,5,66,10],[67,5,67,10],[68,5,68,10],[69,5,69,10],[70,5,70,10],[71,5,71,10],[72,5,72,10],[73,5,73,10],[103,5,103,10],[104,5,104,10],[2,10,4,10],[92,5,92,10],[93,5,93,10],[94,5,94,10],[95,5,95,10],[96,5,96,10],[97,5,97,10],[98,5,98,10],[99,5,99,10],[100,5,100,10],[83,5,83,10],[84,5,84,10],[85,5,85,10],[86,5,86,10],[87,5,87,10],[88,5,88,10],[89,5,89,10],[90,5,90,10],[91,5,91,10],[74,5,74,10],[75,5,75,10],[76,5,76,10]]}
[null,null,null,null,"SHIFT",{"$f":"Preparation!B1","v":"M"}]
["Department",null,null,"Cost center","Date (H)","STAFF","DUTY","SUP","OFFICE",null,"NO SHOW"]
[null,null,null,null,{"$f":"Preparation!J1","v":"2018-03-02"},{"$f":"COUNT(Preparation!A4:A62)","v":54},{"$f":"COUNTIF($E$7:$E$105,$G$2)","v":1},{"$f":"COUNTIF($E$7:$E$105,$H$2)","v":0},{"$f":"COUNTIF($E$7:$E$105,$I$2)","v":0},{"$f":"COUNTIF($E$7:$E$105,$J$2)","v":0},{"$f":"F3-F5-G3-G5-H3-H5-I3-I5-J3-J5","v":53}]
["Division",null,null,"Location","Date (G)","BAGGAGE","ASST","TOC","AGENT"]
["Operations",null,null,null,{"$f":"Preparation!H1","v":"2018-03-02"},{"$f":"COUNTIF($E$7:$E$105,$F$4)","v":0},{"$f":"COUNTIF($E$7:$E$105,$G$4)","v":0},{"$f":"COUNTIF($E$7:$E$105,$H$4)","v":0},{"$f":"COUNTIF($E$7:$E$105,$I$4)","v":0},{"$f":"COUNTIF($E$7:$E$105,$J$4)","v":0}]
["NO","PRN","NAME","TIME IN","TAITTEL","NOTES"]
[{"$f":"IF($C7<>\"\",ROW()-6,\"\")","v":1},1020104,"Mohammed 5","21:38:26",{"$f":"IFERROR(INDEX(Preparation!$B$4:$D$62,MATCH($B7,Preparation!$B$4:$B$62,0),3),\"\")","v":"DUTY"}]
[{"$f":"IF($C8<>\"\",ROW()-6,\"\")","v":""},null,null,null,{"$f":"IFERROR(INDEX(Preparation!$B$4:$D$62,MATCH($B8,Preparation!$B$4:$B$62,0),3),\"\")","v":""}]
["",null,null,null,{"$f":"IFERROR(INDEX(Preparation!$B$4:$D$62,MATCH($B9,Preparation!$B$4:$B$62,0),3),\"\")","v":""}]
["",null,null,null,{"$f":"IFERROR(INDEX(Preparation!$B$4:$D$62,MATCH($B10,Preparation!$B$4:$B$62,0),3),\"\")","v":""}]
["",null,null,null,{"$f":"IFERROR(INDEX(Preparation!$B$4:$D$62,MATCH($B11,Preparation!$B$4:$B$62,0),3),\"\")","v":""}]
["",null,null,null,{"$f":"IFERROR(INDEX(Preparation!$B$4:$D$62,MATCH($B12,Preparation!$B$4:$B$62,0),3),\"\")","v":""}]
["",null,null,null,{"$f":"IFERROR(INDEX(Preparation!$B$4:$D$62,MATCH($B13,Preparation!$B$4:$B$62,0),3),\"\")","v":""}]
["",null,null,null,{"$f":"IFERROR(INDEX(Preparation!$B$4:$D$62,MATCH($B14,Preparation!$B$4:$B$62,0),3),\"\")","v":""}]
["",null,null,null,{"$f":"IFERROR(INDEX(Preparation!$B$4:$D$62,MATCH($B15,Preparation!$B$4:$B$62,0),3),\"\")","v":""}]
["",null,null,null,{"$f":"IFERROR(INDEX(Preparation!$B$4:$D$62,MATCH($B16,Preparation!$B$4:$B$62,0),3),\"\")","v":""}]
["",null,null,null,{"$f":"IFERROR(INDEX(Preparation!$B$4:$D$62,MATCH($B17,Preparation!$B$4:$B$62,0),3),\"\")","v":""}]
["",null,null,null,{"$f":"IFERROR(INDEX(Preparation!$B$4:$D$62,MATCH($B18,Preparation!$B$4:$B$62,0),3),\"\")","v":""}]
["",null,null,null,{"$f":"IFERROR(INDEX(Preparation!$B$4:$D$62,MATCH($B19,Preparation!$B$4:$B$62,0),3),\"\")","v":""}]
["",null,null,null,{"$f":"IFERROR(INDEX(Preparation!$B$4:$D$62,MATCH($B20,Preparation!$B$4:$B$62,0),3),\"\")","v":""}]
{"$rows_left_out":86}
{"sheet":"Cod","index":3,"n_rows":32,"n_cols":3,"rows_kept":32,"cut":false,"hidden":false,"merged":[]}
["Duty","DATE"]
["M","2018-03-01","2018-02-01"]
["A","2018-03-02","2018-02-02"]
["H","2018-03-03","2018-02-03"]
["حاضر","2018-03-04","2018-02-04"]
["غائب","2018-03-05","2018-02-05"]
["إجازة مرضية","2018-03-06","2018-02-06"]
["مستأذن دخول","2018-03-07","2018-02-07"]
["مستأذن خروج","2018-03-08","2018-02-08"]
["إجازة سنوية","2018-03-09","2018-02-09"]
[null,"2018-03-10","2018-02-10"]
[null,"2018-03-11","2018-02-11"]
[null,"2018-03-12","2018-02-12"]
[null,"2018-03-13","2018-02-13"]
[null,"2018-03-14","2018-02-14"]
[null,"2018-03-15","2018-02-15"]
[null,"2018-03-16","2018-02-16"]
[null,"2018-03-17","2018-02-17"]
[null,"2018-03-18","2018-02-18"]
[null,"2018-03-19","2018-02-19"]
{"$rows_left_out":12}