{"text_format":"1","workbook":"xlsx","n_sheets":4,"sheets":["MAR","Preparation","Signatur","Cod"],"not_rendered":{"charts":0,"images":0,"macros":1,"external_links":1,"defined_names":7,"comments":0,"pivot_tables":0},"unopened":[],"bounds":{"document_bytes":16777216,"sheet_cells":100000,"rows_first":2000,"rows_last":500,"rows_between":2000,"halvings":0,"cell_chars":16384,"cell_head_chars":4096},"cells_cut":0,"cells_raw":0,"read":"whole","date_system":"1900"}

{"sheet":"MAR","index":0,"n_rows":235,"n_cols":41,"rows_kept":235,"cut":false,"hidden":false,"merged":[]}
["S",null,"Name","Tittle","2018-03-01","2018-03-02","2018-03-03","2018-03-04","2018-03-05","2018-03-06","2018-03-07","2018-03-08","2018-03-09","2018-03-10","2018-03-11","2018-03-12","2018-03-13","2018-03-14","2018-03-15","2018-03-16","2018-03-17","2018-03-18","2018-03-19","2018-03-20","2018-03-21","2018-03-22","2018-03-23","2018-03-24","2018-03-25","2018-03-26","2018-03-27","2018-03-28","2018-03-29","2018-03-30","2018-03-31","2018-04-01","2018-04-02","2018-04-03","2018-04-04","2018-04-05","2018-04-06"]
[1,1020100,"Mohammed 1","DUTY","R","H","H","H","H","H","R","R","R","M","M","M","M","M","M","R","R","R","M","M","M","M","M","M","R","R","R","A","A","A","A","A","A","R","R","R","H"]
[2,1020101,"Mohammed 2","DUTY","A","A","A","R","R","R","M","M","M","M","M","M","R","R","R","A","A","A","A","A","A","R","R","R","H","H","H","H","H","H","R","R","R","M","M","M","M"]
[3,1020102,"Mohammed 3","DUTY","R","R","R","M","M","M","R","M","M","R","R","R","M","M","M","M","M","M","R","R","R","A","A","A","A","A","A","R","R","R","H","H","H","H","H","H","R"]
[4,1020103,"Mohammed 4","DUTY","A","A","A","R","R","R","H","H","H","H","H","H","R","R","R","A","A","A","A","A","A","R","R","R","M","M","M","M","M","M","R","R","R","A","A","A","A"]
[5,1020104,"Mohammed 5","DUTY","M","M","M","M","M","M","R","R","R","A","A","A","A","A","A","R","R","R","H","H","H","H","H","H","R","R","R","A","A","A","A","A","A","R","R","R","M"]
[6,1020105,"Mohammed 6","DUTY","R","R","R","A","A","A","A","A","A","R","R","R","H","H","H","H","H","H","R","R","R","A","A","A","A","A","A","R","R","R","M","M","M","M","M","M","R"]
[7,1020106,"Mohammed 7","ASST","H","R","H","H","H","H","R","R","R","R","A","A","A","A","A","R","R","R","M","M","M","M","M","M","R","R","R","R","A","A","A","A","A","R","R","R","H"]
[8,1020107,"Mohammed 8","ASST","R","H","H","H","H","H","R","R","R","H","H","H","H","H","H","R","R","R","M","M","M","M","M","M","R","R","R","A","A","A","A","A","A","R","R","R","H"]
[9,1020108,"Mohammed 9","ASST","M","M","M","R","R","R","M","M","M","M","M","M","R","R","R","A","A","A","A","A","A","R","R","R","H","H","H","H","H","H","R","R","R","A","A","A","A"]
[10,1020109,"Mohammed 10","ASST","H","H","R","R","R","R","M","M","M","M","M","M","R","R","R","A","A","A","A","A","A","R","R","R","H","H","H","H","H","H","R","R","R","H","H","H","H"]
[11,1020110,"Mohammed 11","ASST","R","R","R","A","A","A","A","A","A","R","R","R","M","M","M","M","M","M","R","R","R","A","A","A","A","A","A","R","R","R","H","H","H","H","H","H","R"]
[12,1020111,"Mohammed 12","ASST","R","R","R","H","H","H","H","H","H","R","R","R","M","M","M","M","M","M","R","R","R","A","A","A","A","A","A","R","R","R","H","H","H","H","H","H","R"]
[13,1020112,"Mohammed 13","ASST","R","A","A","R","R","R","H","H","H","H","H","H","R","R","R","H","H","H","H","H","H","R","R","R","M","M","M","M","M","M","R","R","R","A","A","A","A"]
[14,1020113,"Mohammed 14","ASST","R","A","A","R","R","R","H","H","H","H","H","H","R","R","R","A","A","A","A","A","A","R","R","R","M","M","M","M","M","M","R","R","R","A","A","A","A"]
[15,1020114,"Mohammed 15","ASST","R","M","M","M","M","M","R","R","R","A","A","A","A","A","A","R","R","R","H","H","H","H","H","H","R","R","R","H","H","H","H","H","H","R","R","R","M"]
[16,1020115,"Mohammed 16","ASST","M","M","M","M","M","M","R","R","R","A","A","A","A","A","A","R","R","R","H","H","H","H","H","H","R","R","R","A","A","A","A","A","A","R","R","R","M"]
[17,1020116,"Mohammed 17","ASST","R","R","R","A","A","A","A","A","A","R","R","R","H","H","H","H","H","H","R","R","R","H","H","H","H","H","H","R","R","R","M","M","M","M","M","M","R"]
[18,1020117,"Mohammed 18","ASST","R","R","R","T","T","T","T","T","T","R","R","R","H","H","H","H","H","H","R","R","R","A","A","A","A","A","A","R","R","R","M","M","M","M","M","M","R"]
[19,1020118,"Mohammed 19","SQS","R","M","M","M","M","M","R","R","R","R","A","A","A","A","A","R","R","R","R","H","H","H","H","H","R","R","R","H","H","H","H","H","H","R","R","R","M"]
[20,1020119,"Mohammed 20","SUP","H","H","H","H","H","H","R","R","R","M","M","M","M","M","M","R","R","R","M","M","M","M","M","M","R","R","R","A","A","A","A","A","A","R","R","R","H"]
[21,1020120,"Mohammed 21","SUP","H","H","H","H","H","H","R","R","R","A","A","A","A","A","A","R","R","R","M","M","M","M","M","M","R","R","R","A","A","A","A","A","A","R","R","R","H"]
[22,1020121,"Mohammed 22","SUP","H","H","H","H","H","H","R","R","R","H","H","H","H","H","H","R","R","R","M","M","M","M","M","M","R","R","R","A","A","A","A","A","A","R","R","R","H"]
[23,1020122,"Mohammed 23","SUP","R","H","H","H","H","H","R","R","R","M","M","M","M","M","M","R","R","R","M","M","M","M","M","M","R","R","R","A","A","A","A","A","A","R","R","R","H"]
[24,1020123,"Mohammed 24","SUP","A","A","A","R","R","R","M","M","M","M","M","M","R","R","R","A","A","A","A","A","A","R","R","R","H","H","H","H","H","H","R","R","R","M","M","M","M"]
[25,1020124,"Mohammed 25","SUP","M","M","M","R","R","R","M","M","M","M","M","M","R","R","R","A","A","A","A","A","A","R","R","R","H","H","H","H","H","H","R","R","R","A","A","A","A"]
[26,1020125,"Mohammed 26","SUP","A","A","A","R","R","R","M","M","M","M","M","M","R","R","R","A","A","A","A","A","A","R","R","R","H","H","H","H","H","H","R","R","R","H","H","H","H"]
[27,1020126,"Mohammed 27","SUP","R","H","H","R","R","R","R","M","M","M","M","M","R","R","R","R","A","A","A","A","A","R","R","R","H","H","H","H","H","H","R","R","R","M","M","M","M"]
[28,1020127,"Mohammed 28","SUP","R","R","R","M","M","M","M","M","M","R","R","R","M","M","M","M","M","M","R","R","R","A","A","A","A","A","A","R","R","R","H","H","H","H","H","H","R"]
[29,1020128,"Mohammed 29","SUP","R","R","R","A","A","A","A","A","A","R","R","R","M","M","M","M","M","M","R","R","R","A","A","A","A","A","A","R","R","R","H","H","H","H","H","H","R"]
[30,1020129,"Mohammed 30","SUP","R","R","R","H","H","H","H","H","H","R","R","R","M","M","M","M","M","M","R","R","R","A","A","A","A","A","A","R","R","R","H","H","H","H","H","H","R"]
[31,1020130,"Mohammed 31","SUP","M","M","M","M","R","M","M","M","M","R","R","R","R","M","M","M","M","M","R","R","R","A","A","A","A","A","A","R","R","R","H","H","H","H","H","H","R"]
[32,1020131,"Mohammed 32","SUP","A","A","A","R","R","R","H","H","H","H","H","H","R","R","R","A","A","A","A","A","A","R","R","R","M","M","M","M","M","M","R","R","R","A","A","A","A"]
[33,1020132,"Mohammed 33","SUP","R","A","A","R","R","R","H","H","H","H","H","R","R","R","R","A","A","A","A","A","R","R","R","R","M","M","M","M","M","M","R","R","R","A","A","A","A"]
[34,1020133,"Mohammed 34","SUP","R","A","A","R","R","R","R","H","H","H","H","H","R","R","R","R","H","H","H","H","H","R","R","R","M","M","M","M","M","M","R","R","R","A","A","A","A"]
[35,1020134,"Mohammed 35","SUP","A","A","A","R","R","R","H","H","H","H","H","H","R","R","R","A","A","A","A","A","A","R","R","R","M","M","M","M","M","M","R","R","R","A","A","A","A"]
[36,1020135,"Mohammed 36","SUP","R","M","M","M","M","M","R","R","R","R","A","A","A","A","A","R","R","R","R","H","H","H","H","H","R","R","R","A","A","A","A","A","A","R","R","R","M"]
[37,1020136,"Mohammed 37","SUP","R","M","M","M","M","M","R","R","R","R","A","A","A","A","A","R","R","R","R","H","H","H","H","H","R","R","R","H","H","H","H","H","H","R","R","R","M"]
[38,1020137,"Mohammed 38","SUP","R","M","M","M","M","M","R","R","R","A","A","A","A","A","A","R","R","R","H","H","H","H","H","H","R","R","R","A","A","A","A","A","A","R","R","R","M"]
[39,1020138,"Mohammed 39","SUP","R","M","M","M","M","M","R","R","R","A","A","A","A","A","A","R","R","R","H","H","H","H","H","H","R","R","R","H","H","H","H","H","H","R","R","R","M"]
[40,1020139,"Mohammed 40","SUP","A","A","A","A","A","A","R","A","A","R","R","R","H","H","H","H","H","H","R","R","R","H","H","H","H","H","H","R","R","R","M","M","M","M","M","M","R"]
[41,1020140,"Mohammed 41","SUP","A","A","A","A","A","A","R","A","A","R","R","R","H","H","H","H","H","H","R","R","R","A","A","A","A","A","A","R","R","R","M","M","M","M","M","M","R"]
[42,1020141,"Mohammed 42","SUP","R","R","R","A","A","A","A","A","A","R","R","R","H","H","H","H","H","H","R","R","R","H","H","H","H","H","H","R","R","R","M","M","M","M","M","M","R"]
[43,1020142,"Mohammed 43","SUP","A","A","A","A","A","A","R","A","A","R","R","R","H","H","H","H","H","H","R","R","R","A","A","A","A","A","A","R","R","R","M","M","M","M","M","M","R"]
[44,1020143,"Mohammed 44","TOC","H","H","H","H","H","H","R","R","R","A","A","A","A","A","A","R","R","R","M","M","M","M","M","M","R","R","R","A","A","A","A","A","A","R","R","R","H"]
[45,1020144,"Mohammed 45","TOC","H","H","H","H","H","H","R","R","R","H","H","H","H","H","H","R","R","R","M","M","M","M","M","M","R","R","R","A","A","A","A","A","A","R","R","R","H"]
[46,1020145,"Mohammed 46","TOC","H","H","H","R","R","R","M","M","M","M","M","M","R","R","R","A","A","A","A","A","A","R","R","R","H","H","H","H","H","H","R","R","R","A","A","A","A"]
[47,1020146,"Mohammed 47","TOC","M","M","M","R","R","R","M","M","M","M","M","M","R","R","R","A","A","A","A","A","A","R","R","R","H","H","H","H","H","H","R","R","R","H","H","H","H"]
[48,1020147,"Mohammed 48","TOC","R","R","R","A","A","A","A","A","A","R","R","R","M","M","M","M","M","M","R","R","R","A","A","A","A","A","A","R","R","R","H","H","H","H","H","H","R"]
[49,1020148,"Mohammed 49","TOC","R","R","R","H","H","H","H","H","H","R","R","R","M","M","M","M","M","M","R","R","R","A","A","A","A","A","A","R","R","R","H","H","H","H","H","H","R"]
[50,1020149,"Mohammed 50","TOC","A","A","A","R","R","R","H","H","H","H","H","H","R","R","R","H","H","H","H","H","H","R","R","R","M","M","M","M","M","M","R","R","R","A","A","A","A"]
[51,1020150,"Mohammed 51","TOC","A","A","A","R","R","R","H","H","H","H","H","H","R","R","R","A","A","A","A","A","A","R","R","R","M","M","M","M","M","M","R","R","R","A","A","A","A"]
[52,1020151,"Mohammed 52","TOC","M","M","M","M","M","M","R","R","R","A","A","A","A","A","A","R","R","R","H","H","H","H","H","H","R","R","R","A","A","A","A","A","A","R","R","R","M"]
[53,1020152,"Mohammed 53","TOC","R","R","R","A","A","A","A","A","A","R","R","R","H","H","H","H","H","H","R","R","R","H","H","H","H","H","H","R","R","R","M","M","M","M","M","M","R"]
[54,1020153,"Mohammed 54","TOC","R","R","R","A","A","A","A","A","A","R","R","R","H","H","H","H","H","H","R","R","R","A","A","A","A","A","A","R","R","R","M","M","M","M","M","M","R"]
[55,1020154,"Mohammed 55","OFFICE","H","R","H","H","H","H","R","R","R","R","M","M","M","M","M","R","R","R","M","M","M","M","M","M","R","R","R","R","A","A","A","A","A","R","R","R","H"]
[56,1020155,"Mohammed 56","OFFICE","A","A","A","R","R","R","M","M","M","M","M","M","R","R","R","A","A","A","A","A","A","R","R","R","H","H","H","H","H","H","R","R","R","M","M","M","M"]
[57,1020156,"Mohammed 57","OFFICE","R","R","R","R","M","M","M","M","M","R","R","R","R","M","M","M","M","M","R","R","R","R","A","A","A","A","A","R","R","R","H","H","H","H","H","H","R"]
[58,1020157,"Mohammed 58","OFFICE","A","A","A","R","R","R","H","H","H","H","H","H","R","R","R","H","H","H","H","H","H","R","R","R","M","M","M","M","M","M","R","R","R","A","A","A","A"]
[59,1020158,"Mohammed 59","OFFICE","M","M","M","M","M","M","R","R","R","A","A","A","A","A","A","R","R","R","H","H","H","H","H","H","R","R","R","H","H","H","H","H","H","R","R","R","M"]
[60,1020159,"Mohammed 60","OFFICE","R","R","R","A","A","A","A","A","A","R","R","R","H","H","H","H","H","H","R","R","R","H","H","H","H","H","H","R","R","R","M","M","M","M","M","M","R"]
[61,1020160,"Mohammed 61","DOC","H","H","H","H","H","H","R","R","R","H","H","H","H","H","H","R","R","R","M","M","M","M","M","M","R","R","R","A","A","A","A","A","A","R","R","R","H"]
[62,1020161,"Mohammed 62","DOC","M","M","M","R","R","R","M","M","M","M","M","M","R","R","R","A","A","A","A","A","A","R","R","R","H","H","H","H","H","H","R","R","R","H","H","H","H"]
[63,1020162,"Mohammed 63","DOC","R","R","R","H","H","H","H","H","H","R","R","R","M","M","M","M","M","M","R","R","R","A","A","A","A","A","A","R","R","R","H","H","H","H","H","H","R"]
[64,1020163,"Mohammed 64","DOC","A","A","A","R","R","R","H","H","H","H","H","H","R","R","R","H","H","H","H","H","H","R","R","R","M","M","M","M","M","M","R","R","R","A","A","A","A"]
[65,1020164,"Mohammed 65","DOC","M","M","M","M","M","M","R","R","R","A","A","A","A","A","A","R","R","R","H","H","H","H","H","H","R","R","R","H","H","H","H","H","H","R","R","R","M"]
[66,1020165,"Mohammed 66","DOC","R","R","R","A","A","A","A","A","A","R","R","R","H","H","H","H","H","H","R","R","R","H","H","H","H","H","H","R","R","R","M","M","M","M","M","M","R"]
[67,1020166,"Mohammed 67","BAGGAGE","R","H","H","H","H","H","R","R","R","H","H","H","H","H","H","R","R","R","M","M","M","M","M","M","R","R","R","A","A","A","A","A","A","R","R","R","H"]
[68,1020167,"Mohammed 68","BAGGAGE","R","H","H","H","H","H","R","R","R","M","M","M","M","M","M","R","R","R","M","M","M","M","M","M","R","R","R","A","A","A","A","A","A","R","R","R","H"]
[69,1020168,"Mohammed 69","BAGGAGE","M","M","M","R","R","R","M","M","M","M","M","M","R","R","R","A","A","A","A","A","A","R","R","R","H","H","H","H","H","H","R","R","R","H","H","H","H"]
[70,1020169,"Mohammed 70","BAGGAGE","A","A","A","R","R","R","M","M","M","M","M","M","R","R","R","A","A","A","A","A","A","R","R","R","H","H","H","H","H","H","R","R","R","M","M","M","M"]
[71,1020170,"Mohammed 71","BAGGAGE","R","R","R","M","M","M","M","M","M","R","R","R","M","M","M","M","M","M","R","R","R","A","A","A","A","A","A","R","R","R","H","H","H","H","H","H","R"]
[72,1020171,"Mohammed 72","BAGGAGE","R","R","R","A","A","A","A","A","A","R","R","R","M","M","M","M","M","M","R","R","R","A","A","A","A","A","A","R","R","R","H","H","H","H","H","H","R"]
[73,1020172,"Mohammed 73","BAGGAGE","A","A","A","R","R","R","H","H","H","H","H","H","R","R","R","A","A","A","A","A","A","R","R","R","M","M","M","M","M","M","R","R","R","A","A","A","A"]
[74,1020173,"Mohammed 74","BAGGAGE","R","A","A","R","R","R","R","H","H","H","H","H","R","R","R","R","H","H","H","H","H","R","R","R","M","M","M","M","M","M","R","R","R","A","A","A","A"]
[75,1020174,"Mohammed 75","BAGGAGE","M","M","M","M","M","M","R","R","R","A","A","A","A","A","A","R","R","R","H","H","H","H","H","H","R","R","R","H","H","H","H","H","H","R","R","R","M"]
[76,1020175,"Mohammed 76","BAGGAGE","M","M","M","M","M","M","R","R","R","A","A","A","A","A","A","R","R","R","H","H","H","H","H","H","R","R","R","A","A","A","A","A","A","R","R","R","M"]
[77,1020176,"Mohammed 77","BAGGAGE","A","A","A","A","A","A","R","A","A","R","R","R","R","H","H","H","H","H","R","R","R","R","H","H","H","H","H","R","R","R","M","M","M","M","M","M","R"]
[78,1020177,"Mohammed 78","BAGGAGE","A","A","A","A","A","R","A","A","A","R","R","R","H","H","H","H","H","R","R","R","R","A","A","A","A","A","R","R","R","R","M","M","M","M","M","M","R"]
[79,1020178,"Mohammed 79","Agent","H","H","H","H","H","H","R","R","R","A","A","A","A","A","A","R","R","R","M","M","M","M","M","M","R","R","R","A","A","A","A","A","A","R","R","R","H"]
[80,1020179,"Mohammed 80","Agent","H","H","H","H","H","H","R","R","R","M","M","M","TR","TR","M","R","R","R","M","M","M","M","M","M","R","R","R","A","A","A","A","A","A","R","R","R","H"]
[81,1020180,"Mohammed 81","Agent","H","H","H","H","H","H","R","R","R","A","A","A","A","A","A","R","R","R","M","M","M","M","M","M","R","R","R","A","A","A","A","A","A","R","R","R","H"]
[82,1020181,"Mohammed 82","Agent","H","H","H","H","H","H","R","R","R","H","H","H","H","H","H","R","R","R","M","M","M","M","M","M","R","R","R","A","A","A","A","A","A","R","R","R","H"]
[83,1020182,"Mohammed 83","Agent","H","H","H","H","H","H","R","R","R","M","M","M","TR","TR","M","R","R","R","M","M","M","M","M","M","R","R","R","A","A","A","A","A","A","R","R","R","H"]
[84,1020183,"Mohammed 84","Agent","H","H","H","H","H","H","R","R","R","A","A","A","A","A","A","R","R","R","M","M","M","M","M","M","R","R","R","A","A","A","A","A","A","R","R","R","H"]
[85,1020184,"Mohammed 85","Agent","H","H","H","H","H","H","R","R","R","H","H","H","H","H","H","R","R","R","M","M","M","M","M","M","R","R","R","A","A","A","A","A","A","R","R","R","H"]
[86,1020185,"Mohammed 86","Agent","H","H","H","H","H","H","R","R","R","M","M","M","M","M","M","R","R","R","M","M","M","M","M","M","R","R","R","A","A","A","A","A","A","R","R","R","H"]
[87,1020186,"Mohammed 87","Agent","R","H","H","H","H","H","R","R","R","R","A","A","A","A","A","R","R","R","R","M","M","M","M","M","R","R","R","A","A","A","A","A","A","R","R","R","H"]
[88,1020187,"Mohammed 88","Agent","H","H","H","H","H","H","R","R","R","H","H","H","H","H","H","R","R","R","M","M","M","M","M","M","R","R","R","A","A","A","A","A","A","R","R","R","H"]
[89,1020188,"Mohammed 89","Agent","H","H","H","H","H","H","R","R","R","M","M","M","M","M","M","R","R","R","M","M","M","M","M","M","R","R","R","A","A","A","A","A","A","R","R","R","H"]
[90,1020189,"Mohammed 90","Agent","H","H","H","H","H","H","R","R","R","A","A","A","A","A","A","R","R","R","M","M","M","M","M","M","R","R","R","A","A","A","A","A","A","R","R","R","H"]
[91,1020190,"Mohammed 91","Agent","H","H","H","H","H","H","R","R","R","H","H","H","H","H","H","R","R","R","M","M","M","M","M","M","R","R","R","A","A","A","A","A","A","R","R","R","H"]
[92,1020191,"Mohammed 92","Agent","H","H","H","H","H","H","R","R","R","M","M","M","M","M","M","R","R","R","M","M","M","M","M","M","R","R","R","A","A","A","A","A","A","R","R","R","H"]
[93,1020192,"Mohammed 93","Agent","H","H","H","H","H","H","R","R","R","A","A","A","TR","TR","A","R","R","R","M","M","M","M","M","M","R","R","R","A","A","A","A","A","A","R","R","R","H"]
[94,1020193,"Mohammed 94","Agent","H","H","H","H","H","H","R","R","R","H","H","H","H","H","H","R","R","R","M","M","M","M","M","M","R","R","R","A","A","A","A","A","A","R","R","R","H"]
[95,1020194,"Mohammed 95","Agent","H","H","H","H","H","H","R","R","R","M","M","M","M","M","M","R","R","R","M","M","M","M","M","M","R","R","R","A","A","A","A","A","A","R","R","R","H"]
[96,1020195,"Mohammed 96","Agent","H","H","H","H","H","H","R","R","R","A","A","A","A","A","A","R","R","R","M","M","M","M","M","M","R","R","R","A","A","A","A","A","A","R","R","R","H"]
[97,1020196,"Mohammed 97","Agent","R","H","H","H","H","H","R","R","R","A","A","A","A","A","R","R","R","R","M","M","M","M","M","M","R","R","R","R","A","A","A","A","A","R","R","R","H"]
[98,1020197,"Mohammed 98","Agent","H","H","H","R","R","R","M","M","M","M","M","M","R","R","R","A","A","A","A","A","A","R","R","R","H","H","H","H","H","H","R","R","R","A","A","A","A"]
[99,1020198,"Mohammed 99","Agent","A","A","A","R","R","R","M","M","M","M","M","M","R","R","R","A","A","A","A","A","A","R","R","R","H","H","H","H","H","H","R","R","R","M","M","M","M"]
[100,1020199,"Mohammed 100","Agent","H","H","H","R","R","R","M","M","M","M","M","M","R","R","R","A","A","A","A","A","A","R","R","R","H","H","H","H","H","H","R","R","R","A","A","A","A"]
[101,1020200,"Mohammed 101","Agent","M","M","M","R","R","R","M","M","M","M","M","M","R","R","R","A","A","A","A","A","A","R","R","R","H","H","H","H","H","H","R","R","R","H","H","H","H"]
[102,1020201,"Mohammed 102","Agent","A","A","A","R","R","R","M","M","M","M","M","M","R","R","R","A","A","A","A","A","A","R","R","R","H","H","H","H","H","H","R","R","R","M","M","M","M"]
[103,1020202,"Mohammed 103","Agent","H","H","H","R","R","R","M","M","M","M","M","M","R","R","R","A","A","A","A","A","A","R","R","R","H","H","H","H","H","H","R","R","R","A","A","A","A"]
[104,1020203,"Mohammed 104","Agent","M","M","M","R","R","R","M","M","M","M","M","M","R","R","R","A","A","A","A","A","A","R","R","R","H","H","H","H","H","H","R","R","R","H","H","H","H"]
[105,1020204,"Mohammed 105","Agent","A","A","A","R","R","R","M","M","M","M","M","M","R","R","R","A","A","A","A","A","A","R","R","R","H","H","H","H","H","H","R","R","R","M","M","M","M"]
[106,1020205,"Mohammed 106","Agent","M","M","M","R","R","R","M","M","M","M","M","M","R","R","R","A","A","A","A","A","A","R","R","R","H","H","H","H","H","H","R","R","R","A","A","A","A"]
[107,1020206,"Mohammed 107","Agent","A","A","A","R","R","R","M","M","M","M","M","M","R","R","R","A","A","A","A","A","A","R","R","R","H","H","H","H","H","H","R","R","R","H","H","H","H"]
[108,1020207,"Mohammed 108","Agent","A","A","A","R","R","R","M","M","M","M","M","M","R","R","R","A","A","A","A","A","A","R","R","R","H","H","H","H","H","H","R","R","R","M","M","M","M"]
[109,1020208,"Mohammed 109","Agent","M","M","M","R","R","R","M","M","M","M","M","M","R","R","R","A","A","A","A","A","A","R","R","R","H","H","H","H","H","H","R","R","R","A","A","A","A"]
[110,1020209,"Mohammed 110","Agent","A","A","A","R","R","R","M","M","M","M","M","M","R","R","R","A","A","A","A","A","A","R","R","R","H","H","H","H","H","H","R","R","R","H","H","H","H"]
[111,1020210,"Mohammed 111","Agent","v","v","v","v","v","v","v","v","v","v","v","v","v","v","v","v","v","v","v","v","v","v","v","v","v","v","v","v","v","v","v","v","v","v","v","v","v"]
[112,1020211,"Mohammed 112","Agent","M","M","M","R","R","R","M","M","M","M","M","M","R","R","R","A","A","A","A","A","A","R","R","R","H","H","H","H","H","H","R","R","R","A","A","A","A"]
[113,1020212,"Mohammed 113","Agent","A","A","A","R","R","R","M","M","M","M","M","M","R","R","R","A","A","A","A","A","A","R","R","R","H","H","H","H","H","H","R","R","R","H","H","H","H"]
[114,1020213,"Mohammed 114","Agent","H","H","H","R","R","R","M","M","M","M","M","M","R","R","R","A","A","A","A","A","A","R","R","R","H","H","H","H","H","H","R","R","R","M","M","M","M"]
[115,1020214,"Mohammed 115","Agent","M","M","M","R","R","R","M","M","M","M","M","M","R","R","R","A","A","A","A","A","A","R","R","R","H","H","H","H","H","H","R","R","R","A","A","A","A"]
[116,1020215,"Mohammed 116","Agent","R","H","H","R","R","R","M","M","M","M","M","R","R","R","R","A","A","A","A","A","R","R","R","R","H","H","H","H","H","H","R","R","R","M","M","M","M"]
[117,1020216,"Mohammed 117","Agent","R","H","H","R","R","R","M","M","M","M","M","M","R","R","R","A","A","A","A","A","A","R","R","R","H","H","H","H","H","H","R","R","R","A","A","A","A"]
[118,1020217,"Mohammed 118","Agent","R","R","R","A","A","A","A","A","A","R","R","R","M","M","M","M","M","M","R","R","R","A","A","A","A","A","A","R","R","R","H","H","H","H","H","H","R"]
[119,1020218,"Mohammed 119","Agent","R","R","R","M","M","M","M","M","M","R","R","R","M","M","M","M","M","M","R","R","R","A","A","A","A","A","A","R","R","R","H","H","H","H","H","H","R"]
[120,1020219,"Mohammed 120","Agent","R","R","R","A","A","A","A","A","A","R","R","R","M","M","M","M","M","M","R","R","R","A","A","A","A","A","A","R","R","R","H","H","H","H","H","H","R"]
[121,1020220,"Mohammed 121","Agent","R","R","R","H","H","H","H","H","H","R","R","R","M","M","M","M","M","M","R","R","R","A","A","A","A","A","A","R","R","R","H","H","H","H","H","H","R"]
[122,1020221,"Mohammed 122","Agent","R","R","R","M","M","M","M","M","M","R","R","R","M","M","M","M","M","M","R","R","R","A","A","A","A","A","A","R","R","R","H","H","H","H","H","H","R"]
[123,1020222,"Mohammed 123","Agent","R","R","R","A","A","A","A","A","A","R","R","R","M","M","M","M","M","M","R","R","R","A","A","A","A","A","A","R","R","R","H","H","H","H","H","H","R"]
[124,1020223,"Mohammed 124","Agent","R","R","R","H","H","H","H","H","H","R","R","R","M","M","M","M","M","M","R","R","R","A","A","A","A","A","A","R","R","R","H","H","H","H","H","H","R"]
[125,1020224,"Mohammed 125","Agent","R","R","R","M","M","M","M","M","M","R","R","R","M","M","M","M","M","M","R","R","R","A","A","A","A","A","A","R","R","R","H","H","H","H","H","H","R"]
[126,1020225,"Mohammed 126","Agent","R","R","R","A","A","A","A","A","A","R","R","R","M","M","M","M","M","M","R","R","R","A","A","A","A","A","A","R","R","R","H","H","H","H","H","H","R"]
[127,1020226,"Mohammed 127","Agent","R","R","R","H","H","H","H","H","H","R","R","R","M","M","M","M","M","M","R","R","R","A","A","A","A","A","A","R","R","R","H","H","H","H","H","H","R"]
[128,1020227,"Mohammed 128","Agent","R","R","R","M","M","M","M","M","M","R","R","R","M","M","M","M","M","M","R","R","R","A","A","A","A","A","A","R","R","R","H","H","H","H","H","H","R"]
[129,1020228,"Mohammed 129","Agent","R","R","R","A","TR","TR","A","A","A","R","R","R","M","M","M","M","M","M","R","R","R","A","A","A","A","A","A","R","R","R","H","H","H","H","H","H","R"]
[130,1020229,"Mohammed 130","Agent","R","R","R","H","H","H","H","H","H","R","R","R","M","M","M","M","M","M","R","R","R","A","A","A","A","A","A","R","R","R","H","H","H","H","H","H","R"]
[131,1020230,"Mohammed 131","Agent","R","R","R","M","M","M","M","M","M","R","R","R","M","M","M","M","M","M","R","R","R","A","A","A","A","A","A","R","R","R","H","H","H","H","H","H","R"]
[132,1020231,"Mohammed 132","Agent","R","R","R","A","TR","TR","A","A","A","R","R","R","M","M","M","M","M","M","R","R","R","A","A","A","A","A","A","R","R","R","H","H","H","H","H","H","R"]
[133,1020232,"Mohammed 133","Agent","R","R","R","H","H","H","H","H","H","R","R","R","M","M","M","M","M","M","R","R","R","A","A","A","A","A","A","R","R","R","H","H","H","H","H","H","R"]
[134,1020233,"Mohammed 134","Agent","R","R","R","M","M","M","M","M","M","R","R","R","M","M","M","M","M","M","R","R","R","A","A","A","A","A","A","R","R","R","H","H","H","H","H","H","R"]
[135,1020234,"Mohammed 135","Agent","R","R","R","A","A","A","A","A","A","R","R","R","M","M","M","M","M","M","R","R","R","A","A","A","A","A","A","R","R","R","H","H","H","H","H","H","R"]
[136,1020235,"Mohammed 136","Agent","R","R","R","H","H","H","H","H","H","R","R","R","M","M","M","M","M","M","R","R","R","A","A","A","A","A","A","R","R","R","H","H","H","H","H","H","R"]
[137,1020236,"Mohammed 137","Agent","R","R","R","H","H","H","H","H","H","R","R","R","M","M","M","M","M","M","R","R","R","A","A","A","A","A","A","R","R","R","H","H","H","H","H","H","R"]
[138,1020237,"Mohammed 138","Agent","R","R","R","H","H","H","H","H","H","R","R","R","M","M","M","M","M","M","R","R","R","A","A","A","A","A","A","R","R","R","H","H","H","H","H","H","R"]
[139,1020238,"Mohammed 139","Agent","A","A","A","R","R","R","H","H","H","H","H","H","R","R","R","A","A","A","A","A","A","R","R","R","M","M","M","M","M","M","R","R","R","A","A","A","A"]
[140,1020239,"Mohammed 140","Agent","A","A","A","R","R","R","H","H","H","H","H","H","R","R","R","A","A","A","A","A","A","R","R","R","M","M","M","M","M","M","R","R","R","A","A","A","A"]
[141,1020240,"Mohammed 141","Agent","A","A","A","R","R","R","H","H","H","H","H","H","R","R","R","H","H","H","H","H","H","R","R","R","M","M","M","M","M","M","R","R","R","A","A","A","A"]
[142,1020241,"Mohammed 142","Agent","A","A","A","R","R","R","H","H","H","H","H","H","R","R","R","A","A","A","A","A","A","R","R","R","M","M","M","M","M","M","R","R","R","A","A","A","A"]
[143,1020242,"Mohammed 143","Agent","A","A","A","R","R","R","H","H","H","H","H","H","R","R","R","H","H","H","H","H","H","R","R","R","M","M","M","M","M","M","R","R","R","A","A","A","A"]
[144,1020243,"Mohammed 144","Agent","A","A","A","R","R","R","H","H","H","H","H","H","R","R","R","A","A","A","A","A","A","R","R","R","M","M","M","M","M","M","R","R","R","A","A","A","A"]
[145,1020244,"Mohammed 145","Agent","A","A","A","R","R","R","H","H","H","H","H","H","R","R","R","H","H","H","H","H","H","R","R","R","M","M","M","M","M","M","R","R","R","A","A","A","A"]
[146,1020245,"Mohammed 146","Agent","A","A","A","R","R","R","H","H","H","H","H","H","R","R","R","A","A","A","A","A","A","R","R","R","M","M","M","M","M","M","R","R","R","A","A","A","A"]
[147,1020246,"Mohammed 147","Agent","A","A","A","R","R","R","H","H","H","H","H","H","R","R","R","H","H","H","H","H","H","R","R","R","M","M","M","M","M","M","R","R","R","A","A","A","A"]
[148,1020247,"Mohammed 148","Agent","A","A","A","R","R","R","H","H","H","H","H","H","R","R","R","A","A","A","A","A","A","R","R","R","M","M","M","M","M","M","R","R","R","A","A","A","A"]
[149,1020248,"Mohammed 149","Agent","A","A","A","R","R","R","H","H","H","R","TR","TR","R","R","R","H","H","H","H","H","H","R","R","R","M","M","M","M","M","M","R","R","R","A","A","A","A"]
[150,1020249,"Mohammed 150","Agent","A","A","A","R","R","R","H","H","H","H","H","H","R","R","R","A","A","A","A","A","A","R","R","R","M","M","M","M","M","M","R","R","R","A","A","A","A"]
[151,1020250,"Mohammed 151","Agent","A","A","A","R","R","R","H","H","H","H","H","H","R","R","R","H","H","H","H","H","H","R","R","R","M","M","M","M","M","M","R","R","R","A","A","A","A"]
[152,1020251,"Mohammed 152","Agent","A","A","A","R","R","R","H","H","H","H","H","H","R","R","R","A","A","A","A","A","A","R","R","R","M","M","M","M","M","M","R","R","R","A","A","A","A"]
[153,1020252,"Mohammed 153","Agent","A","A","A","R","R","R","H","H","H","H","H","H","R","R","R","H","H","H","H","H","H","R","R","R","M","M","M","M","M","M","R","R","R","A","A","A","A"]
[154,1020253,"Mohammed 154","Agent","A","A","A","R","R","R","H","H","H","H","H","H","R","R","R","A","A","A","A","A","A","R","R","R","M","M","M","M","M","M","R","R","R","A","A","A","A"]
[155,1020254,"Mohammed 155","Agent","A","A","A","R","R","R","H","H","H","R","TR","TR","R","R","R","H","H","H","H","H","H","R","R","R","M","M","M","M","M","M","R","R","R","A","A","A","A"]
[156,1020255,"Mohammed 156","Agent","A","A","A","R","R","R","H","H","H","H","H","H","R","R","R","A","A","A","A","A","A","R","R","R","M","M","M","M","M","M","R","R","R","A","A","A","A"]
[157,1020256,"Mohammed 157","Agent","A","A","A","R","R","R","H","H","H","H","H","H","R","R","R","H","H","H","H","H","H","R","R","R","M","M","M","M","M","M","R","R","R","A","A","A","A"]
[158,1020257,"Mohammed 158","Agent","M","M","M","M","M","M","R","R","R","A","A","A","A","A","A","R","R","R","H","H","H","H","H","H","R","R","R","A","A","A","A","A","A","R","R","R","M"]
[159,1020258,"Mohammed 159","Agent","M","M","M","M","M","M","R","R","R","A","A","A","A","A","A","R","R","R","H","H","H","H","H","H","R","R","R","A","A","A","A","A","A","R","R","R","M"]
[160,1020259,"Mohammed 160","Agent","M","M","M","M","M","M","R","R","R","A","A","A","A","A","A","R","R","R","H","H","H","H","H","H","R","R","R","H","H","H","H","H","H","R","R","R","M"]
[161,1020260,"Mohammed 161","Agent","M","M","M","M","M","M","R","R","R","A","A","A","A","A","A","R","R","R","H","H","H","H","H","H","R","R","R","A","A","A","A","A","A","R","R","R","M"]
[162,1020261,"Mohammed 162","Agent","M","M","M","M","M","M","R","R","R","A","A","A","A","A","A","R","R","R","H","H","H","H","H","H","R","R","R","H","H","H","H","H","H","R","R","R","M"]
[163,1020262,"Mohammed 163","Agent","M","M","M","M","TR","TR","R","R","R","A","A","A","A","A","A","R","R","R","H","H","H","H","H","H","R","R","R","A","A","A","A","A","A","R","R","R","M"]
[164,1020263,"Mohammed 164","Agent","M","M","M","M","M","M","R","R","R","A","A","A","A","A","A","R","R","R","H","H","H","H","H","H","R","R","R","H","H","H","H","H","H","R","R","R","M"]
[165,1020264,"Mohammed 165","Agent","M","M","M","M","M","M","R","R","R","A","A","A","A","A","A","R","R","R","H","H","H","H","H","H","R","R","R","A","A","A","A","A","A","R","R","R","M"]
[166,1020265,"Mohammed 166","Agent","M","M","M","M","M","M","R","R","R","A","A","A","A","A","A","R","R","R","H","H","H","H","H","H","R","R","R","H","H","H","H","H","H","R","R","R","M"]
[167,1020266,"Mohammed 167","Agent","M","M","M","M","M","M","R","R","R","A","TR","TR","A","A","A","R","R","R","H","H","H","H","H","H","R","R","R","A","A","A","A","A","A","R","R","R","M"]
[168,1020267,"Mohammed 168","Agent","M","M","M","M","M","M","R","R","R","A","A","A","A","A","A","R","R","R","H","H","H","H","H","H","R","R","R","A","A","A","A","A","A","R","R","R","M"]
[169,1020268,"Mohammed 169","Agent","M","M","M","M","M","M","R","R","R","A","A","A","A","A","A","R","R","R","H","H","H","H","H","H","R","R","R","A","A","A","A","A","A","R","R","R","M"]
[170,1020269,"Mohammed 170","Agent","M","M","M","M","M","M","R","R","R","A","A","A","A","A","A","R","R","R","H","H","H","H","H","H","R","R","R","H","H","H","H","H","H","R","R","R","M"]
[171,1020270,"Mohammed 171","Agent","M","M","M","M","M","M","R","R","R","A","A","A","A","A","A","R","R","R","H","H","H","H","H","H","R","R","R","A","A","A","A","A","A","R","R","R","M"]
[172,1020271,"Mohammed 172","Agent","M","M","M","M","M","M","R","R","R","A","A","A","A","A","A","R","R","R","H","H","H","H","H","H","R","R","R","H","H","H","H","H","H","R","R","R","M"]
[173,1020272,"Mohammed 173","Agent","M","M","M","M","M","M","R","R","R","A","A","A","A","A","A","R","R","R","H","H","H","H","H","H","R","R","R","A","A","A","A","A","A","R","R","R","M"]
[174,1020273,"Mohammed 174","Agent","M","M","M","M","M","M","R","R","R","A","A","A","A","A","A","R","R","R","H","H","H","H","H","H","R","R","R","H","H","H","H","H","H","R","R","R","M"]
[175,1020274,"Mohammed 175","Agent","M","M","M","M","M","M","R","R","R","A","A","A","A","A","A","R","R","R","H","H","H","H","H","H","R","R","R","A","A","A","A","A","A","R","R","R","M"]
[176,1020275,"Mohammed 176","Agent","M","M","M","M","M","M","R","R","R","A","TR","TR","A","A","A","R","R","R","H","H","H","H","H","H","R","R","R","H","H","H","H","H","H","R","R","R","M"]
[177,1020276,"Mohammed 177","Agent","M","M","M","M","M","M","R","R","R","A","A","A","A","A","A","R","R","R","H","H","H","H","H","H","R","R","R","H","H","H","H","H","H","R","R","R","M"]
[178,1020277,"Mohammed 178","Agent","R","R","R","A","A","A","A","A","A","R","R","R","H","H","H","H","H","H","R","R","R","A","A","A","A","A","A","R","R","R","M","M","M","M","M","M","R"]
[179,1020278,"Mohammed 179","Agent","R","R","R","A","A","A","A","A","A","R","R","R","H","H","H","H","H","H","R","R","R","A","A","A","A","A","A","R","R","R","M","M","M","M","M","M","R"]
[180,1020279,"Mohammed 180","Agent","R","R","R","A","A","A","A","A","A","R","R","R","H","H","H","H","H","H","R","R","R","H","H","H","H","H","H","R","R","R","M","M","M","M","M","M","R"]
[181,1020280,"Mohammed 181","Agent","R","R","R","A","A","A","A","A","A","R","R","R","H","H","H","H","H","H","R","R","R","A","A","A","A","A","A","R","R","R","M","M","M","M","M","M","R"]
[182,1020281,"Mohammed 182","Agent","R","R","R","A","A","A","A","A","A","R","R","R","H","H","H","H","H","H","R","R","R","H","H","H","H","H","H","R","R","R","M","M","M","M","M","M","R"]
[183,1020282,"Mohammed 183","Agent","R","R","R","A","A","A","A","A","A","R","R","R","H","H","H","H","H","H","R","R","R","A","A","A","A","A","A","R","R","R","M","M","M","M","M","M","R"]
[184,1020283,"Mohammed 184","Agent","R","R","R","A","A","A","A","A","A","R","R","R","H","H","H","H","H","H","R","R","R","H","H","H","H","H","H","R","R","R","M","M","M","M","M","M","R"]
[185,1020284,"Mohammed 185","Agent","R","R","R","A","A","A","A","A","A","R","R","R","H","H","H","H","H","H","R","R","R","A","A","A","A","A","A","R","R","R","M","M","M","M","M","M","R"]
[186,1020285,"Mohammed 186","Agent","R","R","R","A","A","A","A","A","A","R","R","R","H","H","H","H","H","H","R","R","R","H","H","H","H","H","H","R","R","R","M","M","M","M","M","M","R"]
[187,1020286,"Mohammed 187","Agent","R","R","R","A","A","A","A","A","A","R","R","R","TR","TR","H","H","H","H","R","R","R","A","A","A","A","A","A","R","R","R","M","M","M","M","M","M","R"]
[188,1020287,"Mohammed 188","Agent","R","R","R","A","A","A","A","A","A","R","R","R","H","H","H","H","H","H","R","R","R","H","H","H","H","H","H","R","R","R","M","M","M","M","M","M","R"]
[189,1020288,"Mohammed 189","Agent","R","R","R","A","A","A","A","A","A","R","R","R","H","H","H","H","H","H","R","R","R","A","A","A","A","A","A","R","R","R","M","M","M","M","M","M","R"]
[190,1020289,"Mohammed 190","Agent","R","R","R","A","A","A","A","A","A","R","R","R","H","H","H","H","H","H","R","R","R","H","H","H","H","H","H","R","R","R","M","M","M","M","M","M","R"]
[191,1020290,"Mohammed 191","Agent","R","R","R","A","A","A","A","A","A","R","R","R","H","H","H","H","H","H","R","R","R","A","A","A","A","A","A","R","R","R","M","M","M","M","M","M","R"]
[192,1020291,"Mohammed 192","Agent","R","R","R","A","A","A","A","A","A","R","R","R","H","H","H","H","H","H","R","R","R","H","H","H","H","H","H","R","R","R","M","M","M","M","M","M","R"]
[193,1020292,"Mohammed 193","Agent","V","V","V","V","V","V","V","V","V","V","V","V","V","V","V","V","V","V","V","V","V","V","V","V","V","V","V","V","V","V","V","V","V","V","V","V","R"]
[194,1020293,"Mohammed 194","Agent","R","R","R","A","A","A","A","A","A","R","R","R","H","H","H","H","H","H","R","R","R","H","H","H","H","H","H","R","R","R","M","M","M","M","M","M","R"]
[195,1020294,"Mohammed 195","Agent","R","R","R","A","A","A","A","A","A","R","R","R","H","H","H","H","H","H","R","R","R","H","H","H","H","H","H","R","R","R","M","M","M","M","M","M","R"]
[196,1020295,"Mohammed 196","Agent","R","R","R","A","TR","TR","A","A","A","R","R","R","H","H","H","H","H","H","R","R","R","A","A","A","A","A","A","R","R","R","M","M","M","M","M","M","R"]
[197,1020296,"Mohammed 197","Agent","R","R","R","A","A","A","A","A","A","R","R","R","H","H","H","H","H","H","R","R","R","H","H","H","H","H","H","R","R","R","M","M","M","M","M","M","R"]
[198,1020297,"Mohammed 198","Agent","R","M","M","R","M","R","M","R","M","M","R","M","R","M","R","M","M","R","M","R","M","R","M","M","R","M","R","M","R","M","M","R","M","M","R","M","R"]
[199,1020298,"Mohammed 199","Agent","A3","A3","A3","A3","A3","A3","R","R","R","A3","A3","A3","A3","A3","A3","R","R","R","A3","A3","A3","A3","A3","A3","R","R","R","A3","A3","A3","A3","A3","A3","R","R","R","R"]
[200,1020299,"Mohammed 200","Agent","H","H","H","R","H","H","R","R","R","A","A","A","A","A","A","R","R","R","M","M","M","M","M","M","R","R","R","A","A","A","A","A","A","R","R","R","H"]
[201,1020300,"Mohammed 201","Agent","A","A","A","R","R","R","M","M","M","M","M","M","R","R","R","A","A","A","A","A","A","R","R","R","H","H","H","H","H","H","R","R","R","A","A","A","A"]
[202,1020301,"Mohammed 202","Agent","R","R","R","H","H","H","H","H","H","R","R","R","M","M","M","M","M","M","R","R","R","A","A","A","A","A","A","R","R","R","H","H","H","H","H","H","R"]
[203,1020302,"Mohammed 203","Agent","A","A","A","R","R","R","H","H","H","H","H","H","R","R","R","A","A","A","A","A","A","R","R","R","M","M","M","M","M","M","R","R","R","A","A","A","A"]
[204,1020303,"Mohammed 204","Agent","R","M","M","M","M","M","R","R","R","A","A","A","A","A","A","R","R","R","H","H","H","H","H","H","R","R","R","H","H","H","H","H","H","R","R","R","M"]
[205,1020304,"Mohammed 205","Agent","R","R","R","A","A","A","A","A","A","R","R","R","H","H","H","H","H","H","R","R","R","H","H","H","H","H","H","R","R","R","M","M","M","M","M","M","R"]
[206,1020305,"Mohammed 206","Agent","H","H","H","H","H","R","R","R","R","H","H","H","H","H","H","R","R","R","M","M","M","M","M","M","R","R","R","A","A","A","A","A","A","R","R","R","H"]
[207,1020306,"Mohammed 207","Agent","H","H","H","H","H","H","R","R","R","M","M","M","M","M","M","R","R","R","M","M","M","M","M","M","R","R","R","A","A","A","A","A","A","R","R","R","H"]
[208,1020307,"Mohammed 208","Agent","H","H","H","R","R","R","M","M","M","M","M","M","R","R","R","A","A","A","A","A","A","R","R","R","H","H","H","H","H","H","R","R","R","H","H","H","H"]
[209,1020308,"Mohammed 209","Agent","M","M","M","R","R","R","M","M","M","M","M","M","R","R","R","A","A","A","A","A","A","R","R","R","H","H","H","H","H","H","R","R","R","M","M","M","M"]
[210,1020309,"Mohammed 210","Agent","R","R","R","M","M","M","M","M","M","R","R","R","M","M","M","M","M","M","R","R","R","A","A","A","A","A","A","R","R","R","H","H","H","H","H","H","R"]
[211,1020310,"Mohammed 211","Agent","R","R","R","A","A","A","A","A","A","R","R","R","M","M","M","M","M","M","R","R","R","A","A","A","A","A","A","R","R","R","H","H","H","H","H","H","R"]
[212,1020311,"Mohammed 212","Agent","A","A","A","R","R","R","H","H","H","H","H","H","R","R","R","H","H","H","H","H","H","R","R","R","M","M","M","M","M","M","R","R","R","A","A","A","A"]
[213,1020312,"Mohammed 213","Agent","A","A","A","R","R","R","H","H","H","H","H","H","R","R","R","A","A","A","A","A","A","R","R","R","M","M","M","M","M","M","R","R","R","A","A","A","A"]
[214,1020313,"Mohammed 214","Agent","R","M","M","M","M","M","R","R","R","A","A","A","A","A","A","R","R","R","H","H","H","H","H","H","R","R","R","A","A","A","A","A","A","R","R","R","M"]
[215,1020314,"Mohammed 215","Agent","R","M","M","M","M","M","R","R","R","A","A","A","A","A","A","R","R","R","H","H","H","H","H","H","R","R","R","H","H","H","H","H","H","R","R","R","M"]
[216,1020315,"Mohammed 216","Agent","R","R","R","A","A","A","A","A","A","R","R","R","H","H","H","H","H","H","R","R","R","A","A","A","A","A","A","R","R","R","M","M","M","M","M","M","R"]
[217,1020316,"Mohammed 217","Agent","R","R","R","A","A","A","A","A","A","R","R","R","H","H","H","H","H","H","R","R","R","H","H","H","H","H","H","R","R","R","M","M","M","M","M","M","R"]
[218,1020317,"Mohammed 218","Agent","H","H","H","H","H","H","R","R","R","H","H","H","H","H","H","R","R","R","M","M","M","M","M","M","R","R","R","A","A","A","A","A","A","R","R","R","H"]
[219,1020318,"Mohammed 219","Agent","H","H","H","H","H","H","R","R","R","M","M","M","M","M","M","R","R","R","M","M","M","M","M","M","R","R","R","A","A","A","A","A","A","R","R","R","H"]
[220,1020319,"Mohammed 220","Agent","A","A","A","R","R","R","M","M","M","M","M","M","R","R","R","A","A","A","A","A","A","R","R","R","H","H","H","H","H","H","R","R","R","H","H","H","H"]
[221,1020320,"Mohammed 221","Agent","A","A","A","R","R","R","M","M","M","M","M","M","R","R","R","A","A","A","A","A","A","R","R","R","H","H","H","H","H","H","R","R","R","A","A","A","A"]
[222,1020321,"Mohammed 222","Agent","A","A","A","R","M","M","M","M","M","R","R","R","R","M","M","M","M","M","R","R","R","R","A","A","A","A","A","R","R","R","H","H","H","H","H","H","R"]
[223,1020322,"Mohammed 223","Agent","R","R","R","A","A","A","A","A","A","R","R","R","M","M","M","M","M","M","R","R","R","A","A","A","A","A","A","R","R","R","H","H","H","H","H","H","R"]
[224,1020323,"Mohammed 224","Agent","R","A","A","R","R","R","R","H","H","H","H","H","R","R","R","R","A","A","A","A","A","R","R","R","M","M","M","M","M","M","R","R","R","A","A","A","A"]
[225,1020324,"Mohammed 225","Agent","R","A","A","R","R","R","H","H","H","H","H","H","R","R","R","H","H","H","H","H","H","R","R","R","M","M","M","M","M","M","R","R","R","A","A","A","A"]
[226,1020325,"Mohammed 226","Agent","M","M","M","M","M","M","R","R","R","A","A","A","A","A","A","R","R","R","H","H","H","H","H","H","R","R","R","A","A","A","A","A","A","R","R","R","M"]
[227,1020326,"Mohammed 227","Agent","M","M","M","M","M","M","R","R","R","A","A","A","A","A","A","R","R","R","H","H","H","H","H","H","R","R","R","A","A","A","A","A","A","R","R","R","M"]
[228,1020327,"Mohammed 228","Agent","R","R","R","A","A","A","A","A","A","R","R","R","H","H","H","H","H","H","R","R","R","A","A","A","A","A","A","R","R","R","M","M","M","M","M","M","R"]
[229,1020328,"Mohammed 229","Agent","R","R","R","A","A","A","A","A","A","R","R","R","H","H","H","H","H","H","R","R","R","A","A","A","A","A","A","R","R","R","M","M","M","M","M","M","R"]
[230,1020329,"Mohammed 230","Agent","M","M","M","M","M","R","R","R","A","A","A","A","A","A","R","R","R","H","H","H","H","H","H","R","R","R","M","M","M","M","M","M","R","A","A","A","A"]
[231,1020330,"Mohammed 231","Agent","M","M","R","R","R","A","A","A","A","A","A","R","R","R","H","H","H","H","H","H","R","R","R","M","M","M","M","M","M","R","R","R","A","A","A","A","A"]
[232,1020331,"Mohammed 232","Agent","H","H","R","R","R","M","M","M","M","M","M","R","R","R","A","A","A","A","A","A","R","R","R","H","H","H","H","H","H","R","R","R","M","M","M","M","M"]
[233,1020332,"Mohammed 233","Agent","A","A","A","A","A","R","R","R","H","H","H","H","H","H","R","R","R","M","M","M","M","M","M","R","R","R","A","A","A","A","A","A","R","R","R","H","H"]
[234,1020333,"Mohammed 234","Agent","R","R","H","H","H","H","H","H","R","R","R","M","M","M","M","M","M","R","R","R","A","A","A","A","A","A","R","R","R","H","H","H","H","H","H","R","R"]

{"sheet":"Preparation","index":1,"n_rows":62,"n_cols":13,"rows_kept":62,"cut":false,"hidden":false,"merged":[[27,10,27,12],[28,10,28,12],[38,10,38,12],[29,10,29,12],[30,10,30,12],[31,10,31,12],[32,10,32,12],[33,10,33,12],[34,10,34,12],[35,10,35,12],[36,10,36,12],[37,10,37,12],[34,7,34,9],[35,7,35,9],[36,7,36,9],[43,7,43,9],[29,7,29,9],[39,7,39,9],[40,7,40,9],[41,7,41,9],[42,7,42,9],[37,7,37,9],[38,7,38,9],[27,7,27,9],[30,7,30,9],[31,7,31,9],[32,7,32,9],[33,7,33,9],[28,7,28,9],[16,7,16,9],[17,7,17,9],[18,7,18,9],[19,7,19,9],[20,7,20,9],[11,7,11,9],[12,7,12,9],[13,7,13,9],[14,7,14,9],[15,7,15,9],[26,10,26,12],[26,7,26,9],[20,10,20,12],[21,10,21,12],[22,10,22,12],[23,10,23,12],[24,10,24,12],[21,7,21,9],[22,7,22,9],[23,7,23,9],[25,7,25,9],[25,10,25,12],[24,7,24,9],[15,10,15,12],[16,10,16,12],[17,10,17,12],[18,10,18,12],[19,10,19,12],[11,10,11,12],[12,10,12,12],[13,10,13,12],[14,10,14,12],[10,10,10,12],[1,0,2,0],[1,3,2,3],[0,11,0,12],[0,4,2,6],[3,10,3,12],[3,7,3,9],[1,7,2,9],[1,10,2,12],[10,7,10,9],[6,10,6,12],[7,10,7,12],[1,2,2,2],[1,1,2,1],[4,10,4,12],[5,7,5,9],[6,7,6,9],[5,10,5,12],[4,7,4,9],[7,7,7,9],[8,7,8,9],[8,10,8,12],[9,10,9,12],[9,7,9,9],[52,7,52,11],[39,10,39,12],[40,10,40,12],[51,7,51,11],[46,7,46,11],[47,7,47,11],[48,7,48,11],[49,7,49,11],[50,7,50,11],[44,10,44,12],[43,10,43,12],[44,7,44,9],[45,7,45,9],[41,10,41,12],[42,10,42,12]]}
["Duty","M",null,"Date H","Status",null,null,"2018-03-02","Date G",{"$f":"H1","v":"2018-03-02"},"Day",{"$f":"J1","v":"2018-03-02"}]
["No","Prn","Name","Tittel",null,null,null,"ASST",null,null,"DUTY"]
[]
[{"$f":"IF($C4<>\"\",ROW()-3,\"\")","v":1},{"$f":"IFERROR(INDEX(MAR!B$2:B$249,SMALL(IF(INDEX(MAR!$E$2:$AF$249,,MATCH($H$1,MAR!$E$1:$AF$1,0))=$B$1,ROW(MAR!$E$2:$AF$249)-ROW(MAR!$J$2)+1),ROWS(C$3:C3))),\"\")","v":1020104},{"$f":"IFERROR(INDEX(MAR!C$2:C$249,SMALL(IF(INDEX(MAR!$E$2:$AF$249,,MATCH($H$1,MAR!$E$1:$AF$1,0))=$B$1,ROW(MAR!$E$2:$AF$249)-ROW(MAR!$J$2)+1),ROWS(D$3:D3))),\"\")","v":"Mohammed 5"},{"$f":"IFERROR(INDEX(MAR!D$2:D$249,SMALL(IF(INDEX(MAR!$E$2:$AF$249,,MATCH($H$1,MAR!$E$1:$AF$1,0))=$B$1,ROW(MAR!$E$2:$AF$249)-ROW(MAR!$J$2)+1),ROWS(E$3:E3))),\"\")","v":"DUTY"}]
[{"$f":"IF($C5<>\"\",ROW()-3,\"\")","v":2},{"$f":"IFERROR(INDEX(MAR!B$2:B$249,SMALL(IF(INDEX(MAR!$E$2:$AF$249,,MATCH($H$1,MAR!$E$1:$AF$1,0))=$B$1,ROW(MAR!$E$2:$AF$249)-ROW(MAR!$J$2)+1),ROWS(C$3:C4))),\"\")","v":1020108},{"$f":"IFERROR(INDEX(MAR!C$2:C$249,SMALL(IF(INDEX(MAR!$E$2:$AF$249,,MATCH($H$1,MAR!$E$1:$AF$1,0))=$B$1,ROW(MAR!$E$2:$AF$249)-ROW(MAR!$J$2)+1),ROWS(D$3:D4))),\"\")","v":"Mohammed 9"},{"$f":"IFERROR(INDEX(MAR!D$2:D$249,SMALL(IF(INDEX(MAR!$E$2:$AF$249,,MATCH($H$1,MAR!$E$1:$AF$1,0))=$B$1,ROW(MAR!$E$2:$AF$249)-ROW(MAR!$J$2)+1),ROWS(E$3:E4))),\"\")","v":"ASST"}]
[3,{"$f":"IFERROR(INDEX(MAR!B$2:B$249,SMALL(IF(INDEX(MAR!$E$2:$AF$249,,MATCH($H$1,MAR!$E$1:$AF$1,0))=$B$1,ROW(MAR!$E$2:$AF$249)-ROW(MAR!$J$2)+1),ROWS(C$3:C5))),\"\")","v":1020114},{"$f":"IFERROR(INDEX(MAR!C$2:C$249,SMALL(IF(INDEX(MAR!$E$2:$AF$249,,MATCH($H$1,MAR!$E$1:$AF$1,0))=$B$1,ROW(MAR!$E$2:$AF$249)-ROW(MAR!$J$2)+1),ROWS(D$3:D5))),\"\")","v":"Mohammed 15"},{"$f":"IFERROR(INDEX(MAR!D$2:D$249,SMALL(IF(INDEX(MAR!$E$2:$AF$249,,MATCH($H$1,MAR!$E$1:$AF$1,0))=$B$1,ROW(MAR!$E$2:$AF$249)-ROW(MAR!$J$2)+1),ROWS(E$3:E5))),\"\")","v":"ASST"},null,null,null,null,null,null,"OFFICE"]
[4,{"$f":"IFERROR(INDEX(MAR!B$2:B$249,SMALL(IF(INDEX(MAR!$E$2:$AF$249,,MATCH($H$1,MAR!$E$1:$AF$1,0))=$B$1,ROW(MAR!$E$2:$AF$249)-ROW(MAR!$J$2)+1),ROWS(C$3:C6))),\"\")","v":1020115},{"$f":"IFERROR(INDEX(MAR!C$2:C$249,SMALL(IF(INDEX(MAR!$E$2:$AF$249,,MATCH($H$1,MAR!$E$1:$AF$1,0))=$B$1,ROW(MAR!$E$2:$AF$249)-ROW(MAR!$J$2)+1),ROWS(D$3:D6))),\"\")","v":"Mohammed 16"},{"$f":"IFERROR(INDEX(MAR!D$2:D$249,SMALL(IF(INDEX(MAR!$E$2:$AF$249,,MATCH($H$1,MAR!$E$1:$AF$1,0))=$B$1,ROW(MAR!$E$2:$AF$249)-ROW(MAR!$J$2)+1),ROWS(E$3:E6))),\"\")","v":"ASST"},null,null,null,"TOC"]
[5,{"$f":"IFERROR(INDEX(MAR!B$2:B$249,SMALL(IF(INDEX(MAR!$E$2:$AF$249,,MATCH($H$1,MAR!$E$1:$AF$1,0))=$B$1,ROW(MAR!$E$2:$AF$249)-ROW(MAR!$J$2)+1),ROWS(C$3:C7))),\"\")","v":1020118},{"$f":"IFERROR(INDEX(MAR!C$2:C$249,SMALL(IF(INDEX(MAR!$E$2:$AF$249,,MATCH($H$1,MAR!$E$1:$AF$1,0))=$B$1,ROW(MAR!$E$2:$AF$249)-ROW(MAR!$J$2)+1),ROWS(D$3:D7))),\"\")","v":"Mohammed 19"},{"$f":"IFERROR(INDEX(MAR!D$2:D$249,SMALL(IF(INDEX(MAR!$E$2:$AF$249,,MATCH($H$1,MAR!$E$1:$AF$1,0))=$B$1,ROW(MAR!$E$2:$AF$249)-ROW(MAR!$J$2)+1),ROWS(E$3:E7))),\"\")","v":"SQS"}]
[6,{"$f":"IFERROR(INDEX(MAR!B$2:B$249,SMALL(IF(INDEX(MAR!$E$2:$AF$249,,MATCH($H$1,MAR!$E$1:$AF$1,0))=$B$1,ROW(MAR!$E$2:$AF$249)-ROW(MAR!$J$2)+1),ROWS(C$3:C8))),\"\")","v":1020124},{"$f":"IFERROR(INDEX(MAR!C$2:C$249,SMALL(IF(INDEX(MAR!$E$2:$AF$249,,MATCH($H$1,MAR!$E$1:$AF$1,0))=$B$1,ROW(MAR!$E$2:$AF$249)-ROW(MAR!$J$2)+1),ROWS(D$3:D8))),\"\")","v":"Mohammed 25"},{"$f":"IFERROR(INDEX(MAR!D$2:D$249,SMALL(IF(INDEX(MAR!$E$2:$AF$249,,MATCH($H$1,MAR!$E$1:$AF$1,0))=$B$1,ROW(MAR!$E$2:$AF$249)-ROW(MAR!$J$2)+1),ROWS(E$3:E8))),\"\")","v":"SUP"}]
[7,{"$f":"IFERROR(INDEX(MAR!B$2:B$249,SMALL(IF(INDEX(MAR!$E$2:$AF$249,,MATCH($H$1,MAR!$E$1:$AF$1,0))=$B$1,ROW(MAR!$E$2:$AF$249)-ROW(MAR!$J$2)+1),ROWS(C$3:C9))),\"\")","v":1020130},{"$f":"IFERROR(INDEX(MAR!C$2:C$249,SMALL(IF(INDEX(MAR!$E$2:$AF$249,,MATCH($H$1,MAR!$E$1:$AF$1,0))=$B$1,ROW(MAR!$E$2:$AF$249)-ROW(MAR!$J$2)+1),ROWS(D$3:D9))),\"\")","v":"Mohammed 31"},{"$f":"IFERROR(INDEX(MAR!D$2:D$249,SMALL(IF(INDEX(MAR!$E$2:$AF$249,,MATCH($H$1,MAR!$E$1:$AF$1,0))=$B$1,ROW(MAR!$E$2:$AF$249)-ROW(MAR!$J$2)+1),ROWS(E$3:E9))),\"\")","v":"SUP"}]
[8,{"$f":"IFERROR(INDEX(MAR!B$2:B$249,SMALL(IF(INDEX(MAR!$E$2:$AF$249,,MATCH($H$1,MAR!$E$1:$AF$1,0))=$B$1,ROW(MAR!$E$2:$AF$249)-ROW(MAR!$J$2)+1),ROWS(C$3:C10))),\"\")","v":1020135},{"$f":"IFERROR(INDEX(MAR!C$2:C$249,SMALL(IF(INDEX(MAR!$E$2:$AF$249,,MATCH($H$1,MAR!$E$1:$AF$1,0))=$B$1,ROW(MAR!$E$2:$AF$249)-ROW(MAR!$J$2)+1),ROWS(D$3:D10))),\"\")","v":"Mohammed 36"},{"$f":"IFERROR(INDEX(MAR!D$2:D$249,SMALL(IF(INDEX(MAR!$E$2:$AF$249,,MATCH($H$1,MAR!$E$1:$AF$1,0))=$B$1,ROW(MAR!$E$2:$AF$249)-ROW(MAR!$J$2)+1),ROWS(E$3:E10))),\"\")","v":"SUP"}]
[9,{"$f":"IFERROR(INDEX(MAR!B$2:B$249,SMALL(IF(INDEX(MAR!$E$2:$AF$249,,MATCH($H$1,MAR!$E$1:$AF$1,0))=$B$1,ROW(MAR!$E$2:$AF$249)-ROW(MAR!$J$2)+1),ROWS(C$3:C11))),\"\")","v":1020136},{"$f":"IFERROR(INDEX(MAR!C$2:C$249,SMALL(IF(INDEX(MAR!$E$2:$AF$249,,MATCH($H$1,MAR!$E$1:$AF$1,0))=$B$1,ROW(MAR!$E$2:$AF$249)-ROW(MAR!$J$2)+1),ROWS(D$3:D11))),\"\")","v":"Mohammed 37"},{"$f":"IFERROR(INDEX(MAR!D$2:D$249,SMALL(IF(INDEX(MAR!$E$2:$AF$249,,MATCH($H$1,MAR!$E$1:$AF$1,0))=$B$1,ROW(MAR!$E$2:$AF$249)-ROW(MAR!$J$2)+1),ROWS(E$3:E11))),\"\")","v":"SUP"}]
[10,{"$f":"IFERROR(INDEX(MAR!B$2:B$249,SMALL(IF(INDEX(MAR!$E$2:$AF$249,,MATCH($H$1,MAR!$E$1:$AF$1,0))=$B$1,ROW(MAR!$E$2:$AF$249)-ROW(MAR!$J$2)+1),ROWS(C$3:C12))),\"\")","v":1020137},{"$f":"IFERROR(INDEX(MAR!C$2:C$249,SMALL(IF(INDEX(MAR!$E$2:$AF$249,,MATCH($H$1,MAR!$E$1:$AF$1,0))=$B$1,ROW(MAR!$E$2:$AF$249)-ROW(MAR!$J$2)+1),ROWS(D$3:D12))),\"\")","v":"Mohammed 38"},{"$f":"IFERROR(INDEX(MAR!D$2:D$249,SMALL(IF(INDEX(MAR!$E$2:$AF$249,,MATCH($H$1,MAR!$E$1:$AF$1,0))=$B$1,ROW(MAR!$E$2:$AF$249)-ROW(MAR!$J$2)+1),ROWS(E$3:E12))),\"\")","v":"SUP"}]
[11,{"$f":"IFERROR(INDEX(MAR!B$2:B$249,SMALL(IF(INDEX(MAR!$E$2:$AF$249,,MATCH($H$1,MAR!$E$1:$AF$1,0))=$B$1,ROW(MAR!$E$2:$AF$249)-ROW(MAR!$J$2)+1),ROWS(C$3:C13))),\"\")","v":1020138},{"$f":"IFERROR(INDEX(MAR!C$2:C$249,SMALL(IF(INDEX(MAR!$E$2:$AF$249,,MATCH($H$1,MAR!$E$1:$AF$1,0))=$B$1,ROW(MAR!$E$2:$AF$249)-ROW(MAR!$J$2)+1),ROWS(D$3:D13))),\"\")","v":"Mohammed 39"},{"$f":"IFERROR(INDEX(MAR!D$2:D$249,SMALL(IF(INDEX(MAR!$E$2:$AF$249,,MATCH($H$1,MAR!$E$1:$AF$1,0))=$B$1,ROW(MAR!$E$2:$AF$249)-ROW(MAR!$J$2)+1),ROWS(E$3:E13))),\"\")","v":"SUP"}]
[12,{"$f":"IFERROR(INDEX(MAR!B$2:B$249,SMALL(IF(INDEX(MAR!$E$2:$AF$249,,MATCH($H$1,MAR!$E$1:$AF$1,0))=$B$1,ROW(MAR!$E$2:$AF$249)-ROW(MAR!$J$2)+1),ROWS(C$3:C14))),\"\")","v":1020146},{"$f":"IFERROR(INDEX(MAR!C$2:C$249,SMALL(IF(INDEX(MAR!$E$2:$AF$249,,MATCH($H$1,MAR!$E$1:$AF$1,0))=$B$1,ROW(MAR!$E$2:$AF$249)-ROW(MAR!$J$2)+1),ROWS(D$3:D14))),\"\")","v":"Mohammed 47"},{"$f":"IFERROR(INDEX(MAR!D$2:D$249,SMALL(IF(INDEX(MAR!$E$2:$AF$249,,MATCH($H$1,MAR!$E$1:$AF$1,0))=$B$1,ROW(MAR!$E$2:$AF$249)-ROW(MAR!$J$2)+1),ROWS(E$3:E14))),\"\")","v":"TOC"}]
[13,{"$f":"IFERROR(INDEX(MAR!B$2:B$249,SMALL(IF(INDEX(MAR!$E$2:$AF$249,,MATCH($H$1,MAR!$E$1:$AF$1,0))=$B$1,ROW(MAR!$E$2:$AF$249)-ROW(MAR!$J$2)+1),ROWS(C$3:C15))),\"\")","v":1020151},{"$f":"IFERROR(INDEX(MAR!C$2:C$249,SMALL(IF(INDEX(MAR!$E$2:$AF$249,,MATCH($H$1,MAR!$E$1:$AF$1,0))=$B$1,ROW(MAR!$E$2:$AF$249)-ROW(MAR!$J$2)+1),ROWS(D$3:D15))),\"\")","v":"Mohammed 52"},{"$f":"IFERROR(INDEX(MAR!D$2:D$249,SMALL(IF(INDEX(MAR!$E$2:$AF$249,,MATCH($H$1,MAR!$E$1:$AF$1,0))=$B$1,ROW(MAR!$E$2:$AF$249)-ROW(MAR!$J$2)+1),ROWS(E$3:E15))),\"\")","v":"TOC"}]
[14,{"$f":"IFERROR(INDEX(MAR!B$2:B$249,SMALL(IF(INDEX(MAR!$E$2:$AF$249,,MATCH($H$1,MAR!$E$1:$AF$1,0))=$B$1,ROW(MAR!$E$2:$AF$249)-ROW(MAR!$J$2)+1),ROWS(C$3:C16))),\"\")","v":1020158},{"$f":"IFERROR(INDEX(MAR!C$2:C$249,SMALL(IF(INDEX(MAR!$E$2:$AF$249,,MATCH($H$1,MAR!$E$1:$AF$1,0))=$B$1,ROW(MAR!$E$2:$AF$249)-ROW(MAR!$J$2)+1),ROWS(D$3:D16))),\"\")","v":"Mohammed 59"},{"$f":"IFERROR(INDEX(MAR!D$2:D$249,SMALL(IF(INDEX(MAR!$E$2:$AF$249,,MATCH($H$1,MAR!$E$1:$AF$1,0))=$B$1,ROW(MAR!$E$2:$AF$249)-ROW(MAR!$J$2)+1),ROWS(E$3:E16))),\"\")","v":"OFFICE"}]
[15,{"$f":"IFERROR(INDEX(MAR!B$2:B$249,SMALL(IF(INDEX(MAR!$E$2:$AF$249,,MATCH($H$1,MAR!$E$1:$AF$1,0))=$B$1,ROW(MAR!$E$2:$AF$249)-ROW(MAR!$J$2)+1),ROWS(C$3:C17))),\"\")","v":1020161},{"$f":"IFERROR(INDEX(MAR!C$2:C$249,SMALL(IF(INDEX(MAR!$E$2:$AF$249,,MATCH($H$1,MAR!$E$1:$AF$1,0))=$B$1,ROW(MAR!$E$2:$AF$249)-ROW(MAR!$J$2)+1),ROWS(D$3:D17))),\"\")","v":"Mohammed 62"},{"$f":"IFERROR(INDEX(MAR!D$2:D$249,SMALL(IF(INDEX(MAR!$E$2:$AF$249,,MATCH($H$1,MAR!$E$1:$AF$1,0))=$B$1,ROW(MAR!$E$2:$AF$249)-ROW(MAR!$J$2)+1),ROWS(E$3:E17))),\"\")","v":"DOC"}]
[16,{"$f":"IFERROR(INDEX(MAR!B$2:B$249,SMALL(IF(INDEX(MAR!$E$2:$AF$249,,MATCH($H$1,MAR!$E$1:$AF$1,0))=$B$1,ROW(MAR!$E$2:$AF$249)-ROW(MAR!$J$2)+1),ROWS(C$3:C18))),\"\")","v":1020164},{"$f":"IFERROR(INDEX(MAR!C$2:C$249,SMALL(IF(INDEX(MAR!$E$2:$AF$249,,MATCH($H$1,MAR!$E$1:$AF$1,0))=$B$1,ROW(MAR!$E$2:$AF$249)-ROW(MAR!$J$2)+1),ROWS(D$3:D18))),\"\")","v":"Mohammed 65"},{"$f":"IFERROR(INDEX(MAR!D$2:D$249,SMALL(IF(INDEX(MAR!$E$2:$AF$249,,MATCH($H$1,MAR!$E$1:$AF$1,0))=$B$1,ROW(MAR!$E$2:$AF$249)-ROW(MAR!$J$2)+1),ROWS(E$3:E18))),\"\")","v":"DOC"}]
[17,{"$f":"IFERROR(INDEX(MAR!B$2:B$249,SMALL(IF(INDEX(MAR!$E$2:$AF$249,,MATCH($H$1,MAR!$E$1:$AF$1,0))=$B$1,ROW(MAR!$E$2:$AF$249)-ROW(MAR!$J$2)+1),ROWS(C$3:C19))),\"\")","v":1020168},{"$f":"IFERROR(INDEX(MAR!C$2:C$249,SMALL(IF(INDEX(MAR!$E$2:$AF$249,,MATCH($H$1,MAR!$E$1:$AF$1,0))=$B$1,ROW(MAR!$E$2:$AF$249)-ROW(MAR!$J$2)+1),ROWS(D$3:D19))),\"\")","v":"Mohammed 69"},{"$f":"IFERROR(INDEX(MAR!D$2:D$249,SMALL(IF(INDEX(MAR!$E$2:$AF$249,,MATCH($H$1,MAR!$E$1:$AF$1,0))=$B$1,ROW(MAR!$E$2:$AF$249)-ROW(MAR!$J$2)+1),ROWS(E$3:E19))),\"\")","v":"BAGGAGE"}]
[18,{"$f":"IFERROR(INDEX(MAR!B$2:B$249,SMALL(IF(INDEX(MAR!$E$2:$AF$249,,MATCH($H$1,MAR!$E$1:$AF$1,0))=$B$1,ROW(MAR!$E$2:$AF$249)-ROW(MAR!$J$2)+1),ROWS(C$3:C20))),\"\")","v":1020174},{"$f":"IFERROR(INDEX(MAR!C$2:C$249,SMALL(IF(INDEX(MAR!$E$2:$AF$249,,MATCH($H$1,MAR!$E$1:$AF$1,0))=$B$1,ROW(MAR!$E$2:$AF$249)-ROW(MAR!$J$2)+1),ROWS(D$3:D20))),\"\")","v":"Mohammed 75"},{"$f":"IFERROR(INDEX(MAR!D$2:D$249,SMALL(IF(INDEX(MAR!$E$2:$AF$249,,MATCH($H$1,MAR!$E$1:$AF$1,0))=$B$1,ROW(MAR!$E$2:$AF$249)-ROW(MAR!$J$2)+1),ROWS(E$3:E20))),\"\")","v":"BAGGAGE"}]
[19,{"$f":"IFERROR(INDEX(MAR!B$2:B$249,SMALL(IF(INDEX(MAR!$E$2:$AF$249,,MATCH($H$1,MAR!$E$1:$AF$1,0))=$B$1,ROW(MAR!$E$2:$AF$249)-ROW(MAR!$J$2)+1),ROWS(C$3:C21))),\"\")","v":1020175},{"$f":"IFERROR(INDEX(MAR!C$2:C$249,SMALL(IF(INDEX(MAR!$E$2:$AF$249,,MATCH($H$1,MAR!$E$1:$AF$1,0))=$B$1,ROW(MAR!$E$2:$AF$249)-ROW(MAR!$J$2)+1),ROWS(D$3:D21))),\"\")","v":"Mohammed 76"},{"$f":"IFERROR(INDEX(MAR!D$2:D$249,SMALL(IF(INDEX(MAR!$E$2:$AF$249,,MATCH($H$1,MAR!$E$1:$AF$1,0))=$B$1,ROW(MAR!$E$2:$AF$249)-ROW(MAR!$J$2)+1),ROWS(E$3:E21))),\"\")","v":"BAGGAGE"}]
[20,{"$f":"IFERROR(INDEX(MAR!B$2:B$249,SMALL(IF(INDEX(MAR!$E$2:$AF$249,,MATCH($H$1,MAR!$E$1:$AF$1,0))=$B$1,ROW(MAR!$E$2:$AF$249)-ROW(MAR!$J$2)+1),ROWS(C$3:C22))),\"\")","v":1020200},{"$f":"IFERROR(INDEX(MAR!C$2:C$249,SMALL(IF(INDEX(MAR!$E$2:$AF$249,,MATCH($H$1,MAR!$E$1:$AF$1,0))=$B$1,ROW(MAR!$E$2:$AF$249)-ROW(MAR!$J$2)+1),ROWS(D$3:D22))),\"\")","v":"Mohammed 101"},{"$f":"IFERROR(INDEX(MAR!D$2:D$249,SMALL(IF(INDEX(MAR!$E$2:$AF$249,,MATCH($H$1,MAR!$E$1:$AF$1,0))=$B$1,ROW(MAR!$E$2:$AF$249)-ROW(MAR!$J$2)+1),ROWS(E$3:E22))),\"\")","v":"Agent"}]
[21,{"$f":"IFERROR(INDEX(MAR!B$2:B$249,SMALL(IF(INDEX(MAR!$E$2:$AF$249,,MATCH($H$1,MAR!$E$1:$AF$1,0))=$B$1,ROW(MAR!$E$2:$AF$249)-ROW(MAR!$J$2)+1),ROWS(C$3:C23))),\"\")","v":1020203},{"$f":"IFERROR(INDEX(MAR!C$2:C$249,SMALL(IF(INDEX(MAR!$E$2:$AF$249,,MATCH($H$1,MAR!$E$1:$AF$1,0))=$B$1,ROW(MAR!$E$2:$AF$249)-ROW(MAR!$J$2)+1),ROWS(D$3:D23))),\"\")","v":"Mohammed 104"},{"$f":"IFERROR(INDEX(MAR!D$2:D$249,SMALL(IF(INDEX(MAR!$E$2:$AF$249,,MATCH($H$1,MAR!$E$1:$AF$1,0))=$B$1,ROW(MAR!$E$2:$AF$249)-ROW(MAR!$J$2)+1),ROWS(E$3:E23))),\"\")","v":"Agent"}]
[22,{"$f":"IFERROR(INDEX(MAR!B$2:B$249,SMALL(IF(INDEX(MAR!$E$2:$AF$249,,MATCH($H$1,MAR!$E$1:$AF$1,0))=$B$1,ROW(MAR!$E$2:$AF$249)-ROW(MAR!$J$2)+1),ROWS(C$3:C24))),\"\")","v":1020205},{"$f":"IFERROR(INDEX(MAR!C$2:C$249,SMALL(IF(INDEX(MAR!$E$2:$AF$249,,MATCH($H$1,MAR!$E$1:$AF$1,0))=$B$1,ROW(MAR!$E$2:$AF$249)-ROW(MAR!$J$2)+1),ROWS(D$3:D24))),\"\")","v":"Mohammed 106"},{"$f":"IFERROR(INDEX(MAR!D$2:D$249,SMALL(IF(INDEX(MAR!$E$2:$AF$249,,MATCH($H$1,MAR!$E$1:$AF$1,0))=$B$1,ROW(MAR!$E$2:$AF$249)-ROW(MAR!$J$2)+1),ROWS(E$3:E24))),\"\")","v":"Agent"}]
[23,{"$f":"IFERROR(INDEX(MAR!B$2:B$249,SMALL(IF(INDEX(MAR!$E$2:$AF$249,,MATCH($H$1,MAR!$E$1:$AF$1,0))=$B$1,ROW(MAR!$E$2:$AF$249)-ROW(MAR!$J$2)+1),ROWS(C$3:C25))),\"\")","v":1020208},{"$f":"IFERROR(INDEX(MAR!C$2:C$249,SMALL(IF(INDEX(MAR!$E$2:$AF$249,,MATCH($H$1,MAR!$E$1:$AF$1,0))=$B$1,ROW(MAR!$E$2:$AF$249)-ROW(MAR!$J$2)+1),ROWS(D$3:D25))),\"\")","v":"Mohammed 109"},{"$f":"IFERROR(INDEX(MAR!D$2:D$249,SMALL(IF(INDEX(MAR!$E$2:$AF$249,,MATCH($H$1,MAR!$E$1:$AF$1,0))=$B$1,ROW(MAR!$E$2:$AF$249)-ROW(MAR!$J$2)+1),ROWS(E$3:E25))),\"\")","v":"Agent"}]
[24,{"$f":"IFERROR(INDEX(MAR!B$2:B$249,SMALL(IF(INDEX(MAR!$E$2:$AF$249,,MATCH($H$1,MAR!$E$1:$AF$1,0))=$B$1,ROW(MAR!$E$2:$AF$249)-ROW(MAR!$J$2)+1),ROWS(C$3:C26))),\"\")","v":1020211},{"$f":"IFERROR(INDEX(MAR!C$2:C$249,SMALL(IF(INDEX(MAR!$E$2:$AF$249,,MATCH($H$1,MAR!$E$1:$AF$1,0))=$B$1,ROW(MAR!$E$2:$AF$249)-ROW(MAR!$J$2)+1),ROWS(D$3:D26))),\"\")","v":"Mohammed 112"},{"$f":"IFERROR(INDEX(MAR!D$2:D$249,SMALL(IF(INDEX(MAR!$E$2:$AF$249,,MATCH($H$1,MAR!$E$1:$AF$1,0))=$B$1,ROW(MAR!$E$2:$AF$249)-ROW(MAR!$J$2)+1),ROWS(E$3:E26))),\"\")","v":"Agent"}]
[25,{"$f":"IFERROR(INDEX(MAR!B$2:B$249,SMALL(IF(INDEX(MAR!$E$2:$AF$249,,MATCH($H$1,MAR!$E$1:$AF$1,0))=$B$1,ROW(MAR!$E$2:$AF$249)-ROW(MAR!$J$2)+1),ROWS(C$3:C27))),\"\")","v":1020214},{"$f":"IFERROR(INDEX(MAR!C$2:C$249,SMALL(IF(INDEX(MAR!$E$2:$AF$249,,MATCH($H$1,MAR!$E$1:$AF$1,0))=$B$1,ROW(MAR!$E$2:$AF$249)-ROW(MAR!$J$2)+1),ROWS(D$3:D27))),\"\")","v":"Mohammed 115"},{"$f":"IFERROR(INDEX(MAR!D$2:D$249,SMALL(IF(INDEX(MAR!$E$2:$AF$249,,MATCH($H$1,MAR!$E$1:$AF$1,0))=$B$1,ROW(MAR!$E$2:$AF$249)-ROW(MAR!$J$2)+1),ROWS(E$3:E27))),\"\")","v":"Agent"}]
[26,{"$f":"IFERROR(INDEX(MAR!B$2:B$249,SMALL(IF(INDEX(MAR!$E$2:$AF$249,,MATCH($H$1,MAR!$E$1:$AF$1,0))=$B$1,ROW(MAR!$E$2:$AF$249)-ROW(MAR!$J$2)+1),ROWS(C$3:C28))),\"\")","v":1020257},{"$f":"IFERROR(INDEX(MAR!C$2:C$249,SMALL(IF(INDEX(MAR!$E$2:$AF$249,,MATCH($H$1,MAR!$E$1:$AF$1,0))=$B$1,ROW(MAR!$E$2:$AF$249)-ROW(MAR!$J$2)+1),ROWS(D$3:D28))),\"\")","v":"Mohammed 158"},{"$f":"IFERROR(INDEX(MAR!D$2:D$249,SMALL(IF(INDEX(MAR!$E$2:$AF$249,,MATCH($H$1,MAR!$E$1:$AF$1,0))=$B$1,ROW(MAR!$E$2:$AF$249)-ROW(MAR!$J$2)+1),ROWS(E$3:E28))),\"\")","v":"Agent"}]
[27,{"$f":"IFERROR(INDEX(MAR!B$2:B$249,SMALL(IF(INDEX(MAR!$E$2:$AF$249,,MATCH($H$1,MAR!$E$1:$AF$1,0))=$B$1,ROW(MAR!$E$2:$AF$249)-ROW(MAR!$J$2)+1),ROWS(C$3:C29))),\"\")","v":1020258},{"$f":"IFERROR(INDEX(MAR!C$2:C$249,SMALL(IF(INDEX(MAR!$E$2:$AF$249,,MATCH($H$1,MAR!$E$1:$AF$1,0))=$B$1,ROW(MAR!$E$2:$AF$249)-ROW(MAR!$J$2)+1),ROWS(D$3:D29))),\"\")","v":"Mohammed 159"},{"$f":"IFERROR(INDEX(MAR!D$2:D$249,SMALL(IF(INDEX(MAR!$E$2:$AF$249,,MATCH($H$1,MAR!$E$1:$AF$1,0))=$B$1,ROW(MAR!$E$2:$AF$249)-ROW(MAR!$J$2)+1),ROWS(E$3:E29))),\"\")","v":"Agent"}]
[28,{"$f":"IFERROR(INDEX(MAR!B$2:B$249,SMALL(IF(INDEX(MAR!$E$2:$AF$249,,MATCH($H$1,MAR!$E$1:$AF$1,0))=$B$1,ROW(MAR!$E$2:$AF$249)-ROW(MAR!$J$2)+1),ROWS(C$3:C30))),\"\")","v":1020259},{"$f":"IFERROR(INDEX(MAR!C$2:C$249,SMALL(IF(INDEX(MAR!$E$2:$AF$249,,MATCH($H$1,MAR!$E$1:$AF$1,0))=$B$1,ROW(MAR!$E$2:$AF$249)-ROW(MAR!$J$2)+1),ROWS(D$3:D30))),\"\")","v":"Mohammed 160"},{"$f":"IFERROR(INDEX(MAR!D$2:D$249,SMALL(IF(INDEX(MAR!$E$2:$AF$249,,MATCH($H$1,MAR!$E$1:$AF$1,0))=$B$1,ROW(MAR!$E$2:$AF$249)-ROW(MAR!$J$2)+1),ROWS(E$3:E30))),\"\")","v":"Agent"}]
[29,{"$f":"IFERROR(INDEX(MAR!B$2:B$249,SMALL(IF(INDEX(MAR!$E$2:$AF$249,,MATCH($H$1,MAR!$E$1:$AF$1,0))=$B$1,ROW(MAR!$E$2:$AF$249)-ROW(MAR!$J$2)+1),ROWS(C$3:C31))),\"\")","v":1020260},{"$f":"IFERROR(INDEX(MAR!C$2:C$249,SMALL(IF(INDEX(MAR!$E$2:$AF$249,,MATCH($H$1,MAR!$E$1:$AF$1,0))=$B$1,ROW(MAR!$E$2:$AF$249)-ROW(MAR!$J$2)+1),ROWS(D$3:D31))),\"\")","v":"Mohammed 161"},{"$f":"IFERROR(INDEX(MAR!D$2:D$249,SMALL(IF(INDEX(MAR!$E$2:$AF$249,,MATCH($H$1,MAR!$E$1:$AF$1,0))=$B$1,ROW(MAR!$E$2:$AF$249)-ROW(MAR!$J$2)+1),ROWS(E$3:E31))),\"\")","v":"Agent"}]
[30,{"$f":"IFERROR(INDEX(MAR!B$2:B$249,SMALL(IF(INDEX(MAR!$E$2:$AF$249,,MATCH($H$1,MAR!$E$1:$AF$1,0))=$B$1,ROW(MAR!$E$2:$AF$249)-ROW(MAR!$J$2)+1),ROWS(C$3:C32))),\"\")","v":1020261},{"$f":"IFERROR(INDEX(MAR!C$2:C$249,SMALL(IF(INDEX(MAR!$E$2:$AF$249,,MATCH($H$1,MAR!$E$1:$AF$1,0))=$B$1,ROW(MAR!$E$2:$AF$249)-ROW(MAR!$J$2)+1),ROWS(D$3:D32))),\"\")","v":"Mohammed 162"},{"$f":"IFERROR(INDEX(MAR!D$2:D$249,SMALL(IF(INDEX(MAR!$E$2:$AF$249,,MATCH($H$1,MAR!$E$1:$AF$1,0))=$B$1,ROW(MAR!$E$2:$AF$249)-ROW(MAR!$J$2)+1),ROWS(E$3:E32))),\"\")","v":"Agent"}]
[31,{"$f":"IFERROR(INDEX(MAR!B$2:B$249,SMALL(IF(INDEX(MAR!$E$2:$AF$249,,MATCH($H$1,MAR!$E$1:$AF$1,0))=$B$1,ROW(MAR!$E$2:$AF$249)-ROW(MAR!$J$2)+1),ROWS(C$3:C33))),\"\")","v":1020262},{"$f":"IFERROR(INDEX(MAR!C$2:C$249,SMALL(IF(INDEX(MAR!$E$2:$AF$249,,MATCH($H$1,MAR!$E$1:$AF$1,0))=$B$1,ROW(MAR!$E$2:$AF$249)-ROW(MAR!$J$2)+1),ROWS(D$3:D33))),\"\")","v":"Mohammed 163"},{"$f":"IFERROR(INDEX(MAR!D$2:D$249,SMALL(IF(INDEX(MAR!$E$2:$AF$249,,MATCH($H$1,MAR!$E$1:$AF$1,0))=$B$1,ROW(MAR!$E$2:$AF$249)-ROW(MAR!$J$2)+1),ROWS(E$3:E33))),\"\")","v":"Agent"}]
[32,{"$f":"IFERROR(INDEX(MAR!B$2:B$249,SMALL(IF(INDEX(MAR!$E$2:$AF$249,,MATCH($H$1,MAR!$E$1:$AF$1,0))=$B$1,ROW(MAR!$E$2:$AF$249)-ROW(MAR!$J$2)+1),ROWS(C$3:C34))),\"\")","v":1020263},{"$f":"IFERROR(INDEX(MAR!C$2:C$249,SMALL(IF(INDEX(MAR!$E$2:$AF$249,,MATCH($H$1,MAR!$E$1:$AF$1,0))=$B$1,ROW(MAR!$E$2:$AF$249)-ROW(MAR!$J$2)+1),ROWS(D$3:D34))),\"\")","v":"Mohammed 164"},{"$f":"IFERROR(INDEX(MAR!D$2:D$249,SMALL(IF(INDEX(MAR!$E$2:$AF$249,,MATCH($H$1,MAR!$E$1:$AF$1,0))=$B$1,ROW(MAR!$E$2:$AF$249)-ROW(MAR!$J$2)+1),ROWS(E$3:E34))),\"\")","v":"Agent"}]
[33,{"$f":"IFERROR(INDEX(MAR!B$2:B$249,SMALL(IF(INDEX(MAR!$E$2:$AF$249,,MATCH($H$1,MAR!$E$1:$AF$1,0))=$B$1,ROW(MAR!$E$2:$AF$249)-ROW(MAR!$J$2)+1),ROWS(C$3:C35))),\"\")","v":1020264},{"$f":"IFERROR(INDEX(MAR!C$2:C$249,SMALL(IF(INDEX(MAR!$E$2:$AF$249,,MATCH($H$1,MAR!$E$1:$AF$1,0))=$B$1,ROW(MAR!$E$2:$AF$249)-ROW(MAR!$J$2)+1),ROWS(D$3:D35))),\"\")","v":"Mohammed 165"},{"$f":"IFERROR(INDEX(MAR!D$2:D$249,SMALL(IF(INDEX(MAR!$E$2:$AF$249,,MATCH($H$1,MAR!$E$1:$AF$1,0))=$B$1,ROW(MAR!$E$2:$AF$249)-ROW(MAR!$J$2)+1),ROWS(E$3:E35))),\"\")","v":"Agent"}]
[34,{"$f":"IFERROR(INDEX(MAR!B$2:B$249,SMALL(IF(INDEX(MAR!$E$2:$AF$249,,MATCH($H$1,MAR!$E$1:$AF$1,0))=$B$1,ROW(MAR!$E$2:$AF$249)-ROW(MAR!$J$2)+1),ROWS(C$3:C36))),\"\")","v":1020265},{"$f":"IFERROR(INDEX(MAR!C$2:C$249,SMALL(IF(INDEX(MAR!$E$2:$AF$249,,MATCH($H$1,MAR!$E$1:$AF$1,0))=$B$1,ROW(MAR!$E$2:$AF$249)-ROW(MAR!$J$2)+1),ROWS(D$3:D36))),\"\")","v":"Mohammed 166"},{"$f":"IFERROR(INDEX(MAR!D$2:D$249,SMALL(IF(INDEX(MAR!$E$2:$AF$249,,MATCH($H$1,MAR!$E$1:$AF$1,0))=$B$1,ROW(MAR!$E$2:$AF$249)-ROW(MAR!$J$2)+1),ROWS(E$3:E36))),\"\")","v":"Agent"}]
[35,{"$f":"IFERROR(INDEX(MAR!B$2:B$249,SMALL(IF(INDEX(MAR!$E$2:$AF$249,,MATCH($H$1,MAR!$E$1:$AF$1,0))=$B$1,ROW(MAR!$E$2:$AF$249)-ROW(MAR!$J$2)+1),ROWS(C$3:C37))),\"\")","v":1020266},{"$f":"IFERROR(INDEX(MAR!C$2:C$249,SMALL(IF(INDEX(MAR!$E$2:$AF$249,,MATCH($H$1,MAR!$E$1:$AF$1,0))=$B$1,ROW(MAR!$E$2:$AF$249)-ROW(MAR!$J$2)+1),ROWS(D$3:D37))),\"\")","v":"Mohammed 167"},{"$f":"IFERROR(INDEX(MAR!D$2:D$249,SMALL(IF(INDEX(MAR!$E$2:$AF$249,,MATCH($H$1,MAR!$E$1:$AF$1,0))=$B$1,ROW(MAR!$E$2:$AF$249)-ROW(MAR!$J$2)+1),ROWS(E$3:E37))),\"\")","v":"Agent"}]
[36,{"$f":"IFERROR(INDEX(MAR!B$2:B$249,SMALL(IF(INDEX(MAR!$E$2:$AF$249,,MATCH($H$1,MAR!$E$1:$AF$1,0))=$B$1,ROW(MAR!$E$2:$AF$249)-ROW(MAR!$J$2)+1),ROWS(C$3:C38))),\"\")","v":1020267},{"$f":"IFERROR(INDEX(MAR!C$2:C$249,SMALL(IF(INDEX(MAR!$E$2:$AF$249,,MATCH($H$1,MAR!$E$1:$AF$1,0))=$B$1,ROW(MAR!$E$2:$AF$249)-ROW(MAR!$J$2)+1),ROWS(D$3:D38))),\"\")","v":"Mohammed 168"},{"$f":"IFERROR(INDEX(MAR!D$2:D$249,SMALL(IF(INDEX(MAR!$E$2:$AF$249,,MATCH($H$1,MAR!$E$1:$AF$1,0))=$B$1,ROW(MAR!$E$2:$AF$249)-ROW(MAR!$J$2)+1),ROWS(E$3:E38))),\"\")","v":"Agent"}]
[37,{"$f":"IFERROR(INDEX(MAR!B$2:B$249,SMALL(IF(INDEX(MAR!$E$2:$AF$249,,MATCH($H$1,MAR!$E$1:$AF$1,0))=$B$1,ROW(MAR!$E$2:$AF$249)-ROW(MAR!$J$2)+1),ROWS(C$3:C39))),\"\")","v":1020268},{"$f":"IFERROR(INDEX(MAR!C$2:C$249,SMALL(IF(INDEX(MAR!$E$2:$AF$249,,MATCH($H$1,MAR!$E$1:$AF$1,0))=$B$1,ROW(MAR!$E$2:$AF$249)-ROW(MAR!$J$2)+1),ROWS(D$3:D39))),\"\")","v":"Mohammed 169"},{"$f":"IFERROR(INDEX(MAR!D$2:D$249,SMALL(IF(INDEX(MAR!$E$2:$AF$249,,MATCH($H$1,MAR!$E$1:$AF$1,0))=$B$1,ROW(MAR!$E$2:$AF$249)-ROW(MAR!$J$2)+1),ROWS(E$3:E39))),\"\")","v":"Agent"}]
[38,{"$f":"IFERROR(INDEX(MAR!B$2:B$249,SMALL(IF(INDEX(MAR!$E$2:$AF$249,,MATCH($H$1,MAR!$E$1:$AF$1,0))=$B$1,ROW(MAR!$E$2:$AF$249)-ROW(MAR!$J$2)+1),ROWS(C$3:C40))),\"\")","v":1020269},{"$f":"IFERROR(INDEX(MAR!C$2:C$249,SMALL(IF(INDEX(MAR!$E$2:$AF$249,,MATCH($H$1,MAR!$E$1:$AF$1,0))=$B$1,ROW(MAR!$E$2:$AF$249)-ROW(MAR!$J$2)+1),ROWS(D$3:D40))),\"\")","v":"Mohammed 170"},{"$f":"IFERROR(INDEX(MAR!D$2:D$249,SMALL(IF(INDEX(MAR!$E$2:$AF$249,,MATCH($H$1,MAR!$E$1:$AF$1,0))=$B$1,ROW(MAR!$E$2:$AF$249)-ROW(MAR!$J$2)+1),ROWS(E$3:E40))),\"\")","v":"Agent"}]
[39,{"$f":"IFERROR(INDEX(MAR!B$2:B$249,SMALL(IF(INDEX(MAR!$E$2:$AF$249,,MATCH($H$1,MAR!$E$1:$AF$1,0))=$B$1,ROW(MAR!$E$2:$AF$249)-ROW(MAR!$J$2)+1),ROWS(C$3:C41))),\"\")","v":1020270},{"$f":"IFERROR(INDEX(MAR!C$2:C$249,SMALL(IF(INDEX(MAR!$E$2:$AF$249,,MATCH($H$1,MAR!$E$1:$AF$1,0))=$B$1,ROW(MAR!$E$2:$AF$249)-ROW(MAR!$J$2)+1),ROWS(D$3:D41))),\"\")","v":"Mohammed 171"},{"$f":"IFERROR(INDEX(MAR!D$2:D$249,SMALL(IF(INDEX(MAR!$E$2:$AF$249,,MATCH($H$1,MAR!$E$1:$AF$1,0))=$B$1,ROW(MAR!$E$2:$AF$249)-ROW(MAR!$J$2)+1),ROWS(E$3:E41))),\"\")","v":"Agent"}]
[40,{"$f":"IFERROR(INDEX(MAR!B$2:B$249,SMALL(IF(INDEX(MAR!$E$2:$AF$249,,MATCH($H$1,MAR!$E$1:$AF$1,0))=$B$1,ROW(MAR!$E$2:$AF$249)-ROW(MAR!$J$2)+1),ROWS(C$3:C42))),\"\")","v":1020271},{"$f":"IFERROR(INDEX(MAR!C$2:C$249,SMALL(IF(INDEX(MAR!$E$2:$AF$249,,MATCH($H$1,MAR!$E$1:$AF$1,0))=$B$1,ROW(MAR!$E$2:$AF$249)-ROW(MAR!$J$2)+1),ROWS(D$3:D42))),\"\")","v":"Mohammed 172"},{"$f":"IFERROR(INDEX(MAR!D$2:D$249,SMALL(IF(INDEX(MAR!$E$2:$AF$249,,MATCH($H$1,MAR!$E$1:$AF$1,0))=$B$1,ROW(MAR!$E$2:$AF$249)-ROW(MAR!$J$2)+1),ROWS(E$3:E42))),\"\")","v":"Agent"}]
[41,{"$f":"IFERROR(INDEX(MAR!B$2:B$249,SMALL(IF(INDEX(MAR!$E$2:$AF$249,,MATCH($H$1,MAR!$E$1:$AF$1,0))=$B$1,ROW(MAR!$E$2:$AF$249)-ROW(MAR!$J$2)+1),ROWS(C$3:C43))),\"\")","v":1020272},{"$f":"IFERROR(INDEX(MAR!C$2:C$249,SMALL(IF(INDEX(MAR!$E$2:$AF$249,,MATCH($H$1,MAR!$E$1:$AF$1,0))=$B$1,ROW(MAR!$E$2:$AF$249)-ROW(MAR!$J$2)+1),ROWS(D$3:D43))),\"\")","v":"Mohammed 173"},{"$f":"IFERROR(INDEX(MAR!D$2:D$249,SMALL(IF(INDEX(MAR!$E$2:$AF$249,,MATCH($H$1,MAR!$E$1:$AF$1,0))=$B$1,ROW(MAR!$E$2:$AF$249)-ROW(MAR!$J$2)+1),ROWS(E$3:E43))),\"\")","v":"Agent"}]
[42,{"$f":"IFERROR(INDEX(MAR!B$2:B$249,SMALL(IF(INDEX(MAR!$E$2:$AF$249,,MATCH($H$1,MAR!$E$1:$AF$1,0))=$B$1,ROW(MAR!$E$2:$AF$249)-ROW(MAR!$J$2)+1),ROWS(C$3:C44))),\"\")","v":1020273},{"$f":"IFERROR(INDEX(MAR!C$2:C$249,SMALL(IF(INDEX(MAR!$E$2:$AF$249,,MATCH($H$1,MAR!$E$1:$AF$1,0))=$B$1,ROW(MAR!$E$2:$AF$249)-ROW(MAR!$J$2)+1),ROWS(D$3:D44))),\"\")","v":"Mohammed 174"},{"$f":"IFERROR(INDEX(MAR!D$2:D$249,SMALL(IF(INDEX(MAR!$E$2:$AF$249,,MATCH($H$1,MAR!$E$1:$AF$1,0))=$B$1,ROW(MAR!$E$2:$AF$249)-ROW(MAR!$J$2)+1),ROWS(E$3:E44))),\"\")","v":"Agent"}]
[43,{"$f":"IFERROR(INDEX(MAR!B$2:B$249,SMALL(IF(INDEX(MAR!$E$2:$AF$249,,MATCH($H$1,MAR!$E$1:$AF$1,0))=$B$1,ROW(MAR!$E$2:$AF$249)-ROW(MAR!$J$2)+1),ROWS(C$3:C45))),\"\")","v":1020274},{"$f":"IFERROR(INDEX(MAR!C$2:C$249,SMALL(IF(INDEX(MAR!$E$2:$AF$249,,MATCH($H$1,MAR!$E$1:$AF$1,0))=$B$1,ROW(MAR!$E$2:$AF$249)-ROW(MAR!$J$2)+1),ROWS(D$3:D45))),\"\")","v":"Mohammed 175"},{"$f":"IFERROR(INDEX(MAR!D$2:D$249,SMALL(IF(INDEX(MAR!$E$2:$AF$249,,MATCH($H$1,MAR!$E$1:$AF$1,0))=$B$1,ROW(MAR!$E$2:$AF$249)-ROW(MAR!$J$2)+1),ROWS(E$3:E45))),\"\")","v":"Agent"}]
[44,{"$f":"IFERROR(INDEX(MAR!B$2:B$249,SMALL(IF(INDEX(MAR!$E$2:$AF$249,,MATCH($H$1,MAR!$E$1:$AF$1,0))=$B$1,ROW(MAR!$E$2:$AF$249)-ROW(MAR!$J$2)+1),ROWS(C$3:C46))),\"\")","v":1020275},{"$f":"IFERROR(INDEX(MAR!C$2:C$249,SMALL(IF(INDEX(MAR!$E$2:$AF$249,,MATCH($H$1,MAR!$E$1:$AF$1,0))=$B$1,ROW(MAR!$E$2:$AF$249)-ROW(MAR!$J$2)+1),ROWS(D$3:D46))),\"\")","v":"Mohammed 176"},{"$f":"IFERROR(INDEX(MAR!D$2:D$249,SMALL(IF(INDEX(MAR!$E$2:$AF$249,,MATCH($H$1,MAR!$E$1:$AF$1,0))=$B$1,ROW(MAR!$E$2:$AF$249)-ROW(MAR!$J$2)+1),ROWS(E$3:E46))),\"\")","v":"Agent"},null,null,null,"TOTEL STAFF",null,null,null,null,{"$f":"COUNT(A4:A62)","v":54}]
[45,{"$f":"IFERROR(INDEX(MAR!B$2:B$249,SMALL(IF(INDEX(MAR!$E$2:$AF$249,,MATCH($H$1,MAR!$E$1:$AF$1,0))=$B$1,ROW(MAR!$E$2:$AF$249)-ROW(MAR!$J$2)+1),ROWS(C$3:C47))),\"\")","v":1020276},{"$f":"IFERROR(INDEX(MAR!C$2:C$249,SMALL(IF(INDEX(MAR!$E$2:$AF$249,,MATCH($H$1,MAR!$E$1:$AF$1,0))=$B$1,ROW(MAR!$E$2:$AF$249)-ROW(MAR!$J$2)+1),ROWS(D$3:D47))),\"\")","v":"Mohammed 177"},{"$f":"IFERROR(INDEX(MAR!D$2:D$249,SMALL(IF(INDEX(MAR!$E$2:$AF$249,,MATCH($H$1,MAR!$E$1:$AF$1,0))=$B$1,ROW(MAR!$E$2:$AF$249)-ROW(MAR!$J$2)+1),ROWS(E$3:E47))),\"\")","v":"Agent"},null,null,null,{"$f":"COUNTIF($F$4:$F$62,M48)","v":0},null,null,null,null,"حاضر"]
[46,{"$f":"IFERROR(INDEX(MAR!B$2:B$249,SMALL(IF(INDEX(MAR!$E$2:$AF$249,,MATCH($H$1,MAR!$E$1:$AF$1,0))=$B$1,ROW(MAR!$E$2:$AF$249)-ROW(MAR!$J$2)+1),ROWS(C$3:C48))),\"\")","v":1020297},{"$f":"IFERROR(INDEX(MAR!C$2:C$249,SMALL(IF(INDEX(MAR!$E$2:$AF$249,,MATCH($H$1,MAR!$E$1:$AF$1,0))=$B$1,ROW(MAR!$E$2:$AF$249)-ROW(MAR!$J$2)+1),ROWS(D$3:D48))),\"\")","v":"Mohammed 198"},{"$f":"IFERROR(INDEX(MAR!D$2:D$249,SMALL(IF(INDEX(MAR!$E$2:$AF$249,,MATCH($H$1,MAR!$E$1:$AF$1,0))=$B$1,ROW(MAR!$E$2:$AF$249)-ROW(MAR!$J$2)+1),ROWS(E$3:E48))),\"\")","v":"Agent"},null,null,null,{"$f":"COUNTIF($F$4:$F$46,M49)","v":0},null,null,null,null,"غائب"]
[47,{"$f":"IFERROR(INDEX(MAR!B$2:B$249,SMALL(IF(INDEX(MAR!$E$2:$AF$249,,MATCH($H$1,MAR!$E$1:$AF$1,0))=$B$1,ROW(MAR!$E$2:$AF$249)-ROW(MAR!$J$2)+1),ROWS(C$3:C49))),\"\")","v":1020303},{"$f":"IFERROR(INDEX(MAR!C$2:C$249,SMALL(IF(INDEX(MAR!$E$2:$AF$249,,MATCH($H$1,MAR!$E$1:$AF$1,0))=$B$1,ROW(MAR!$E$2:$AF$249)-ROW(MAR!$J$2)+1),ROWS(D$3:D49))),\"\")","v":"Mohammed 204"},{"$f":"IFERROR(INDEX(MAR!D$2:D$249,SMALL(IF(INDEX(MAR!$E$2:$AF$249,,MATCH($H$1,MAR!$E$1:$AF$1,0))=$B$1,ROW(MAR!$E$2:$AF$249)-ROW(MAR!$J$2)+1),ROWS(E$3:E49))),\"\")","v":"Agent"},null,null,null,{"$f":"COUNTIF($F$4:$F$46,M50)","v":0},null,null,null,null,"إجازة مرضية"]
[48,{"$f":"IFERROR(INDEX(MAR!B$2:B$249,SMALL(IF(INDEX(MAR!$E$2:$AF$249,,MATCH($H$1,MAR!$E$1:$AF$1,0))=$B$1,ROW(MAR!$E$2:$AF$249)-ROW(MAR!$J$2)+1),ROWS(C$3:C50))),\"\")","v":1020308},{"$f":"IFERROR(INDEX(MAR!C$2:C$249,SMALL(IF(INDEX(MAR!$E$2:$AF$249,,MATCH($H$1,MAR!$E$1:$AF$1,0))=$B$1,ROW(MAR!$E$2:$AF$249)-ROW(MAR!$J$2)+1),ROWS(D$3:D50))),\"\")","v":"Mohammed 209"},{"$f":"IFERROR(INDEX(MAR!D$2:D$249,SMALL(IF(INDEX(MAR!$E$2:$AF$249,,MATCH($H$1,MAR!$E$1:$AF$1,0))=$B$1,ROW(MAR!$E$2:$AF$249)-ROW(MAR!$J$2)+1),ROWS(E$3:E50))),\"\")","v":"Agent"},null,null,null,{"$f":"COUNTIF($F$4:$F$46,M51)","v":0},null,null,null,null,"مستأذن دخول"]
[49,{"$f":"IFERROR(INDEX(MAR!B$2:B$249,SMALL(IF(INDEX(MAR!$E$2:$AF$249,,MATCH($H$1,MAR!$E$1:$AF$1,0))=$B$1,ROW(MAR!$E$2:$AF$249)-ROW(MAR!$J$2)+1),ROWS(C$3:C51))),\"\")","v":1020313},{"$f":"IFERROR(INDEX(MAR!C$2:C$249,SMALL(IF(INDEX(MAR!$E$2:$AF$249,,MATCH($H$1,MAR!$E$1:$AF$1,0))=$B$1,ROW(MAR!$E$2:$AF$249)-ROW(MAR!$J$2)+1),ROWS(D$3:D51))),\"\")","v":"Mohammed 214"},{"$f":"IFERROR(INDEX(MAR!D$2:D$249,SMALL(IF(INDEX(MAR!$E$2:$AF$249,,MATCH($H$1,MAR!$E$1:$AF$1,0))=$B$1,ROW(MAR!$E$2:$AF$249)-ROW(MAR!$J$2)+1),ROWS(E$3:E51))),\"\")","v":"Agent"},null,null,null,{"$f":"COUNTIF($F$4:$F$46,M52)","v":0},null,null,null,null,"مستأذن خروج"]
[50,{"$f":"IFERROR(INDEX(MAR!B$2:B$249,SMALL(IF(INDEX(MAR!$E$2:$AF$249,,MATCH($H$1,MAR!$E$1:$AF$1,0))=$B$1,ROW(MAR!$E$2:$AF$249)-ROW(MAR!$J$2)+1),ROWS(C$3:C52))),\"\")","v":1020314},{"$f":"IFERROR(INDEX(MAR!C$2:C$249,SMALL(IF(INDEX(MAR!$E$2:$AF$249,,MATCH($H$1,MAR!$E$1:$AF$1,0))=$B$1,ROW(MAR!$E$2:$AF$249)-ROW(MAR!$J$2)+1),ROWS(D$3:D52))),\"\")","v":"Mohammed 215"},{"$f":"IFERROR(INDEX(MAR!D$2:D$249,SMALL(IF(INDEX(MAR!$E$2:$AF$249,,MATCH($H$1,MAR!$E$1:$AF$1,0))=$B$1,ROW(MAR!$E$2:$AF$249)-ROW(MAR!$J$2)+1),ROWS(E$3:E52))),\"\")","v":"Agent"},null,null,null,{"$f":"COUNTIF($F$4:$F$46,M53)","v":0},null,null,null,null,"إجازة سنوية"]
[51,{"$f":"IFERROR(INDEX(MAR!B$2:B$249,SMALL(IF(INDEX(MAR!$E$2:$AF$249,,MATCH($H$1,MAR!$E$1:$AF$1,0))=$B$1,ROW(MAR!$E$2:$AF$249)-ROW(MAR!$J$2)+1),ROWS(C$3:C53))),\"\")","v":1020325},{"$f":"IFERROR(INDEX(MAR!C$2:C$249,SMALL(IF(INDEX(MAR!$E$2:$AF$249,,MATCH($H$1,MAR!$E$1:$AF$1,0))=$B$1,ROW(MAR!$E$2:$AF$249)-ROW(MAR!$J$2)+1),ROWS(D$3:D53))),\"\")","v":"Mohammed 226"},{"$f":"IFERROR(INDEX(MAR!D$2:D$249,SMALL(IF(INDEX(MAR!$E$2:$AF$249,,MATCH($H$1,MAR!$E$1:$AF$1,0))=$B$1,ROW(MAR!$E$2:$AF$249)-ROW(MAR!$J$2)+1),ROWS(E$3:E53))),\"\")","v":"Agent"}]
[52,{"$f":"IFERROR(INDEX(MAR!B$2:B$249,SMALL(IF(INDEX(MAR!$E$2:$AF$249,,MATCH($H$1,MAR!$E$1:$AF$1,0))=$B$1,ROW(MAR!$E$2:$AF$249)-ROW(MAR!$J$2)+1),ROWS(C$3:C54))),\"\")","v":1020326},{"$f":"IFERROR(INDEX(MAR!C$2:C$249,SMALL(IF(INDEX(MAR!$E$2:$AF$249,,MATCH($H$1,MAR!$E$1:$AF$1,0))=$B$1,ROW(MAR!$E$2:$AF$249)-ROW(MAR!$J$2)+1),ROWS(D$3:D54))),\"\")","v":"Mohammed 227"},{"$f":"IFERROR(INDEX(MAR!D$2:D$249,SMALL(IF(INDEX(MAR!$E$2:$AF$249,,MATCH($H$1,MAR!$E$1:$AF$1,0))=$B$1,ROW(MAR!$E$2:$AF$249)-ROW(MAR!$J$2)+1),ROWS(E$3:E54))),\"\")","v":"Agent"}]
[53,{"$f":"IFERROR(INDEX(MAR!B$2:B$249,SMALL(IF(INDEX(MAR!$E$2:$AF$249,,MATCH($H$1,MAR!$E$1:$AF$1,0))=$B$1,ROW(MAR!$E$2:$AF$249)-ROW(MAR!$J$2)+1),ROWS(C$3:C55))),\"\")","v":1020329},{"$f":"IFERROR(INDEX(MAR!C$2:C$249,SMALL(IF(INDEX(MAR!$E$2:$AF$249,,MATCH($H$1,MAR!$E$1:$AF$1,0))=$B$1,ROW(MAR!$E$2:$AF$249)-ROW(MAR!$J$2)+1),ROWS(D$3:D55))),\"\")","v":"Mohammed 230"},{"$f":"IFERROR(INDEX(MAR!D$2:D$249,SMALL(IF(INDEX(MAR!$E$2:$AF$249,,MATCH($H$1,MAR!$E$1:$AF$1,0))=$B$1,ROW(MAR!$E$2:$AF$249)-ROW(MAR!$J$2)+1),ROWS(E$3:E55))),\"\")","v":"Agent"}]
[54,{"$f":"IFERROR(INDEX(MAR!B$2:B$249,SMALL(IF(INDEX(MAR!$E$2:$AF$249,,MATCH($H$1,MAR!$E$1:$AF$1,0))=$B$1,ROW(MAR!$E$2:$AF$249)-ROW(MAR!$J$2)+1),ROWS(C$3:C56))),\"\")","v":1020330},{"$f":"IFERROR(INDEX(MAR!C$2:C$249,SMALL(IF(INDEX(MAR!$E$2:$AF$249,,MATCH($H$1,MAR!$E$1:$AF$1,0))=$B$1,ROW(MAR!$E$2:$AF$249)-ROW(MAR!$J$2)+1),ROWS(D$3:D56))),\"\")","v":"Mohammed 231"},{"$f":"IFERROR(INDEX(MAR!D$2:D$249,SMALL(IF(INDEX(MAR!$E$2:$AF$249,,MATCH($H$1,MAR!$E$1:$AF$1,0))=$B$1,ROW(MAR!$E$2:$AF$249)-ROW(MAR!$J$2)+1),ROWS(E$3:E56))),\"\")","v":"Agent"}]
["",{"$f":"IFERROR(INDEX(MAR!B$2:B$249,SMALL(IF(INDEX(MAR!$E$2:$AF$249,,MATCH($H$1,MAR!$E$1:$AF$1,0))=$B$1,ROW(MAR!$E$2:$AF$249)-ROW(MAR!$J$2)+1),ROWS(C$3:C57))),\"\")","v":""},{"$f":"IFERROR(INDEX(MAR!C$2:C$249,SMALL(IF(INDEX(MAR!$E$2:$AF$249,,MATCH($H$1,MAR!$E$1:$AF$1,0))=$B$1,ROW(MAR!$E$2:$AF$249)-ROW(MAR!$J$2)+1),ROWS(D$3:D57))),\"\")","v":""},{"$f":"IFERROR(INDEX(MAR!D$2:D$249,SMALL(IF(INDEX(MAR!$E$2:$AF$249,,MATCH($H$1,MAR!$E$1:$AF$1,0))=$B$1,ROW(MAR!$E$2:$AF$249)-ROW(MAR!$J$2)+1),ROWS(E$3:E57))),\"\")","v":""}]
["",{"$f":"IFERROR(INDEX(MAR!B$2:B$249,SMALL(IF(INDEX(MAR!$E$2:$AF$249,,MATCH($H$1,MAR!$E$1:$AF$1,0))=$B$1,ROW(MAR!$E$2:$AF$249)-ROW(MAR!$J$2)+1),ROWS(C$3:C58))),\"\")","v":""},{"$f":"IFERROR(INDEX(MAR!C$2:C$249,SMALL(IF(INDEX(MAR!$E$2:$AF$249,,MATCH($H$1,MAR!$E$1:$AF$1,0))=$B$1,ROW(MAR!$E$2:$AF$249)-ROW(MAR!$J$2)+1),ROWS(D$3:D58))),\"\")","v":""},{"$f":"IFERROR(INDEX(MAR!D$2:D$249,SMALL(IF(INDEX(MAR!$E$2:$AF$249,,MATCH($H$1,MAR!$E$1:$AF$1,0))=$B$1,ROW(MAR!$E$2:$AF$249)-ROW(MAR!$J$2)+1),ROWS(E$3:E58))),\"\")","v":""}]
["",{"$f":"IFERROR(INDEX(MAR!B$2:B$249,SMALL(IF(INDEX(MAR!$E$2:$AF$249,,MATCH($H$1,MAR!$E$1:$AF$1,0))=$B$1,ROW(MAR!$E$2:$AF$249)-ROW(MAR!$J$2)+1),ROWS(C$3:C59))),\"\")","v":""},{"$f":"IFERROR(INDEX(MAR!C$2:C$249,SMALL(IF(INDEX(MAR!$E$2:$AF$249,,MATCH($H$1,MAR!$E$1:$AF$1,0))=$B$1,ROW(MAR!$E$2:$AF$249)-ROW(MAR!$J$2)+1),ROWS(D$3:D59))),\"\")","v":""},{"$f":"IFERROR(INDEX(MAR!D$2:D$249,SMALL(IF(INDEX(MAR!$E$2:$AF$249,,MATCH($H$1,MAR!$E$1:$AF$1,0))=$B$1,ROW(MAR!$E$2:$AF$249)-ROW(MAR!$J$2)+1),ROWS(E$3:E59))),\"\")","v":""}]
["",{"$f":"IFERROR(INDEX(MAR!B$2:B$249,SMALL(IF(INDEX(MAR!$E$2:$AF$249,,MATCH($H$1,MAR!$E$1:$AF$1,0))=$B$1,ROW(MAR!$E$2:$AF$249)-ROW(MAR!$J$2)+1),ROWS(C$3:C60))),\"\")","v":""},{"$f":"IFERROR(INDEX(MAR!C$2:C$249,SMALL(IF(INDEX(MAR!$E$2:$AF$249,,MATCH($H$1,MAR!$E$1:$AF$1,0))=$B$1,ROW(MAR!$E$2:$AF$249)-ROW(MAR!$J$2)+1),ROWS(D$3:D60))),\"\")","v":""},{"$f":"IFERROR(INDEX(MAR!D$2:D$249,SMALL(IF(INDEX(MAR!$E$2:$AF$249,,MATCH($H$1,MAR!$E$1:$AF$1,0))=$B$1,ROW(MAR!$E$2:$AF$249)-ROW(MAR!$J$2)+1),ROWS(E$3:E60))),\"\")","v":""}]
["",{"$f":"IFERROR(INDEX(MAR!B$2:B$249,SMALL(IF(INDEX(MAR!$E$2:$AF$249,,MATCH($H$1,MAR!$E$1:$AF$1,0))=$B$1,ROW(MAR!$E$2:$AF$249)-ROW(MAR!$J$2)+1),ROWS(C$3:C61))),\"\")","v":""},{"$f":"IFERROR(INDEX(MAR!C$2:C$249,SMALL(IF(INDEX(MAR!$E$2:$AF$249,,MATCH($H$1,MAR!$E$1:$AF$1,0))=$B$1,ROW(MAR!$E$2:$AF$249)-ROW(MAR!$J$2)+1),ROWS(D$3:D61))),\"\")","v":""},{"$f":"IFERROR(INDEX(MAR!D$2:D$249,SMALL(IF(INDEX(MAR!$E$2:$AF$249,,MATCH($H$1,MAR!$E$1:$AF$1,0))=$B$1,ROW(MAR!$E$2:$AF$249)-ROW(MAR!$J$2)+1),ROWS(E$3:E61))),\"\")","v":""}]

{"sheet":"Signatur","index":2,"n_rows":105,"n_cols":11,"rows_kept":105,"cut":false,"hidden":false,"merged":[[139,5,139,8],[131,5,131,8],[132,5,132,8],[133,5,133,8],[134,5,134,8],[135,5,135,8],[136,5,136,8],[125,5,125,8],[126,5,126,8],[127,5,127,8],[128,5,128,8],[129,5,129,8],[130,5,130,8],[118,5,118,8],[107,5,107,8],[108,5,108,8],[109,5,109,8],[110,5,110,8],[111,5,111,8],[112,5,112,8],[137,5,137,8],[138,5,138,8],[119,5,119,8],[120,5,120,8],[121,5,121,8],[122,5,122,8],[123,5,123,8],[124,5,124,8],[113,5,113,8],[114,5,114,8],[9,5,9,10],[10,5,10,10],[105,5,105,8],[106,5,106,8],[101,5,101,10],[102,5,102,10],[115,5,115,8],[116,5,116,8],[117,5,117,8],[11,5,11,10],[12,5,12,10],[13,5,13,10],[14,5,14,10],[15,5,15,10],[16,5,16,10],[17,5,17,10],[18,5,18,10],[19,5,19,10],[20,5,20,10],[21,5,21,10],[22,5,22,10],[23,5,23,10],[24,5,24,10],[25,5,25,10],[0,0,0,2],[1,0,1,2],[2,0,2,2],[3,0,3,2],[4,0,4,2],[7,5,7,10],[5,5,5,10],[6,5,6,10],[8,5,8,10],[0,6,0,10],[26,5,26,10],[27,5,27,10],[28,5,28,10],[29,5,29,10],[30,5,30,10],[31,5,31,10],[32,5,32,10],[33,5,33,10],[34,5,34,10],[35,5,35,10],[36,5,36,10],[37,5,37,10],[38,5,38,10],[39,5,39,10],[40,5,40,10],[41,5,41,10],[42,5,42,10],[43,5,43,10],[44,5,44,10],[45,5,45,10],[46,5,46,10],[47,5,47,10],[48,5,48,10],[49,5,49,10],[50,5,50,10],[51,5,51,10],[52,5,52,10],[53,5,53,10],[54,5,54,10],[55,5,55,10],[56,5,56,10],[57,5,57,10],[58,5,58,10],[59,5,59,10],[60,5,60,10],[61,5,61,10],[62,5,62,10],[63,5,63,10],[64,5,64,10],[77,5,77,10],[78,5,78,10],[79,5,79,10],[80,5,80,10],[81,5,81,10],[82,5,82,10],[65,5,65,10],[66,5,66,10],[67,5,67,10],[68,5,68,10],[69,5,69,10],[70,5,70,10],[71,5,71,10],[72,5,72,10],[73,5,73,10],[103,5,103,10],[104,5,104,10],[2,10,4,10],[92,5,92,10],[93,5,93,10],[94,5,94,10],[95,5,95,10],[96,5,96,10],[97,5,97,10],[98,5,98,10],[99,5,99,10],[100,5,100,10],[83,5,83,10],[84,5,84,10],[85,5,85,10],[86,5,86,10],[87,5,87,10],[88,5,88,10],[89,5,89,10],[90,5,90,10],[91,5,91,10],[74,5,74,10],[75,5,75,10],[76,5,76,10]]}
[null,null,null,null,"SHIFT",{"$f":"Preparation!B1","v":"M"}]
["Department",null,null,"Cost center","Date (H)","STAFF","DUTY","SUP","OFFICE",null,"NO SHOW"]
[null,null,null,null,{"$f":"Preparation!J1","v":"2018-03-02"},{"$f":"COUNT(Preparation!A4:A62)","v":54},{"$f":"COUNTIF($E$7:$E$105,$G$2)","v":1},{"$f":"COUNTIF($E$7:$E$105,$H$2)","v":0},{"$f":"COUNTIF($E$7:$E$105,$I$2)","v":0},{"$f":"COUNTIF($E$7:$E$105,$J$2)","v":0},{"$f":"F3-F5-G3-G5-H3-H5-I3-I5-J3-J5","v":53}]
["Division",null,null,"Location","Date (G)","BAGGAGE","ASST","TOC","AGENT"]
["Operations",null,null,null,{"$f":"Preparation!H1","v":"2018-03-02"},{"$f":"COUNTIF($E$7:$E$105,$F$4)","v":0},{"$f":"COUNTIF($E$7:$E$105,$G$4)","v":0},{"$f":"COUNTIF($E$7:$E$105,$H$4)","v":0},{"$f":"COUNTIF($E$7:$E$105,$I$4)","v":0},{"$f":"COUNTIF($E$7:$E$105,$J$4)","v":0}]
["NO","PRN","NAME","TIME IN","TAITTEL","NOTES"]
[{"$f":"IF($C7<>\"\",ROW()-6,\"\")","v":1},1020104,"Mohammed 5","21:38:26",{"$f":"IFERROR(INDEX(Preparation!$B$4:$D$62,MATCH($B7,Preparation!$B$4:$B$62,0),3),\"\")","v":"DUTY"}]
[{"$f":"IF($C8<>\"\",ROW()-6,\"\")","v":""},null,null,null,{"$f":"IFERROR(INDEX(Preparation!$B$4:$D$62,MATCH($B8,Preparation!$B$4:$B$62,0),3),\"\")","v":""}]
["",null,null,null,{"$f":"IFERROR(INDEX(Preparation!$B$4:$D$62,MATCH($B9,Preparation!$B$4:$B$62,0),3),\"\")","v":""}]
["",null,null,null,{"$f":"IFERROR(INDEX(Preparation!$B$4:$D$62,MATCH($B10,Preparation!$B$4:$B$62,0),3),\"\")","v":""}]
["",null,null,null,{"$f":"IFERROR(INDEX(Preparation!$B$4:$D$62,MATCH($B11,Preparation!$B$4:$B$62,0),3),\"\")","v":""}]
["",null,null,null,{"$f":"IFERROR(INDEX(Preparation!$B$4:$D$62,MATCH($B12,Preparation!$B$4:$B$62,0),3),\"\")","v":""}]
["",null,null,null,{"$f":"IFERROR(INDEX(Preparation!$B$4:$D$62,MATCH($B13,Preparation!$B$4:$B$62,0),3),\"\")","v":""}]
["",null,null,null,{"$f":"IFERROR(INDEX(Preparation!$B$4:$D$62,MATCH($B14,Preparation!$B$4:$B$62,0),3),\"\")","v":""}]
["",null,null,null,{"$f":"IFERROR(INDEX(Preparation!$B$4:$D$62,MATCH($B15,Preparation!$B$4:$B$62,0),3),\"\")","v":""}]
["",null,null,null,{"$f":"IFERROR(INDEX(Preparation!$B$4:$D$62,MATCH($B16,Preparation!$B$4:$B$62,0),3),\"\")","v":""}]
["",null,null,null,{"$f":"IFERROR(INDEX(Preparation!$B$4:$D$62,MATCH($B17,Preparation!$B$4:$B$62,0),3),\"\")","v":""}]
["",null,null,null,{"$f":"IFERROR(INDEX(Preparation!$B$4:$D$62,MATCH($B18,Preparation!$B$4:$B$62,0),3),\"\")","v":""}]
["",null,null,null,{"$f":"IFERROR(INDEX(Preparation!$B$4:$D$62,MATCH($B19,Preparation!$B$4:$B$62,0),3),\"\")","v":""}]
["",null,null,null,{"$f":"IFERROR(INDEX(Preparation!$B$4:$D$62,MATCH($B20,Preparation!$B$4:$B$62,0),3),\"\")","v":""}]
["",null,null,null,{"$f":"IFERROR(INDEX(Preparation!$B$4:$D$62,MATCH($B21,Preparation!$B$4:$B$62,0),3),\"\")","v":""}]
["",null,null,null,{"$f":"IFERROR(INDEX(Preparation!$B$4:$D$62,MATCH($B22,Preparation!$B$4:$B$62,0),3),\"\")","v":""}]
["",null,null,null,{"$f":"IFERROR(INDEX(Preparation!$B$4:$D$62,MATCH($B23,Preparation!$B$4:$B$62,0),3),\"\")","v":""}]
["",null,null,null,{"$f":"IFERROR(INDEX(Preparation!$B$4:$D$62,MATCH($B24,Preparation!$B$4:$B$62,0),3),\"\")","v":""}]
["",null,null,null,{"$f":"IFERROR(INDEX(Preparation!$B$4:$D$62,MATCH($B25,Preparation!$B$4:$B$62,0),3),\"\")","v":""}]
["",null,null,null,{"$f":"IFERROR(INDEX(Preparation!$B$4:$D$62,MATCH($B26,Preparation!$B$4:$B$62,0),3),\"\")","v":""}]
["",null,null,null,{"$f":"IFERROR(INDEX(Preparation!$B$4:$D$62,MATCH($B27,Preparation!$B$4:$B$62,0),3),\"\")","v":""}]
["",null,null,null,{"$f":"IFERROR(INDEX(Preparation!$B$4:$D$62,MATCH($B28,Preparation!$B$4:$B$62,0),3),\"\")","v":""}]
["",null,null,null,{"$f":"IFERROR(INDEX(Preparation!$B$4:$D$62,MATCH($B29,Preparation!$B$4:$B$62,0),3),\"\")","v":""}]
["",null,null,null,{"$f":"IFERROR(INDEX(Preparation!$B$4:$D$62,MATCH($B30,Preparation!$B$4:$B$62,0),3),\"\")","v":""}]
["",null,null,null,{"$f":"IFERROR(INDEX(Preparation!$B$4:$D$62,MATCH($B31,Preparation!$B$4:$B$62,0),3),\"\")","v":""}]
["",null,null,null,{"$f":"IFERROR(INDEX(Preparation!$B$4:$D$62,MATCH($B32,Preparation!$B$4:$B$62,0),3),\"\")","v":""}]
["",null,null,null,{"$f":"IFERROR(INDEX(Preparation!$B$4:$D$62,MATCH($B33,Preparation!$B$4:$B$62,0),3),\"\")","v":""}]
["",null,null,null,{"$f":"IFERROR(INDEX(Preparation!$B$4:$D$62,MATCH($B34,Preparation!$B$4:$B$62,0),3),\"\")","v":""}]
["",null,null,null,{"$f":"IFERROR(INDEX(Preparation!$B$4:$D$62,MATCH($B35,Preparation!$B$4:$B$62,0),3),\"\")","v":""}]
["",null,null,null,{"$f":"IFERROR(INDEX(Preparation!$B$4:$D$62,MATCH($B36,Preparation!$B$4:$B$62,0),3),\"\")","v":""}]
["",null,null,null,{"$f":"IFERROR(INDEX(Preparation!$B$4:$D$62,MATCH($B37,Preparation!$B$4:$B$62,0),3),\"\")","v":""}]
["",null,null,null,{"$f":"IFERROR(INDEX(Preparation!$B$4:$D$62,MATCH($B38,Preparation!$B$4:$B$62,0),3),\"\")","v":""}]
["",null,null,null,{"$f":"IFERROR(INDEX(Preparation!$B$4:$D$62,MATCH($B39,Preparation!$B$4:$B$62,0),3),\"\")","v":""}]
["",null,null,null,{"$f":"IFERROR(INDEX(Preparation!$B$4:$D$62,MATCH($B40,Preparation!$B$4:$B$62,0),3),\"\")","v":""}]
["",null,null,null,{"$f":"IFERROR(INDEX(Preparation!$B$4:$D$62,MATCH($B41,Preparation!$B$4:$B$62,0),3),\"\")","v":""}]
["",null,null,null,{"$f":"IFERROR(INDEX(Preparation!$B$4:$D$62,MATCH($B42,Preparation!$B$4:$B$62,0),3),\"\")","v":""}]
["",null,null,null,{"$f":"IFERROR(INDEX(Preparation!$B$4:$D$62,MATCH($B43,Preparation!$B$4:$B$62,0),3),\"\")","v":""}]
["",null,null,null,{"$f":"IFERROR(INDEX(Preparation!$B$4:$D$62,MATCH($B44,Preparation!$B$4:$B$62,0),3),\"\")","v":""}]
["",null,null,null,{"$f":"IFERROR(INDEX(Preparation!$B$4:$D$62,MATCH($B45,Preparation!$B$4:$B$62,0),3),\"\")","v":""}]
["",null,null,null,{"$f":"IFERROR(INDEX(Preparation!$B$4:$D$62,MATCH($B46,Preparation!$B$4:$B$62,0),3),\"\")","v":""}]
["",null,null,null,{"$f":"IFERROR(INDEX(Preparation!$B$4:$D$62,MATCH($B47,Preparation!$B$4:$B$62,0),3),\"\")","v":""}]
["",null,null,null,{"$f":"IFERROR(INDEX(Preparation!$B$4:$D$62,MATCH($B48,Preparation!$B$4:$B$62,0),3),\"\")","v":""}]
["",null,null,null,{"$f":"IFERROR(INDEX(Preparation!$B$4:$D$62,MATCH($B49,Preparation!$B$4:$B$62,0),3),\"\")","v":""}]
["",null,null,null,{"$f":"IFERROR(INDEX(Preparation!$B$4:$D$62,MATCH($B50,Preparation!$B$4:$B$62,0),3),\"\")","v":""}]
["",null,null,null,{"$f":"IFERROR(INDEX(Preparation!$B$4:$D$62,MATCH($B51,Preparation!$B$4:$B$62,0),3),\"\")","v":""}]
["",null,null,null,{"$f":"IFERROR(INDEX(Preparation!$B$4:$D$62,MATCH($B52,Preparation!$B$4:$B$62,0),3),\"\")","v":""}]
["",null,null,null,{"$f":"IFERROR(INDEX(Preparation!$B$4:$D$62,MATCH($B53,Preparation!$B$4:$B$62,0),3),\"\")","v":""}]
["",null,null,null,{"$f":"IFERROR(INDEX(Preparation!$B$4:$D$62,MATCH($B54,Preparation!$B$4:$B$62,0),3),\"\")","v":""}]
["",null,null,null,{"$f":"IFERROR(INDEX(Preparation!$B$4:$D$62,MATCH($B55,Preparation!$B$4:$B$62,0),3),\"\")","v":""}]
["",null,null,null,{"$f":"IFERROR(INDEX(Preparation!$B$4:$D$62,MATCH($B56,Preparation!$B$4:$B$62,0),3),\"\")","v":""}]
["",null,null,null,{"$f":"IFERROR(INDEX(Preparation!$B$4:$D$62,MATCH($B57,Preparation!$B$4:$B$62,0),3),\"\")","v":""}]
["",null,null,null,{"$f":"IFERROR(INDEX(Preparation!$B$4:$D$62,MATCH($B58,Preparation!$B$4:$B$62,0),3),\"\")","v":""}]
["",null,null,null,{"$f":"IFERROR(INDEX(Preparation!$B$4:$D$62,MATCH($B59,Preparation!$B$4:$B$62,0),3),\"\")","v":""}]
["",null,null,null,{"$f":"IFERROR(INDEX(Preparation!$B$4:$D$62,MATCH($B60,Preparation!$B$4:$B$62,0),3),\"\")","v":""}]
["",null,null,null,{"$f":"IFERROR(INDEX(Preparation!$B$4:$D$62,MATCH($B61,Preparation!$B$4:$B$62,0),3),\"\")","v":""}]
["",null,null,null,{"$f":"IFERROR(INDEX(Preparation!$B$4:$D$62,MATCH($B62,Preparation!$B$4:$B$62,0),3),\"\")","v":""}]
["",null,null,null,{"$f":"IFERROR(INDEX(Preparation!$B$4:$D$62,MATCH($B63,Preparation!$B$4:$B$62,0),3),\"\")","v":""}]
["",null,null,null,{"$f":"IFERROR(INDEX(Preparation!$B$4:$D$62,MATCH($B64,Preparation!$B$4:$B$62,0),3),\"\")","v":""}]
["",null,null,null,{"$f":"IFERROR(INDEX(Preparation!$B$4:$D$62,MATCH($B65,Preparation!$B$4:$B$62,0),3),\"\")","v":""}]
["",null,null,null,{"$f":"IFERROR(INDEX(Preparation!$B$4:$D$62,MATCH($B66,Preparation!$B$4:$B$62,0),3),\"\")","v":""}]
["",null,null,null,{"$f":"IFERROR(INDEX(Preparation!$B$4:$D$62,MATCH($B67,Preparation!$B$4:$B$62,0),3),\"\")","v":""}]
["",null,null,null,{"$f":"IFERROR(INDEX(Preparation!$B$4:$D$62,MATCH($B68,Preparation!$B$4:$B$62,0),3),\"\")","v":""}]
["",null,null,null,{"$f":"IFERROR(INDEX(Preparation!$B$4:$D$62,MATCH($B69,Preparation!$B$4:$B$62,0),3),\"\")","v":""}]
["",null,null,null,{"$f":"IFERROR(INDEX(Preparation!$B$4:$D$62,MATCH($B70,Preparation!$B$4:$B$62,0),3),\"\")","v":""}]
["",null,null,null,{"$f":"IFERROR(INDEX(Preparation!$B$4:$D$62,MATCH($B71,Preparation!$B$4:$B$62,0),3),\"\")","v":""}]
[{"$f":"IF($C72<>\"\",ROW()-6,\"\")","v":""},null,null,null,{"$f":"IFERROR(INDEX(Preparation!$B$4:$D$62,MATCH($B72,Preparation!$B$4:$B$62,0),3),\"\")","v":""}]
["",null,null,null,{"$f":"IFERROR(INDEX(Preparation!$B$4:$D$62,MATCH($B73,Preparation!$B$4:$B$62,0),3),\"\")","v":""}]
["",null,null,null,{"$f":"IFERROR(INDEX(Preparation!$B$4:$D$62,MATCH($B74,Preparation!$B$4:$B$62,0),3),\"\")","v":""}]
["",null,null,null,{"$f":"IFERROR(INDEX(Preparation!$B$4:$D$62,MATCH($B75,Preparation!$B$4:$B$62,0),3),\"\")","v":""}]
["",null,null,null,{"$f":"IFERROR(INDEX(Preparation!$B$4:$D$62,MATCH($B76,Preparation!$B$4:$B$62,0),3),\"\")","v":""}]
["",null,null,null,{"$f":"IFERROR(INDEX(Preparation!$B$4:$D$62,MATCH($B77,Preparation!$B$4:$B$62,0),3),\"\")","v":""}]
["",null,null,null,{"$f":"IFERROR(INDEX(Preparation!$B$4:$D$62,MATCH($B78,Preparation!$B$4:$B$62,0),3),\"\")","v":""}]
["",null,null,null,{"$f":"IFERROR(INDEX(Preparation!$B$4:$D$62,MATCH($B79,Preparation!$B$4:$B$62,0),3),\"\")","v":""}]
["",null,null,null,{"$f":"IFERROR(INDEX(Preparation!$B$4:$D$62,MATCH($B80,Preparation!$B$4:$B$62,0),3),\"\")","v":""}]
["",null,null,null,{"$f":"IFERROR(INDEX(Preparation!$B$4:$D$62,MATCH($B81,Preparation!$B$4:$B$62,0),3),\"\")","v":""}]
["",null,null,null,{"$f":"IFERROR(INDEX(Preparation!$B$4:$D$62,MATCH($B82,Preparation!$B$4:$B$62,0),3),\"\")","v":""}]
["",null,null,null,{"$f":"IFERROR(INDEX(Preparation!$B$4:$D$62,MATCH($B83,Preparation!$B$4:$B$62,0),3),\"\")","v":""}]
["",null,null,null,{"$f":"IFERROR(INDEX(Preparation!$B$4:$D$62,MATCH($B84,Preparation!$B$4:$B$62,0),3),\"\")","v":""}]
["",null,null,null,{"$f":"IFERROR(INDEX(Preparation!$B$4:$D$62,MATCH($B85,Preparation!$B$4:$B$62,0),3),\"\")","v":""}]
["",null,null,null,{"$f":"IFERROR(INDEX(Preparation!$B$4:$D$62,MATCH($B86,Preparation!$B$4:$B$62,0),3),\"\")","v":""}]
["",null,null,null,{"$f":"IFERROR(INDEX(Preparation!$B$4:$D$62,MATCH($B87,Preparation!$B$4:$B$62,0),3),\"\")","v":""}]
["",null,null,null,{"$f":"IFERROR(INDEX(Preparation!$B$4:$D$62,MATCH($B88,Preparation!$B$4:$B$62,0),3),\"\")","v":""}]
["",null,null,null,{"$f":"IFERROR(INDEX(Preparation!$B$4:$D$62,MATCH($B89,Preparation!$B$4:$B$62,0),3),\"\")","v":""}]
["",null,null,null,{"$f":"IFERROR(INDEX(Preparation!$B$4:$D$62,MATCH($B90,Preparation!$B$4:$B$62,0),3),\"\")","v":""}]
["",null,null,null,{"$f":"IFERROR(INDEX(Preparation!$B$4:$D$62,MATCH($B91,Preparation!$B$4:$B$62,0),3),\"\")","v":""}]
["",null,null,null,{"$f":"IFERROR(INDEX(Preparation!$B$4:$D$62,MATCH($B92,Preparation!$B$4:$B$62,0),3),\"\")","v":""}]
["",null,null,null,{"$f":"IFERROR(INDEX(Preparation!$B$4:$D$62,MATCH($B93,Preparation!$B$4:$B$62,0),3),\"\")","v":""}]
["",null,null,null,{"$f":"IFERROR(INDEX(Preparation!$B$4:$D$62,MATCH($B94,Preparation!$B$4:$B$62,0),3),\"\")","v":""}]
["",null,null,null,{"$f":"IFERROR(INDEX(Preparation!$B$4:$D$62,MATCH($B95,Preparation!$B$4:$B$62,0),3),\"\")","v":""}]
["",null,null,null,{"$f":"IFERROR(INDEX(Preparation!$B$4:$D$62,MATCH($B96,Preparation!$B$4:$B$62,0),3),\"\")","v":""}]
["",null,null,null,{"$f":"IFERROR(INDEX(Preparation!$B$4:$D$62,MATCH($B97,Preparation!$B$4:$B$62,0),3),\"\")","v":""}]
["",null,null,null,{"$f":"IFERROR(INDEX(Preparation!$B$4:$D$62,MATCH($B98,Preparation!$B$4:$B$62,0),3),\"\")","v":""}]
["",null,null,null,{"$f":"IFERROR(INDEX(Preparation!$B$4:$D$62,MATCH($B99,Preparation!$B$4:$B$62,0),3),\"\")","v":""}]
["",null,null,null,{"$f":"IFERROR(INDEX(Preparation!$B$4:$D$62,MATCH($B100,Preparation!$B$4:$B$62,0),3),\"\")","v":""}]
["",null,null,null,{"$f":"IFERROR(INDEX(Preparation!$B$4:$D$62,MATCH($B101,Preparation!$B$4:$B$62,0),3),\"\")","v":""}]
["",null,null,null,{"$f":"IFERROR(INDEX(Preparation!$B$4:$D$62,MATCH($B102,Preparation!$B$4:$B$62,0),3),\"\")","v":""}]
["",null,null,null,{"$f":"IFERROR(INDEX(Preparation!$B$4:$D$62,MATCH($B103,Preparation!$B$4:$B$62,0),3),\"\")","v":""}]
["",null,null,null,{"$f":"IFERROR(INDEX(Preparation!$B$4:$D$62,MATCH($B104,Preparation!$B$4:$B$62,0),3),\"\")","v":""}]
["",null,null,null,{"$f":"IFERROR(INDEX(Preparation!$B$4:$D$62,MATCH($B105,Preparation!$B$4:$B$62,0),3),\"\")","v":""}]

{"sheet":"Cod","index":3,"n_rows":32,"n_cols":3,"rows_kept":32,"cut":false,"hidden":false,"merged":[]}
["Duty","DATE"]
["M","2018-03-01","2018-02-01"]
["A","2018-03-02","2018-02-02"]
["H","2018-03-03","2018-02-03"]
["حاضر","2018-03-04","2018-02-04"]
["غائب","2018-03-05","2018-02-05"]
["إجازة مرضية","2018-03-06","2018-02-06"]
["مستأذن دخول","2018-03-07","2018-02-07"]
["مستأذن خروج","2018-03-08","2018-02-08"]
["إجازة سنوية","2018-03-09","2018-02-09"]
[null,"2018-03-10","2018-02-10"]
[null,"2018-03-11","2018-02-11"]
[null,"2018-03-12","2018-02-12"]
[null,"2018-03-13","2018-02-13"]
[null,"2018-03-14","2018-02-14"]
[null,"2018-03-15","2018-02-15"]
[null,"2018-03-16","2018-02-16"]
[null,"2018-03-17","2018-02-17"]
[null,"2018-03-18","2018-02-18"]
[null,"2018-03-19","2018-02-19"]
[null,"2018-03-20","2018-02-20"]
[null,"2018-03-21","2018-02-21"]
[null,"2018-03-22","2018-02-22"]
[null,"2018-03-23","2018-02-23"]
[null,"2018-03-24","2018-02-24"]
[null,"2018-03-25","2018-02-25"]
[null,"2018-03-26","2018-02-26"]
[null,"2018-03-27","2018-02-27"]
[null,"2018-03-28","2018-02-28"]
[null,"2018-03-29"]
[null,"2018-03-30"]
[null,"2018-03-31"]