{"text_format":"1","workbook":"xlsx","n_sheets":3,"sheets":["ورقة1","العاملين ","الاستمارة "],"not_rendered":{"charts":0,"images":0,"macros":0,"external_links":0,"defined_names":3,"comments":3,"pivot_tables":0},"unopened":[],"bounds":{"document_bytes":16777216,"sheet_cells":100000,"rows_first":2000,"rows_last":500,"rows_between":2000,"halvings":0,"cell_chars":16384,"cell_head_chars":4096},"cells_cut":0,"cells_raw":0,"read":"whole","date_system":"1900"}

{"sheet":"ورقة1","index":0,"n_rows":9,"n_cols":12,"rows_kept":9,"cut":false,"hidden":false,"merged":[[5,0,5,1],[6,0,6,1],[6,11,7,20],[7,0,7,1],[0,0,0,1],[1,0,1,1],[1,11,4,13],[2,0,2,1],[3,0,3,1],[4,0,4,1]]}
["إدارة ",null,"الشهداء التعليمية","بيانات العاملين "]
["مدرسة ",null,"السوالمية","الاستمارة ",null,null,null,null,null,null,null,"صمم هذا البرنامج اخوكم فى الله أ/محمد محمد عبد الله عبد الصمد رئيس قسم التدريب بادارة الشهداء نسألكم الدعاء بظاهرالغيب"]
["شهر ",null,"مارس 2018","خلف الاستمارة "]
["مدير المدرسة",null,"محمد","فردية "]
["سنة ",null,2018,"خلف فردية "]
["مسئول المرتبات",null,"محمد"]
[null,null,null,null,null,null,null,null,null,null,null,"يجب توزيع عدد العاملين على مجموعة من الكشوف بواقع 25 عامل للكشف على أن يكون كشف التجميعه من ضمن الكشوف فمثلا 50 عامل توزع 25كشف 1 و23 للكشف 2 وعدد 2عامل لكشف التجميعة ،خانة التوقيع بالاستلام اكتب فيها رقم العامل الموجودفى البيانات ، تأكد من عدم وجود بيانات فى الكشوف الغير مستعمله وذلكبالذهاب للكشف والضغطعلى مفتاحمسح البيانات فى يسار الكشف"]
[]
{"$rows_left_out":2}
{"sheet":"العاملين ","index":1,"n_rows":463,"n_cols":143,"rows_kept":463,"cut":false,"hidden":false,"merged":[[0,41,0,45],[0,63,0,72],[1,0,2,0],[1,1,2,1],[1,2,2,2],[1,3,2,3],[1,4,2,4],[1,5,2,5],[1,7,2,7],[1,13,2,13],[1,14,2,14],[1,15,2,15],[1,16,2,16],[0,7,0,10],[1,8,2,8],[1,9,2,9],[1,10,2,10],[1,11,2,11],[1,12,2,12],[1,17,2,17],[1,18,2,18],[1,31,2,31],[1,20,2,20],[1,21,2,21],[1,22,2,22],[1,23,2,23],[1,24,2,24],[1,25,2,25],[1,26,2,26],[1,19,2,19],[1,27,2,27],[1,28,2,28],[1,29,2,29],[1,30,2,30],[1,32,2,32],[1,33,2,33],[1,34,2,34],[1,35,2,35],[1,36,2,36],[1,57,2,57],[1,58,2,58],[1,59,2,59],[1,60,2,60],[1,37,2,37],[1,38,2,38],[1,39,2,39],[1,40,2,40],[1,41,2,41],[1,42,2,42],[1,44,1,47],[1,49,2,49],[1,50,2,50],[1,51,2,51],[1,52,1,56],[1,43,2,43],[1,61,2,61],[1,62,2,62],[1,82,2,82],[4,75,4,77],[6,75,6,77],[1,64,2,64],[1,65,2,65],[1,66,2,66],[1,67,2,67],[1,68,2,68],[1,63,2,63],[1,69,2,69],[9,75,9,77],[10,75,10,77],[1,70,2,70],[1,71,2,71],[1,72,2,72]]}
[null,null,null,null,null,null,null,"استحقاقات",null,null,null,null,null,null,null,null,null,null,null,null,null,null,null,null,null,null,null,null,null,null,null,null,null,null,null,null,null,null,null,null,null,"استقطاعات",null,null,null,null,null,null,null,null,null,null,null,null,null,null,null,null,null,null,null,null,null,"الخلايا الحمراء لا تدخل بها بيانات فهى تحسب نفسها"]
["م","الاســــــــــــم ","نقابي","نقابى /غيرنقابى","الحالة الاجتماعية","اكتب 1 للحاصل على ال 33%",null,"الوظيفة","المرتب الذى يحسب عليه الكادر","المرتب الاساسي ","علاوة  2012 ","علاوة   2013","علاوة  2014  ","علاةة   2015 ","علاوة   2016 ","ع اجتماعية","ع اجتماعيةاضافية","أعباء وظيفية","بدل نظارة","حافز مدير","بدل تفرغ","بدل تجاريين","بدل عدوي","حافز ماجستير","حافزدكتوراة","بدل تسكين","الحدالادنى","اكتب ما تشاء","اكتب ما تشاء","اكتب ما تشاء","اكتب ما تشاء","اكتب ما تشاء","اكتب ما تشاء","اكتب ما تشاء","اكتب ما تشاء","نقابة اجتماعية","نقابة تطبيقين ","رابطه","ضريبة الدخل ","دمغة عادية   ","دمغة نسبيه  ","أرباب عهد","خدمات عمالية","نقابة بحث علمى 5%","اقساط بنوك",null,null,null,null,"نصف العلاوة","ايرادات تربيةوتعليم","انقطاع ","للحالات خاصة فقط",null,null,null,null,"اكتب ماتشاء","اكتب ماتشاء","اكتب ماتشاء","اكتب ماتشاء","اكتب ماتشاء","اكتب ماتشاء","منحة","بدل معلم اضافى","بدل معلم ","بدل اعتماد ","حافز 25 %","حافز أداء ","الـ91.5","ال50%","ال 33%","الحد الادنى",null,null,null,null,null,null,null,null,null,"الوظيفة "]
[null,null,null,null,null,null,"الرقم القومى",null,null,null,null,null,null,null,null,null,null,null,null,null,null,null,null,null,null,null,null,null,null,null,null,null,null,null,null,null,null,null,null,null,null,null,null,null,"ناصر","القاهرة","الاهلى","اكتب ما تشاء","اكتب اسم البنك",null,null,null,"زمالة","جماعى","نقابة ","نادى المحافطة ","نادى الادارة",null,null,null,null,null,null,null,null,null,null,null,null,null,null,null,null,null,null,null,null,null,null,null,null,null,null,null,null,"حافز 25%","حافزأداء"]
[1,"محمد1",{"$f":"IF(D4=\"نقابى\",1,IF(D4=\"حالة خاصة\",2,0))","v":1},"نقابى","متزوج+2",0,null,"معلم",666.98,1000,null,62.23,62.73,66.69,null,4,{"$f":"IF(E4=\"متزوج\",2,IF(E4=\"متزوج+1\",4,IF(E4=\"متزوج+2\",6,IF(E4=\"متزوجة\",2,0))))","v":6},350,null,null,null,null," ",null,null,null,{"$f":"BU4","v":0},null,null,null,null,null,null,null,null,null,4,1,7.25,15.45,null,null,0,null,null,null,null,null,"khwv",null,null," ",5,5,5,5,5,null,null,null,null,null,null,{"$f":"IF(H4=\"معلم مساعد\",10,IF(H4=\"معلم تعاقد\",10,IF(H4=\"معلم\",10,IF(H4=\"معلم أول\",10,IF(H4=\"معلم أول أ\",10,IF(H4=\"خبير\",10,IF(H4=\"كبير\",10,IF(H4=\"عامل تعاقد\",0,\"\"))))))))","v":10},{"$f":"IF(H4=\"معلم مساعد\",I4*0/100,IF(H4=\"معلم تعاقد\",I4*0/100,IF(H4=\"معلم\",I4*50/100,IF(H4=\"معلم أول\",I4*50/100,IF(H4=\"معلم أول أ\",I4*50/100,IF(H4=\"خبير\",I4*50/100,IF(H4=\"كبير\",I4*50/100,)))))))","v":333.49},{"$f":"IF(H4=\"معلم مساعد\",I4*50/100,IF(H4=\"عامل تعاقد\",I4*0/100,IF(H4=\"معلم\",I4*50/100,IF(H4=\"معلم أول\",I4*50/100,IF(H4=\"معلم أول أ\",I4*50/100,IF(H4=\"خبير\",I4*50/100,IF(H4=\"كبير\",I4*50/100,)))))))","v":333.49},{"$f":"IF(H4=\"إدارى\",I4*0,IF(H4=\"معلم مساعد\",I4*0/100,IF(H4=\"معلم\",I4*50/100,IF(H4=\"معلم أول\",I4*75/100,IF(H4=\"معلم أول أ\",I4*100/100,IF(H4=\"خبير\",I4*125/100,IF(H4=\"كبير\",I4*150/100,)))))))","v":333.49},{"$f":"INT(IF(H4=\"عامل تعاقد\",I4*25/100,IF(H4=\"معلم مساعد\",I4*25/100,IF(H4=\"معلم\",I4*25/100,IF(H4=\"معلم أول\",I4*25/100,IF(H4=\"معلم أول أ\",I4*25/100,IF(H4=\"خبير\",I4*25/100,IF(H4=\"كبير\",I4*25/100,))))))))","v":166},{"$f":"INT(IF(H4=\"إدارى\",J4*0/100,IF(H4=\"معلم مساعد\",I4*125/100,IF(H4=\"معلم\",I4*75/100,IF(H4=\"معلم أول\",I4*50/100,IF(H4=\"معلم أول أ\",I4*25/100,IF(H4=\"خبير\",I4*25/100,IF(H4=\"كبير\",I4*25/100,))))))))","v":500},{"$f":"INT(IF(H4=\"عامل تعاقد\",I4*0.9166,IF(H4=\"معلم تعاقد\",I4*0.9166,0)))","v":0},{"$f":"INT(IF(H4=\"عامل تعاقد\",I4*0.5,IF(H4=\"معلم تعاقد\",I4*0.5,0)))","v":0},{"$f":"INT(IF(F4=1,I4*0.3333,0))","v":0},{"$f":"IF(H4=\"عامل تعاقد\",225,IF(H4=\"معلم تعاقد\",300,0))","v":0},null,null,null,null,null,null,{"$f":"IF($B4>0,(SUM(R4:AD4)-50),0)","v":300},{"$f":"IF(CB4<250,(CB4*0.006),IF(CB4<500,(CB4*0.0065),IF(CB4<1000,(CB4*0.007),IF(CB4<5000,(CB4*0.0075),IF(CB4>5000,(CB4*0.008),\" \" )))))","v":1.95},{"$f":"CEILING($CC4,0.05)","v":1.9500000000000002},"كبير",null,null,null,{"$f":"#VALUE!","v":{"$error":"#VALUE!"}}]
[2,"محمد2",1,"نقابى","متزوجة",0,null,"معلم أول أ",566.52,938.62,null,52.79,53.29,56.69,null,4,{"$f":"IF(E5=\"متزوج\",2,IF(E5=\"متزوج+1\",4,IF(E5=\"متزوج+2\",6,IF(E5=\"متزوجة\",2,0))))","v":2},null,null,null,null,null,null,null,null,null,{"$f":"BU5","v":0},null,null,null,null,null,null,null,null,null,null,1,26.73,14.95,null,null,null,null,null,null,null,null,null,null,4,null,null,null,null,null,null,null," ",null,null,null,null,{"$f":"IF(H5=\"معلم مساعد\",10,IF(H5=\"معلم تعاقد\",10,IF(H5=\"معلم\",10,IF(H5=\"معلم أول\",10,IF(H5=\"معلم أول أ\",10,IF(H5=\"خبير\",10,IF(H5=\"كبير\",10,IF(H5=\"عامل تعاقد\",0,\"\"))))))))","v":10},{"$f":"IF(H5=\"عقد مميز\",I5*0/100,IF(H5=\"معلم تعاقد\",I5*0/100,IF(H5=\"معلم\",I5*50/100,IF(H5=\"معلم أول\",I5*50/100,IF(H5=\"معلم أول أ\",I5*50/100,IF(H5=\"خبير\",I5*50/100,IF(H5=\"كبير\",I5*50/100,)))))))","v":283.26},{"$f":"IF(H5=\"معلم مساعد\",I5*50/100,IF(H5=\"عامل تعاقد\",I5*0/100,IF(H5=\"معلم\",I5*50/100,IF(H5=\"معلم أول\",I5*50/100,IF(H5=\"معلم أول أ\",I5*50/100,IF(H5=\"خبير\",I5*50/100,IF(H5=\"كبير\",I5*50/100,)))))))","v":283.26},{"$f":"IF(H5=\"إدارى\",I5*0,IF(H5=\"معلم مساعد\",I5*0/100,IF(H5=\"معلم\",I5*50/100,IF(H5=\"معلم أول\",I5*75/100,IF(H5=\"معلم أول أ\",I5*100/100,IF(H5=\"خبير\",I5*125/100,IF(H5=\"كبير\",I5*150/100,)))))))","v":566.52},{"$f":"INT(IF(H5=\"عامل تعاقد\",I5*25/100,IF(H5=\"معلم مساعد\",I5*25/100,IF(H5=\"معلم\",I5*25/100,IF(H5=\"معلم أول\",I5*25/100,IF(H5=\"معلم أول أ\",I5*25/100,IF(H5=\"خبير\",I5*25/100,IF(H5=\"كبير\",I5*25/100,))))))))","v":141},{"$f":"INT(IF(H5=\"إدارى\",J5*0/100,IF(H5=\"معلم مساعد\",I5*125/100,IF(H5=\"معلم\",I5*75/100,IF(H5=\"معلم أول\",I5*50/100,IF(H5=\"معلم أول أ\",I5*25/100,IF(H5=\"خبير\",I5*25/100,IF(H5=\"كبير\",I5*25/100,))))))))","v":141},{"$f":"INT(IF(H5=\"عامل تعاقد\",I5*0.9166,IF(H5=\"معلم تعاقد\",I5*0.9166,0)))","v":0},{"$f":"INT(IF(H5=\"عامل تعاقد\",I5*0.5,IF(H5=\"معلم تعاقد\",I5*0.5,0)))","v":0},{"$f":"INT(IF(F5=1,I5*0.3333,0))","v":0},{"$f":"IF(H5=\"عامل تعاقد\",225,IF(H5=\"معلم تعاقد\",300,0))","v":0},null,null,"الحد الاقصي للمتغيرات فى الشهر",null,null,2800,-50,-0.3,-0.30000000000000004,"خبير",null,null,{"$f":"#VALUE!","v":{"$error":"#VALUE!"}},{"$f":"#VALUE!","v":{"$error":"#VALUE!"}}]
[3,"محمد3",1,"نقابى","متزوج+2",0,null,"معلم",566.52,938.62,null,52.79,53.29,56.69,null,4,6,null,null,null,null,null,null,null,null,null,0,null,null,null,null,null,null,null,null,null,null,1,26.73,14.95,null,null,null,null,null,null,null,null,null,null,4,null,null,null,null,null,null,null," ",null,null,null,null,10,{"$f":"IF(H6=\"عقد مميز\",I6*0/100,IF(H6=\"معلم تعاقد\",I6*0/100,IF(H6=\"معلم\",I6*50/100,IF(H6=\"معلم أول\",I6*50/100,IF(H6=\"معلم أول أ\",I6*50/100,IF(H6=\"خبير\",I6*50/100,IF(H6=\"كبير\",I6*50/100,)))))))","v":283.26},283.26,283.26,141,424,0,0,0,0,null,null,null,null,null,null,-50,-0.3,-0.30000000000000004,"معلم أول أ",null,null,{"$f":"#VALUE!","v":{"$error":"#VALUE!"}},{"$f":"#VALUE!","v":{"$error":"#VALUE!"}},null,null,null,null,null,null,null,null,null,null,null,null,null,null,null,null,null,null,null,null,null,null,null,null,null,null,null,null,null,null,null,null,null,null,null,null,null,null,null,null,null,null,null,null,null,null,null,null,null,null,null,null,null,null,null,"معلم"]
[4,"محمد4",1,"نقابى","متزوج+2",0,null,"معلم أول",511.02,854.21,null,47.01,47.51,51.1,null,4,6,null,null,null,null,null,null,null,null,null,0,null,null,null,null,null,null,null,null,null,null,1,22.26,13.75,null,null,null,null,null,null,null,null,null,null,null,null,null,null,null,null,null,null,null,null,null,null,null,10,255.51,255.51,383.26499999999999,127,255,0,0,0,0,null,null,"الحد الاقصي للمتغيرات  فى السنة",null,null,{"$f":"CA5*12","v":33600},-50,-0.3,-0.30000000000000004,"معلم أول",null,null,{"$f":"#VALUE!","v":{"$error":"#VALUE!"}},{"$f":"#VALUE!","v":{"$error":"#VALUE!"}},null,null,null,"نقابى",null,null,null,null,null,null,null,null,null,null,null,null,null,null,null,null,null,null,null,null,null,null,null,null,null,null,null,null,null,null,null,null,null,null,null,null,null,null,null,null,null,null,null,null,null,null,null,null,null,null,null,"معلم اول"]
[5,"محمد5",1,"نقابى","متزوج+2",0,null,"معلم أول",536.12,891.32,null,49.89,50.39,53.61,null,4,6,null,null,null,null,null,null,null,null,null,0,null,null,null,null,null,null,null,null,null,null,1,19.72,14.35,null,null,null,null,null,null,null,null,null,null,null,null,null,null,null,null,null,null,null,null,null,null,null,10,268.06,268.06,402.09,134,268,0,0,0,0,null,null,null,null,null,null,-50,-0.3,-0.30000000000000004,"معلم",null,null,{"$f":"#VALUE!","v":{"$error":"#VALUE!"}},{"$f":"#VALUE!","v":{"$error":"#VALUE!"}},null,null,null,"غير نقابى",null,null,null,null,null,null,null,null,null,null,null,null,null,null,null,null,null,null,null,null,null,null,null,null,null,null,null,null,null,null,null,null,null,null,null,null,null,null,null,null,null,null,null,null,null,null,null,null,null,null,null,"معلم اول ا"]
{"$rows_left_out":456}
{"sheet":"الاستمارة ","index":2,"n_rows":24,"n_cols":108,"rows_kept":24,"cut":false,"hidden":false,"merged":[[2,45,2,46],[2,47,2,49],[2,87,2,89],[23,4,23,6],[23,7,23,10],[23,29,23,31],[23,26,23,28],[23,86,23,87],[23,88,23,89],[23,90,23,91],[2,8,2,11],[2,29,2,32],[3,93,6,93],[2,54,2,58],[2,59,2,73],[3,2,3,51],[3,53,6,53],[3,54,3,86],[4,1,6,1],[4,2,5,6],[4,7,6,7],[4,8,5,12],[3,87,6,87],[3,88,6,88],[3,89,6,89],[3,90,6,90],[3,91,6,91],[4,13,6,13],[4,14,5,43],[4,44,6,44],[4,46,6,46],[4,47,5,49],[4,77,5,86],[5,45,6,45],[5,54,5,61],[5,62,5,66],[5,74,6,74],[5,75,6,75],[4,50,6,50],[5,76,6,76],[4,51,6,51],[4,52,6,52],[4,54,4,73],[4,74,4,76]]}
[]
[]
[null,null,null,null,null,null,null,null,{"$f":"ورقة1!C1","v":"الشهداء التعليمية"},null,null,null,null,null,null,null,null,null,null,null,null,null,null,null,null,null,null,null,"مدرسة",{"$f":"ورقة1!C2","v":"السوالمية"},null,null,null,null,null,null,null,null,null,null,null,null,null,null,null,"مرتبات شهر",null,{"$f":"ورقة1!C3","v":"مارس 2018"},null,null,null,null,null,null,"مدرسة /  ",null,null,null,null,{"$f":"IF($CL13>0,ورقة1!$C$2,\" \")","v":"السوالمية"},null,null,null,null,null,null,null,null,null,null,null,null,null,null,null,null,null,null,null," ",null,null,null,null,null,null,"مرتبات",{"$f":"ورقة1!C3","v":"مارس 2018"},null,null,{"$f":"FLOOR(CR13,0.05)","v":0},null,null,null,null,null,null,null,null,null,null,null,null,{"$f":"'العاملين '!CA10","v":1370},null,null,null,{"$f":"'العاملين '!CA10","v":1370}]
[null,{"$f":"'العاملين '!CA10","v":1370},"الاســــــــــــــــــــــــــتحـــــــــــــــــــــــــــــــــقــــــــــــــــــــــــــــــــــــــــــــــــــــــــــــــــــــــــــاقـــــــــــــــــــــــــــــــــــات ",null,null,null,null,null,null,null,null,null,null,null,null,null,null,null,null,null,null,null,null,null,null,null,null,null,null,null,null,null,null,null,null,null,null,null,null,null,null,null,null,null,null,null,null,null,null,null,null,null,null,"جملة الاستــــحقــاقات ","الأســـــــــــــــــــــــــــــــــــــتـــــــقـــــــــــــــــطاعـــــــــــــــــات ",null,null,null,null,null,null,null,null,null,null,null,null,null,null,null,null,null,null,null,null,null,null,null,null,null,null,null,null,null,null,null,null,"جملة الأستقطاعات ","الصافي المستحق ","الاســـــــــــــــــــم ","التوقيع بالاســــــــــــتلام ","صافي الشهر السابق ",null,"اسم البنك"]
[null,"م ","الاجور الاســــــــــــــــــــــــــاسية ",null,null,null,null,"الجملة ","الاجور المتغيرة الخاضعة بكامل قيمتها للتأمينات والمعاشات ",null,null,null,null,"الجملة ","الاجور المتغيرة الاخري بنسبة        %",null,null,null,null,null,null,null,null,null,null,null,null,null,null,null,null,null,null,null,null,null,null,null,null,null,null,null,null,null,"الجملة ",{"$f":"'العاملين '!CA5","v":2800},"غير خاضع","حصص الاجور المتغيرة ",null,null,"الجملة ","منحة ","انقطاع",null,"لحســــــــــــــــــــاب الهيئة القوميـــــــــــــــــــــة للتـــــــــــــــــأمين الإجتـــــــــــــــــــــــــماعي ",null,null,null,null,null,null,null,null,null,null,null,null,null,null,null,null,null,null,null,"لحساب جاري دائنة مصلحة الضرائب ",null,null,"لحساب دائنين مختلفين "]
[null,null,null,null,null,null,null,null,null,null,null,null,null,null,null,null,null,null,null,null,null,null,null,null,null,null,null,null,null,null,null,null,null,null,null,null,null,null,null,null,null,null,null,null,null,"خاضع",null,null,null,null,null,null,null,null,"استقطاعات الأجور الاســــــــــــــــــاسية ",null,null,null,null,null,null,null,"استقطاعات الأجور المتغيرة ",null,null,null,null,"الأقساط الخاصة عن الأجور الأساسية ",null,null,null,null,null,null,"ضريبة دخل  ","دمغة عادية   ","دمغة نسبية"]
[null,null,"المرتب "," حصة الحكومة  15%",0.01,"أل 2 %","أ ل3 %",null,"علاوة 2012","علاوة 2013","علاوة 2014","علاوة 2015","علاوة 2016",null,{"$f":"'العاملين '!P2","v":"ع اجتماعية"},{"$f":"'العاملين '!Q2","v":"ع اجتماعيةاضافية"},{"$f":"'العاملين '!R2","v":"أعباء وظيفية"},{"$f":"'العاملين '!AA2","v":"الحدالادنى"},{"$f":"'العاملين '!S2","v":"بدل نظارة"},{"$f":"'العاملين '!T2","v":"حافز مدير"},{"$f":"'العاملين '!U2","v":"بدل تفرغ"},{"$f":"'العاملين '!V2","v":"بدل تجاريين"},{"$f":"'العاملين '!W2","v":"بدل عدوي"},{"$f":"'العاملين '!X2","v":"حافز ماجستير"},{"$f":"'العاملين '!Y2","v":"حافزدكتوراة"},{"$f":"'العاملين '!Z2","v":"بدل تسكين"},{"$f":"'العاملين '!BM2","v":"بدل معلم اضافى"},{"$f":"'العاملين '!BN2","v":"بدل معلم "},{"$f":"'العاملين '!BO2","v":"بدل اعتماد "},{"$f":"'العاملين '!BP2","v":"حافز 25 %"},{"$f":"'العاملين '!BQ2","v":"حافز أداء "},{"$f":"'العاملين '!BR2","v":"الـ91.5"},{"$f":"'العاملين '!BS2","v":"ال50%"},{"$f":"'العاملين '!BT2","v":"ال 33%"},"الاجر الوظيفي","الاجر المكمل","الحافزالتعويضي",{"$f":"'العاملين '!AD2","v":"اكتب ما تشاء"},{"$f":"'العاملين '!AE2","v":"اكتب ما تشاء"},{"$f":"'العاملين '!AF2","v":"اكتب ما تشاء"},{"$f":"'العاملين '!AG2","v":"اكتب ما تشاء"},{"$f":"'العاملين '!AH2","v":"اكتب ما تشاء"},{"$f":"'العاملين '!AI2","v":"اكتب ما تشاء"},{"$f":"'العاملين '!AH2","v":"اكتب ما تشاء"},null,null,null,"ألـ 15 %","ألـ 1 %","ألـ 3%",null,null,null,null," حصة الحكومة  15%","إصابة عمل  1%","الـ 2%",null," حصة الموظف  10%","ال8%","ألـ 3%","ألـ 1 %"," حصة الحكومة  15%","إصابة عمل  1%"," حصة الموظف  10%","ال3%","ال1%","زمالة   7 %","زمالة  جماعى","نقابه","تطبيقين","رابطة ","نادى محافظة","نادي الادارة",null,null,null,{"$f":"'العاملين '!AP2","v":"أرباب عهد"},{"$f":"'العاملين '!AQ2","v":"خدمات عمالية"},{"$f":"'العاملين '!AR2","v":"نقابة بحث علمى 5%"},{"$f":"'العاملين '!AS3","v":"ناصر"},{"$f":"'العاملين '!AT3","v":"القاهرة"},{"$f":"'العاملين '!AU3","v":"الاهلى"},"خصومات اخرى","نقابةتجاريين",{"$f":"'العاملين '!AX2","v":"نصف العلاوة"},"كسر قرش",null,null,null,null,null,null,null,null,null,{"$f":"'العاملين '!CA10","v":1370}]
[null,1,{"$f":"IF($CM8>0,VLOOKUP($CM8,'العاملين '!$A$3:$AR$260,10),0)","v":1000},{"$f":"ROUND(IF(C8<=$CS$7,C8*0.15,$CS$7*0.15),2)","v":150},{"$f":"ROUND(IF(C8<$B$4,C8*$E$7,IF(C8>=$B$4,$E$7*$B$4)),2)","v":10},{"$f":"ROUND(IF(C8<=$CS$7,C8*0.02,$CS$7*0.02),2)","v":20},{"$f":"ROUND(IF(C8<=$CS$7,C8*0.03,$CS$7*0.03),2)","v":30},{"$f":"IF($C8>0,SUM(C8:G8),\" \")","v":1210},{"$f":"IF($CM8>0,VLOOKUP($CM8,'العاملين '!$A$3:$AR$260,11),0)","v":0},{"$f":"IF($CM8>0,VLOOKUP($CM8,'العاملين '!$A$3:$AR$260,12),0)","v":62.23},{"$f":"IF($CM8>0,VLOOKUP($CM8,'العاملين '!$A$3:$AR$260,13),0)","v":62.73},{"$f":"IF($CM8>0,VLOOKUP($CM8,'العاملين '!$A$3:$AR$260,14),0)","v":66.69},{"$f":"IF($CM8>0,VLOOKUP($CM8,'العاملين '!$A$3:$AR$260,15),0)","v":0},{"$f":"IF($C8>0,SUM(I8:M8),0)","v":191.64999999999998},{"$f":"IF($CM8>0,VLOOKUP($CM8,'العاملين '!$A$3:$AR$260,16),0)","v":4},{"$f":"IF($CM8>0,VLOOKUP($CM8,'العاملين '!$A$3:$AR$260,17),0)","v":6},{"$f":"IF($CM8>0,VLOOKUP($CM8,'العاملين '!$A$3:$AR$260,18),0)","v":350},{"$f":"IF($CM8>0,VLOOKUP($CM8,'العاملين '!$A$3:$AR$260,27),0)","v":0},{"$f":"IF($CM8>0,VLOOKUP($CM8,'العاملين '!$A$3:$AR$260,19),0)","v":0},{"$f":"IF($CM8>0,VLOOKUP($CM8,'العاملين '!$A$3:$AR$260,20),0)","v":0},{"$f":"IF($CM8>0,VLOOKUP($CM8,'العاملين '!$A$3:$AR$260,21),0)","v":0},{"$f":"IF($CM8>0,VLOOKUP($CM8,'العاملين '!$A$3:$AR$260,22),0)","v":0},{"$f":"IF($CM8>0,VLOOKUP($CM8,'العاملين '!$A$3:$AR$260,23),0)","v":" "},{"$f":"IF($CM8>0,VLOOKUP($CM8,'العاملين '!$A$3:$AR$260,24),0)","v":0},{"$f":"IF($CM8>0,VLOOKUP($CM8,'العاملين '!$A$3:$AR$260,25),0)","v":0},{"$f":"IF($CM8>0,VLOOKUP($CM8,'العاملين '!$A$3:$AR$260,26),0)","v":0},{"$f":"IF($CM8>0,VLOOKUP($CM8,'العاملين '!$A$3:$CR$260,65),0)","v":333.49},{"$f":"IF($CM8>0,VLOOKUP($CM8,'العاملين '!$A$3:$CR$260,66),0)","v":333.49},{"$f":"IF($CM8>0,VLOOKUP($CM8,'العاملين '!$A$3:$CR$260,67),0)","v":333.49},{"$f":"IF($CM8>0,VLOOKUP($CM8,'العاملين '!$A$3:$CR$260,68),0)","v":166},{"$f":"IF($CM8>0,VLOOKUP($CM8,'العاملين '!$A$3:$CR$260,69),0)","v":500},{"$f":"IF($CM8>0,VLOOKUP($CM8,'العاملين '!$A$3:$CR$260,70),0)","v":0},{"$f":"IF($CM8>0,VLOOKUP($CM8,'العاملين '!$A$3:$CR$260,71),0)","v":0},{"$f":"IF($CM8>0,VLOOKUP($CM8,'العاملين '!$A$3:$CR$260,72),0)","v":0},null,null,null,{"$f":"IF($CM8>0,VLOOKUP($CM8,'العاملين '!$A$3:$CR$260,28),0)","v":0},{"$f":"IF($CM8>0,VLOOKUP($CM8,'العاملين '!$A$3:$CR$260,29),0)","v":0},{"$f":"IF($CM8>0,VLOOKUP($CM8,'العاملين '!$A$3:$CR$260,30),0)","v":0},{"$f":"IF($CM8>0,VLOOKUP($CM8,'العاملين '!$A$3:$CR$260,31),0)","v":0},{"$f":"IF($CM8>0,VLOOKUP($CM8,'العاملين '!$A$3:$CR$260,32),0)","v":0},{"$f":"IF($CM8>0,VLOOKUP($CM8,'العاملين '!$A$3:$CR$260,33),0)","v":0},{"$f":"IF($CM8>0,VLOOKUP($CM8,'العاملين '!$A$3:$CR$260,34),0)","v":0},{"$f":"SUM(N8:AR8)","v":2218.12},{"$f":"IF(AS8>$AT$5,$AT$5,AS8)","v":2218.12},{"$f":"AS8-AT8","v":0},{"$f":"ROUND(($AT8)*15%,2)","v":332.72},{"$f":"ROUND(($AT8)*1%,2)","v":22.18},{"$f":"ROUND(($AT8)*3%,2)","v":66.540000000000006},{"$f":"SUM(AV8:AX8)","v":421.44000000000005},{"$f":"IF($CM8>0,VLOOKUP($CM8,'العاملين '!$A$3:$CR$260,64),0)","v":10},{"$f":"IF($CM8>0,VLOOKUP($CM8,'العاملين '!$A$3:$CR$260,52),0)","v":" "},{"$f":"SUM(AZ8,AY8,AS8,H8,BA8)","v":3859.56},{"$f":"ROUND(IF(C8<=$CS$7,C8*0.15,$CS$7*0.15),2)","v":150},{"$f":"ROUND(IF(C8<=$CS$7,C8*0.01,$CS$7*0.01),2)","v":10},{"$f":"ROUND(IF(C8<=$CS$7,C8*0.02,$CS$7*0.02),2)","v":20},null,{"$f":"IF($C8>0,ROUND(($C8)*10%,2),\" \")","v":100},{"$f":"ROUND(IF(C8<=$CS$7,C8*0.08,$CS$7*0.08),2)","v":80},{"$f":"ROUND(IF(C8<=$CS$7,C8*0.03,$CS$7*0.03),2)","v":30},{"$f":"ROUND(IF(C8<=$CS$7,C8*0.01,$CS$7*0.01),2)","v":10},{"$f":"AV8","v":332.72},22.18,{"$f":"ROUND(($AT8)*10%,2)","v":221.81},{"$f":"AX8","v":66.540000000000006},{"$f":"AW8","v":22.18},{"$f":"IF($CO8=1,ROUND(($C8)*7%,2),IF($CO8=2,VLOOKUP($CM8,'العاملين '!$A$3:$CT$260,53),0))","v":70},{"$f":"IF($CO8=1,0.5,IF($CO8=2,VLOOKUP($CM8,'العاملين '!$A$3:$CS$260,54),0))","v":0.5},{"$f":"IF($CO8=1,4.5,IF($CO8=2,VLOOKUP($CM8,'العاملين '!$A$3:$CT$260,55),0))","v":4.5},{"$f":"IF($CM8>0,VLOOKUP($CM8,'العاملين '!$A$3:$AR$260,37),0)","v":4},{"$f":"IF($CM8>0,VLOOKUP($CM8,'العاملين '!$A$3:$AR$260,38),0)","v":1},{"$f":"IF($CO8=1,0.2,IF($CO8=2,VLOOKUP($CM8,'العاملين '!$A$3:$CT$260,55),0))","v":0.2},{"$f":"IF($CO8=1,0.05,IF($CO8=2,VLOOKUP($CM8,'العاملين '!$A$3:$CT$260,55),0))","v":0.05},{"$f":"IF($CM8>0,VLOOKUP($CM8,'العاملين '!$A$3:$AR$260,39),0)","v":7.25},{"$f":"IF($CM8>0,VLOOKUP($CM8,'العاملين '!$A$3:$AR$260,40),0)","v":15.45},{"$f":"IF($CM8>0,VLOOKUP($CM8,'العاملين '!$A$3:$AR$260,41),0)","v":0},{"$f":"IF($CM8>0,VLOOKUP($CM8,'العاملين '!$A$3:$AR$260,42),0)","v":0},{"$f":"IF($CM8>0,VLOOKUP($CM8,'العاملين '!$A$3:$AR$260,43),0)","v":0},{"$f":"IF($CM8>0,VLOOKUP($CM8,'العاملين '!$A$3:$AR$260,44),0)","v":0},{"$f":"IF($CM8>0,VLOOKUP($CM8,'العاملين '!$A$3:$CR$260,45),0)","v":0},{"$f":"IF($CM8>0,VLOOKUP($CM8,'العاملين '!$A$3:$CR$260,46),0)","v":0},{"$f":"IF($CM8>0,VLOOKUP($CM8,'العاملين '!$A$3:$CR$260,47),0)","v":0},{"$f":"IF($CM8>0,VLOOKUP($CM8,'العاملين '!$A$3:$CR$260,48),0)","v":0},{"$f":"IF($CM8>0,VLOOKUP($CM8,'العاملين '!$A$3:$CR$260,22),0)","v":0},{"$f":"IF($CM8>0,VLOOKUP($CM8,'العاملين '!$A$3:$BU$260,50),0)","v":0},{"$f":"CQ8-CK8","v":2.9999999999745341E-2},{"$f":"SUM(BC8:CI8)","v":1168.4099999999999},{"$f":"FLOOR(CQ8,0.05)","v":2691.15},{"$f":"IF($CM8>0,VLOOKUP($CM8,'العاملين '!$A$3:$AR$260,2),0)","v":"محمد1"},1,null,{"$f":"IF($CM8>0,VLOOKUP($CM8,'العاملين '!$A$3:$CR$260,3),0)","v":1},{"$f":"IF($CM8>0,VLOOKUP($CM8,'العاملين '!$A$3:$CR$260,49),0)","v":"khwv"},{"$f":"BB8-SUM(BC8:CH8)","v":2691.18},null,{"$f":"'العاملين '!BA10","v":0}]
{"$rows_left_out":16}