{"text_format":"1","workbook":"xlsx","n_sheets":3,"sheets":["ورقة2","بيانات الموظفين","ورقة3"],"not_rendered":{"charts":0,"images":0,"macros":1,"external_links":0,"defined_names":0,"comments":0,"pivot_tables":0},"unopened":[],"bounds":{"document_bytes":16777216,"sheet_cells":100000,"rows_first":2000,"rows_last":500,"rows_between":2000,"halvings":0,"cell_chars":16384,"cell_head_chars":4096},"cells_cut":0,"cells_raw":0,"read":"whole","date_system":"1900"}

{"sheet":"ورقة2","index":0,"n_rows":20,"n_cols":7,"rows_kept":20,"cut":false,"hidden":false,"merged":[[1,2,1,6],[3,2,3,4],[4,2,4,4]]}
[]
[]
[]
["الرقم الوظيفي \nID",null,"اسم الموظف",null,null,null,"تاريخ انتهاء التأمين الطبي"]
[{"$f":"VLOOKUP(C5,'بيانات الموظفين'!A9:AF206,3,FALSE)","v":3},null,"نبيل احمد علي جيشي ",null,null,null,{"$f":"VLOOKUP(C5,'بيانات الموظفين'!A9:AF206,11,FALSE)","v":"2018-04-10"}]
[]
[null,null,"رقم الإقامة",null,"تاريخ انتهاء الإقامة",null,"محل الإقامة "]
[null,null,{"$f":"VLOOKUP(C5,'بيانات الموظفين'!A9:AF206,5,FALSE)","v":2317092522},null,{"$f":"VLOOKUP(C5,'بيانات الموظفين'!A9:AF206,6,FALSE)","v":"2018-08-10"},null,{"$f":"VLOOKUP(C5,'بيانات الموظفين'!A9:AF206,30,FALSE)","v":"جدة"}]
[]
[null,null,"تاريخ مباشرة العمل",null,"تاريخ انتهاء عقد العمل",null,"الجنسية"]
[null,null,{"$f":"VLOOKUP(C5,'بيانات الموظفين'!A9:AF206,25,FALSE)","v":0},null,{"$f":"VLOOKUP(C5,'بيانات الموظفين'!A9:AF206,26,FALSE)","v":"2018-05-09"},null,{"$f":"VLOOKUP(C5,'بيانات الموظفين'!A9:AF206,29,FALSE)","v":0}]
[]
[null,null,"رقم جواز السفر",null,"تاريخ انتهاء جواز السفر",null,"رقم الجوال"]
[null,null,{"$f":"VLOOKUP(C5,'بيانات الموظفين'!A9:AF206,19,FALSE)","v":0},null,{"$f":"VLOOKUP(C5,'بيانات الموظفين'!A9:AF206,20,FALSE)","v":"2018-04-12"},null,{"$f":"VLOOKUP(C5,'بيانات الموظفين'!A9:AF206,15,FALSE)","v":"0532731417"}]
[]
[null,null,"المهنة في الإقامة",null,"الراتب الأساسي",null,"البريد الالكتروني"]
[null,null,{"$f":"VLOOKUP(C5,'بيانات الموظفين'!A9:AF206,4,FALSE)","v":"مندوب مبيعات"},null,{"$f":"VLOOKUP(C5,'بيانات الموظفين'!A9:AF206,14,FALSE)","v":5000},null,{"$f":"VLOOKUP(C5,'بيانات الموظفين'!A9:AF206,31,FALSE)","v":0}]
[]
[null,null,"تاريخ الميلاد ",null,"العمر",null,"صاحب العمل"]
[null,null,{"$f":"VLOOKUP(C5,'بيانات الموظفين'!A9:AF206,16,FALSE)","v":0},null,{"$f":"VLOOKUP(C5,'بيانات الموظفين'!A9:AF206,17,FALSE)","v":0},null,{"$f":"VLOOKUP(C5,'بيانات الموظفين'!A9:AF206,32,FALSE)","v":"شركة سما الاهلية المحدودة"}]

{"sheet":"بيانات الموظفين","index":1,"n_rows":206,"n_cols":32,"rows_kept":206,"cut":false,"hidden":false,"merged":[[8,16,9,16],[8,17,9,17],[4,13,6,13],[4,12,6,12],[1,2,1,3],[1,4,1,5],[1,10,1,11],[8,6,9,6],[4,14,6,14],[3,3,3,4],[3,5,3,7],[8,21,9,21],[8,27,9,27],[8,1,9,1],[8,19,9,19],[8,22,9,22],[8,20,9,20],[8,24,9,24],[8,7,9,7],[8,10,9,10],[8,11,9,11],[8,13,9,13],[8,14,9,14],[8,15,9,15],[8,18,9,18],[8,8,9,8],[8,12,9,12],[8,33,9,33],[8,25,9,25],[8,28,9,28],[8,29,9,29],[8,30,9,30],[8,31,9,31],[8,32,9,32],[8,26,9,26],[8,0,9,0],[8,2,9,2],[8,3,9,3],[8,4,9,4],[8,5,9,5],[0,2,0,12],[5,3,5,4],[5,5,5,7],[6,5,6,7],[6,3,6,4],[4,5,4,7],[4,3,4,4]]}
[]
[null,null,"تاريخ اليوم",null,{"$f":"TODAY()","v":"2018-03-11"},null,"2018-03-11","21:19:17",{"$f":"NOW()","v":43170.888391319444},43170.888391319444,{"$f":"TODAY()","v":"2018-03-11"},null,{"$f":"K2","v":"2018-03-11"}]
[]
[null,"إقامة","الوثيقة","سارية",null,"منتهية",null,null,null,null,"قاربت على الانتهاء","الإجمالي","المدة"]
[null,"جواز سفر","إقامة",{"$f":"COUNTIFS(B11:B206,C5,I11:I206,D4)","v":1},null,{"$f":"COUNTIFS(B11:B206,C5,I11:I206,F4)","v":195},null,null,null,null,{"$f":"COUNTIFS(B11:B206,C5,I11:I206,K4)","v":0},{"$f":"D5+F5+K5","v":196},50]
[null,"عقد عمل","عقد عمل",{"$f":"COUNTIFS(X11:X206,C6,AB11:AB206,D4)","v":1},null,{"$f":"COUNTIFS(X11:X206,C6,AB11:AB206,F4)","v":195},null,null,null,null,{"$f":"COUNTIFS(X11:X206,C6,AB11:AB206,K4)","v":0},{"$f":"D6+F6+K6","v":196}]
[null,null,"جواز سفر",{"$f":"COUNTIFS(R11:R206,C7,V11:V206,D4)","v":0},null,{"$f":"COUNTIFS(R11:R206,C7,V11:V206,F4)","v":195},null,null,null,null,{"$f":"COUNTIFS(R11:R206,C7,V11:V206,K4)","v":1},196]
[]
["اسم الموظف",null,"الرقم الوظيفي","المهنة في الإقامة","رقم الإقامة","تاريخ انتهاء الإقامة بالهجري","تاريخ انتهاء الإقامة بالميلادي","الأيام المتبقية لانتهاء الإقامة",null,null,"تاريخ انتهاء التأمين الطبي بالميلادي","الأيام المتبقية لانتهاء التأمين الطبي","الحالة","الراتب الأساسي","رقم الجوال","تاريخ الميلاد","العمر ",null,"رقم جواز السفر","تاريخ انتهاء جواز السفر","الأيام المتبقية على انتهاء جواز السفر","الحالة","رقم الحدود",null,"تاريخ مباشرة العمل","تاريخ انتهاء عقد العمل","الأيام المتبقية لانتهاء عقد العمل","الحالة","الجنسية","محل الإقامة","البريد الالكتروني","صاحب العمل"]
[]
["نبيل احمد علي جيشي ","إقامة",3,"مندوب مبيعات",2317092522,"2018-08-10",{"$f":"F11","v":"2018-08-10"},{"$f":"F11-TODAY()","v":152},{"$f":"IF(H11>$M$5,\"سارية\",IF(G11<$K$2,\"منتهية\", IF(H11<=$M$5,\"قاربت على الانتهاء\")))","v":"سارية"},"تامين طبي ","2018-04-10",{"$f":"K11-TODAY()","v":30},{"$f":"IF(L11>$M$5,\"سارية\",IF(K11<$K$2,\"منتهية\", IF(L11<=$M$5,\"قاربت على الانتهاء\")))","v":"قاربت على الانتهاء"},5000,"0532731417",null,null,"جواز سفر",null,"2018-04-12",{"$f":"T11-TODAY()","v":32},{"$f":"IF(U11>$M$5,\"سارية\",IF(T11<$K$2,\"منتهية\", IF(U11<=$M$5,\"قاربت على الانتهاء\")))","v":"قاربت على الانتهاء"},null,"عقد عمل",null,"2018-05-09",{"$f":"Z11-TODAY()","v":59},{"$f":"IF(AA11>$M$5,\"سارية\",IF(Z11<$K$2,\"منتهية\", IF(AA11<=$M$5,\"قاربت على الانتهاء\")))","v":"سارية"},null,"جدة",null,"شركة سما الاهلية المحدودة"]
["اسلام فودة ","إقامة",5,null,null,null,{"$f":"F12","v":"00:00:00"},{"$f":"F12-TODAY()","v":-43170},"منتهية","تامين طبي ",null,{"$f":"K12-TODAY()","v":-43170},{"$f":"IF(L12>$M$5,\"سارية\",IF(K12<$K$2,\"منتهية\", IF(L12<=$M$5,\"قاربت على الانتهاء\")))","v":"منتهية"},null,"0532731418",null,null,"جواز سفر",null,null,{"$f":"T12-TODAY()","v":-43170},{"$f":"IF(U12>$M$5,\"سارية\",IF(T12<$K$2,\"منتهية\", IF(U12<=$M$5,\"قاربت على الانتهاء\")))","v":"منتهية"},null,"عقد عمل",null,null,{"$f":"Z12-TODAY()","v":-43170},{"$f":"IF(AA12>$M$5,\"سارية\",IF(Z12<$K$2,\"منتهية\", IF(AA12<=$M$5,\"قاربت على الانتهاء\")))","v":"منتهية"}]
[null,"إقامة",null,null,null,null,"00:00:00",-43170,"منتهية","تامين طبي ",null,-43170,{"$f":"IF(L13>$M$5,\"سارية\",IF(K13<$K$2,\"منتهية\", IF(L13<=$M$5,\"قاربت على الانتهاء\")))","v":"منتهية"},null,"0532731419",null,null,"جواز سفر",null,null,-43170,"منتهية",null,"عقد عمل",null,null,-43170,"منتهية"]
[null,"إقامة",null,null,null,null,"00:00:00",-43170,"منتهية","تامين طبي ",null,-43170,{"$f":"IF(L14>$M$5,\"سارية\",IF(K14<$K$2,\"منتهية\", IF(L14<=$M$5,\"قاربت على الانتهاء\")))","v":"منتهية"},null,null,null,null,"جواز سفر",null,null,-43170,"منتهية",null,"عقد عمل",null,null,-43170,"منتهية"]
[null,"إقامة",null,null,null,null,"00:00:00",-43170,"منتهية","تامين طبي ",null,-43170,"منتهية",null,null,null,null,"جواز سفر",null,null,-43170,"منتهية",null,"عقد عمل",null,null,-43170,"منتهية"]
[null,"إقامة",null,null,null,null,"00:00:00",-43170,"منتهية","تامين طبي ",null,-43170,"منتهية",null,null,null,null,"جواز سفر",null,null,-43170,"منتهية",null,"عقد عمل",null,null,-43170,"منتهية"]
[null,"إقامة",null,null,null,null,"00:00:00",-43170,"منتهية","تامين طبي ",null,-43170,"منتهية",null,null,null,null,"جواز سفر",null,null,-43170,"منتهية",null,"عقد عمل",null,null,-43170,"منتهية"]
[null,"إقامة",null,null,null,null,"00:00:00",-43170,"منتهية","تامين طبي ",null,-43170,"منتهية",null,null,null,null,"جواز سفر",null,null,-43170,"منتهية",null,"عقد عمل",null,null,-43170,"منتهية"]
[null,"إقامة",null,null,null,null,"00:00:00",-43170,"منتهية","تامين طبي ",null,-43170,"منتهية",null,null,null,null,"جواز سفر",null,null,-43170,"منتهية",null,"عقد عمل",null,null,-43170,"منتهية"]
[null,"إقامة",null,null,null,null,"00:00:00",-43170,"منتهية","تامين طبي ",null,-43170,"منتهية",null,null,null,null,"جواز سفر",null,null,-43170,"منتهية",null,"عقد عمل",null,null,-43170,"منتهية"]
[null,"إقامة",null,null,null,null,"00:00:00",-43170,"منتهية","تامين طبي ",null,-43170,"منتهية",null,null,null,null,"جواز سفر",null,null,-43170,"منتهية",null,"عقد عمل",null,null,-43170,"منتهية"]
[null,"إقامة",null,null,null,null,"00:00:00",-43170,"منتهية","تامين طبي ",null,-43170,"منتهية",null,null,null,null,"جواز سفر",null,null,-43170,"منتهية",null,"عقد عمل",null,null,-43170,"منتهية"]
[null,"إقامة",null,null,null,null,"00:00:00",-43170,"منتهية","تامين طبي ",null,-43170,"منتهية",null,null,null,null,"جواز سفر",null,null,-43170,"منتهية",null,"عقد عمل",null,null,-43170,"منتهية"]
[null,"إقامة",null,null,null,null,"00:00:00",-43170,"منتهية","تامين طبي ",null,-43170,"منتهية",null,null,null,null,"جواز سفر",null,null,-43170,"منتهية",null,"عقد عمل",null,null,-43170,"منتهية"]
[null,"إقامة",null,null,null,null,"00:00:00",-43170,"منتهية","تامين طبي ",null,-43170,"منتهية",null,null,null,null,"جواز سفر",null,null,-43170,"منتهية",null,"عقد عمل",null,null,-43170,"منتهية"]
[null,"إقامة",null,null,null,null,"00:00:00",-43170,"منتهية","تامين طبي ",null,-43170,"منتهية",null,null,null,null,"جواز سفر",null,null,-43170,"منتهية",null,"عقد عمل",null,null,-43170,"منتهية"]
[null,"إقامة",null,null,null,null,"00:00:00",-43170,"منتهية","تامين طبي ",null,-43170,"منتهية",null,null,null,null,"جواز سفر",null,null,-43170,"منتهية",null,"عقد عمل",null,null,-43170,"منتهية"]
[null,"إقامة",null,null,null,null,"00:00:00",-43170,"منتهية","تامين طبي ",null,-43170,"منتهية",null,null,null,null,"جواز سفر",null,null,-43170,"منتهية",null,"عقد عمل",null,null,-43170,"منتهية"]
[null,"إقامة",null,null,null,null,"00:00:00",-43170,"منتهية","تامين طبي ",null,-43170,"منتهية",null,null,null,null,"جواز سفر",null,null,-43170,"منتهية",null,"عقد عمل",null,null,-43170,"منتهية"]
[null,"إقامة",null,null,null,null,"00:00:00",-43170,"منتهية","تامين طبي ",null,-43170,"منتهية",null,null,null,null,"جواز سفر",null,null,-43170,"منتهية",null,"عقد عمل",null,null,-43170,"منتهية"]
[null,"إقامة",null,null,null,null,"00:00:00",-43170,"منتهية","تامين طبي ",null,-43170,"منتهية",null,null,null,null,"جواز سفر",null,null,-43170,"منتهية",null,"عقد عمل",null,null,-43170,"منتهية"]
[null,"إقامة",null,null,null,null,"00:00:00",-43170,"منتهية","تامين طبي ",null,-43170,"منتهية",null,null,null,null,"جواز سفر",null,null,-43170,"منتهية",null,"عقد عمل",null,null,-43170,"منتهية"]
[null,"إقامة",null,null,null,null,"00:00:00",-43170,"منتهية","تامين طبي ",null,-43170,"منتهية",null,null,null,null,"جواز سفر",null,null,-43170,"منتهية",null,"عقد عمل",null,null,-43170,"منتهية"]
[null,"إقامة",null,null,null,null,"00:00:00",-43170,"منتهية","تامين طبي ",null,-43170,"منتهية",null,null,null,null,"جواز سفر",null,null,-43170,"منتهية",null,"عقد عمل",null,null,-43170,"منتهية"]
[null,"إقامة",null,null,null,null,"00:00:00",-43170,"منتهية","تامين طبي ",null,-43170,"منتهية",null,null,null,null,"جواز سفر",null,null,-43170,"منتهية",null,"عقد عمل",null,null,-43170,"منتهية"]
[null,"إقامة",null,null,null,null,"00:00:00",-43170,"منتهية","تامين طبي ",null,-43170,"منتهية",null,null,null,null,"جواز سفر",null,null,-43170,"منتهية",null,"عقد عمل",null,null,-43170,"منتهية"]
[null,"إقامة",null,null,null,null,"00:00:00",-43170,"منتهية","تامين طبي ",null,-43170,"منتهية",null,null,null,null,"جواز سفر",null,null,-43170,"منتهية",null,"عقد عمل",null,null,-43170,"منتهية"]
[null,"إقامة",null,null,null,null,"00:00:00",-43170,"منتهية","تامين طبي ",null,-43170,"منتهية",null,null,null,null,"جواز سفر",null,null,-43170,"منتهية",null,"عقد عمل",null,null,-43170,"منتهية"]
[null,"إقامة",null,null,null,null,"00:00:00",-43170,"منتهية","تامين طبي ",null,-43170,"منتهية",null,null,null,null,"جواز سفر",null,null,-43170,"منتهية",null,"عقد عمل",null,null,-43170,"منتهية"]
[null,"إقامة",null,null,null,null,"00:00:00",-43170,"منتهية","تامين طبي ",null,-43170,"منتهية",null,null,null,null,"جواز سفر",null,null,-43170,"منتهية",null,"عقد عمل",null,null,-43170,"منتهية"]
[null,"إقامة",null,null,null,null,"00:00:00",-43170,"منتهية","تامين طبي ",null,-43170,"منتهية",null,null,null,null,"جواز سفر",null,null,-43170,"منتهية",null,"عقد عمل",null,null,-43170,"منتهية"]
[null,"إقامة",null,null,null,null,"00:00:00",-43170,"منتهية","تامين طبي ",null,-43170,"منتهية",null,null,null,null,"جواز سفر",null,null,-43170,"منتهية",null,"عقد عمل",null,null,-43170,"منتهية"]
[null,"إقامة",null,null,null,null,"00:00:00",-43170,{"$f":"IF(H43>$M$5,\"سارية\",IF(G43<$K$2,\"منتهية\", IF(H43<=$M$5,\"قاربت على الانتهاء\")))","v":"منتهية"},"تامين طبي ",null,-43170,"منتهية",null,null,null,null,"جواز سفر",null,null,-43170,"منتهية",null,"عقد عمل",null,null,-43170,"منتهية"]
[null,"إقامة",null,null,null,null,"00:00:00",-43170,"منتهية","تامين طبي ",null,-43170,"منتهية",null,null,null,null,"جواز سفر",null,null,-43170,"منتهية",null,"عقد عمل",null,null,-43170,"منتهية"]
[null,"إقامة",null,null,null,null,"00:00:00",-43170,"منتهية","تامين طبي ",null,-43170,"منتهية",null,null,null,null,"جواز سفر",null,null,-43170,"منتهية",null,"عقد عمل",null,null,-43170,"منتهية"]
[null,"إقامة",null,null,null,null,"00:00:00",-43170,"منتهية","تامين طبي ",null,-43170,"منتهية",null,null,null,null,"جواز سفر",null,null,-43170,"منتهية",null,"عقد عمل",null,null,-43170,"منتهية"]
[null,"إقامة",null,null,null,null,"00:00:00",-43170,"منتهية","تامين طبي ",null,-43170,"منتهية",null,null,null,null,"جواز سفر",null,null,-43170,"منتهية",null,"عقد عمل",null,null,-43170,"منتهية"]
[null,"إقامة",null,null,null,null,"00:00:00",-43170,"منتهية","تامين طبي ",null,-43170,"منتهية",null,null,null,null,"جواز سفر",null,null,-43170,"منتهية",null,"عقد عمل",null,null,-43170,"منتهية"]
[null,"إقامة",null,null,null,null,"00:00:00",-43170,"منتهية","تامين طبي ",null,-43170,"منتهية",null,null,null,null,"جواز سفر",null,null,-43170,"منتهية",null,"عقد عمل",null,null,-43170,"منتهية"]
[null,"إقامة",null,null,null,null,"00:00:00",-43170,"منتهية","تامين طبي ",null,-43170,"منتهية",null,null,null,null,"جواز سفر",null,null,-43170,"منتهية",null,"عقد عمل",null,null,-43170,"منتهية"]
[null,"إقامة",null,null,null,null,"00:00:00",-43170,"منتهية","تامين طبي ",null,-43170,"منتهية",null,null,null,null,"جواز سفر",null,null,-43170,"منتهية",null,"عقد عمل",null,null,-43170,"منتهية"]
[null,"إقامة",null,null,null,null,"00:00:00",-43170,"منتهية","تامين طبي ",null,-43170,"منتهية",null,null,null,null,"جواز سفر",null,null,-43170,"منتهية",null,"عقد عمل",null,null,-43170,"منتهية"]
[null,"إقامة",null,null,null,null,"00:00:00",-43170,"منتهية","تامين طبي ",null,-43170,"منتهية",null,null,null,null,"جواز سفر",null,null,-43170,"منتهية",null,"عقد عمل",null,null,-43170,"منتهية"]
[null,"إقامة",null,null,null,null,"00:00:00",-43170,"منتهية","تامين طبي ",null,-43170,"منتهية",null,null,null,null,"جواز سفر",null,null,-43170,"منتهية",null,"عقد عمل",null,null,-43170,"منتهية"]
[null,"إقامة",null,null,null,null,"00:00:00",-43170,"منتهية","تامين طبي ",null,-43170,"منتهية",null,null,null,null,"جواز سفر",null,null,-43170,"منتهية",null,"عقد عمل",null,null,-43170,"منتهية"]
[null,"إقامة",null,null,null,null,"00:00:00",-43170,"منتهية","تامين طبي ",null,-43170,"منتهية",null,null,null,null,"جواز سفر",null,null,-43170,"منتهية",null,"عقد عمل",null,null,-43170,"منتهية"]
[null,"إقامة",null,null,null,null,"00:00:00",-43170,"منتهية","تامين طبي ",null,-43170,"منتهية",null,null,null,null,"جواز سفر",null,null,-43170,"منتهية",null,"عقد عمل",null,null,-43170,"منتهية"]
[null,"إقامة",null,null,null,null,"00:00:00",-43170,"منتهية","تامين طبي ",null,-43170,"منتهية",null,null,null,null,"جواز سفر",null,null,-43170,"منتهية",null,"عقد عمل",null,null,-43170,"منتهية"]
[null,"إقامة",null,null,null,null,"00:00:00",-43170,"منتهية","تامين طبي ",null,-43170,"منتهية",null,null,null,null,"جواز سفر",null,null,-43170,"منتهية",null,"عقد عمل",null,null,-43170,"منتهية"]
[null,"إقامة",null,null,null,null,"00:00:00",-43170,"منتهية","تامين طبي ",null,-43170,"منتهية",null,null,null,null,"جواز سفر",null,null,-43170,"منتهية",null,"عقد عمل",null,null,-43170,"منتهية"]
[null,"إقامة",null,null,null,null,"00:00:00",-43170,"منتهية","تامين طبي ",null,-43170,"منتهية",null,null,null,null,"جواز سفر",null,null,-43170,"منتهية",null,"عقد عمل",null,null,-43170,"منتهية"]
[null,"إقامة",null,null,null,null,"00:00:00",-43170,"منتهية","تامين طبي ",null,-43170,"منتهية",null,null,null,null,"جواز سفر",null,null,-43170,"منتهية",null,"عقد عمل",null,null,-43170,"منتهية"]
[null,"إقامة",null,null,null,null,"00:00:00",-43170,"منتهية","تامين طبي ",null,-43170,"منتهية",null,null,null,null,"جواز سفر",null,null,-43170,"منتهية",null,"عقد عمل",null,null,-43170,"منتهية"]
[null,"إقامة",null,null,null,null,"00:00:00",-43170,"منتهية","تامين طبي ",null,-43170,"منتهية",null,null,null,null,"جواز سفر",null,null,-43170,"منتهية",null,"عقد عمل",null,null,-43170,"منتهية"]
[null,"إقامة",null,null,null,null,"00:00:00",-43170,"منتهية","تامين طبي ",null,-43170,"منتهية",null,null,null,null,"جواز سفر",null,null,-43170,"منتهية",null,"عقد عمل",null,null,-43170,"منتهية"]
[null,"إقامة",null,null,null,null,"00:00:00",-43170,"منتهية","تامين طبي ",null,-43170,"منتهية",null,null,null,null,"جواز سفر",null,null,-43170,"منتهية",null,"عقد عمل",null,null,-43170,"منتهية"]
[null,"إقامة",null,null,null,null,"00:00:00",-43170,"منتهية","تامين طبي ",null,-43170,"منتهية",null,null,null,null,"جواز سفر",null,null,-43170,"منتهية",null,"عقد عمل",null,null,-43170,"منتهية"]
[null,"إقامة",null,null,null,null,"00:00:00",-43170,"منتهية","تامين طبي ",null,-43170,"منتهية",null,null,null,null,"جواز سفر",null,null,-43170,"منتهية",null,"عقد عمل",null,null,-43170,"منتهية"]
[null,"إقامة",null,null,null,null,"00:00:00",-43170,"منتهية","تامين طبي ",null,-43170,"منتهية",null,null,null,null,"جواز سفر",null,null,-43170,"منتهية",null,"عقد عمل",null,null,-43170,"منتهية"]
[null,"إقامة",null,null,null,null,"00:00:00",-43170,"منتهية","تامين طبي ",null,-43170,"منتهية",null,null,null,null,"جواز سفر",null,null,-43170,"منتهية",null,"عقد عمل",null,null,-43170,"منتهية"]
[null,"إقامة",null,null,null,null,"00:00:00",-43170,"منتهية","تامين طبي ",null,-43170,"منتهية",null,null,null,null,"جواز سفر",null,null,-43170,"منتهية",null,"عقد عمل",null,null,-43170,"منتهية"]
[null,"إقامة",null,null,null,null,"00:00:00",-43170,"منتهية","تامين طبي ",null,-43170,"منتهية",null,null,null,null,"جواز سفر",null,null,-43170,"منتهية",null,"عقد عمل",null,null,-43170,"منتهية"]
[null,"إقامة",null,null,null,null,"00:00:00",-43170,"منتهية","تامين طبي ",null,-43170,"منتهية",null,null,null,null,"جواز سفر",null,null,-43170,"منتهية",null,"عقد عمل",null,null,-43170,"منتهية"]
[null,"إقامة",null,null,null,null,"00:00:00",-43170,"منتهية","تامين طبي ",null,-43170,"منتهية",null,null,null,null,"جواز سفر",null,null,-43170,"منتهية",null,"عقد عمل",null,null,-43170,"منتهية"]
[null,"إقامة",null,null,null,null,"00:00:00",-43170,{"$f":"IF(H75>$M$5,\"سارية\",IF(G75<$K$2,\"منتهية\", IF(H75<=$M$5,\"قاربت على الانتهاء\")))","v":"منتهية"},"تامين طبي ",null,-43170,"منتهية",null,null,null,null,"جواز سفر",null,null,-43170,"منتهية",null,"عقد عمل",null,null,-43170,"منتهية"]
[null,"إقامة",null,null,null,null,{"$f":"F76","v":"00:00:00"},{"$f":"F76-TODAY()","v":-43170},"منتهية","تامين طبي ",null,{"$f":"K76-TODAY()","v":-43170},"منتهية",null,null,null,null,"جواز سفر",null,null,{"$f":"T76-TODAY()","v":-43170},{"$f":"IF(U76>$M$5,\"سارية\",IF(T76<$K$2,\"منتهية\", IF(U76<=$M$5,\"قاربت على الانتهاء\")))","v":"منتهية"},null,"عقد عمل",null,null,{"$f":"Z76-TODAY()","v":-43170},{"$f":"IF(AA76>$M$5,\"سارية\",IF(Z76<$K$2,\"منتهية\", IF(AA76<=$M$5,\"قاربت على الانتهاء\")))","v":"منتهية"}]
[null,"إقامة",null,null,null,null,"00:00:00",-43170,"منتهية","تامين طبي ",null,-43170,"منتهية",null,null,null,null,"جواز سفر",null,null,-43170,"منتهية",null,"عقد عمل",null,null,-43170,"منتهية"]
[null,"إقامة",null,null,null,null,"00:00:00",-43170,"منتهية","تامين طبي ",null,-43170,{"$f":"IF(L78>$M$5,\"سارية\",IF(K78<$K$2,\"منتهية\", IF(L78<=$M$5,\"قاربت على الانتهاء\")))","v":"منتهية"},null,null,null,null,"جواز سفر",null,null,-43170,"منتهية",null,"عقد عمل",null,null,-43170,"منتهية"]
[null,"إقامة",null,null,null,null,"00:00:00",-43170,"منتهية","تامين طبي ",null,-43170,"منتهية",null,null,null,null,"جواز سفر",null,null,-43170,"منتهية",null,"عقد عمل",null,null,-43170,"منتهية"]
[null,"إقامة",null,null,null,null,"00:00:00",-43170,"منتهية","تامين طبي ",null,-43170,"منتهية",null,null,null,null,"جواز سفر",null,null,-43170,"منتهية",null,"عقد عمل",null,null,-43170,"منتهية"]
{"$rows_left_out":127}
{"sheet":"ورقة3","index":2,"n_rows":0,"n_cols":0,"rows_kept":0,"cut":false,"hidden":false,"merged":[]}