{"text_format":"1","workbook":"xlsx","n_sheets":3,"sheets":["Statement of Account","Movement","Chart of Accounts"],"not_rendered":{"charts":0,"images":3,"macros":1,"external_links":1,"defined_names":32,"comments":0,"pivot_tables":0},"unopened":[],"bounds":{"document_bytes":16777216,"sheet_cells":100000,"rows_first":2000,"rows_last":500,"rows_between":2000,"halvings":0,"cell_chars":16384,"cell_head_chars":4096},"cells_cut":0,"cells_raw":0,"read":"whole","date_system":"1900"}

{"sheet":"Statement of Account","index":0,"n_rows":409,"n_cols":12,"rows_kept":409,"cut":false,"hidden":false,"merged":[[6,2,6,3],[6,5,6,6],[6,7,6,8],[407,4,407,8],[1,2,2,2],[3,1,4,3],[3,5,3,6],[4,5,4,6],[5,2,5,3],[5,5,5,6]]}
[null,null,null,null,null,null,null,null,null,null,null,{"$f":"IF(J7=\"مدين\",INDEX('[1]Detailed Trial Balance'!AN5:AN99,MATCH(E6,'[1]Detailed Trial Balance'!AC5:AC99,0)),INDEX(-'[1]Detailed Trial Balance'!AO5:AO99,MATCH(E6,'[1]Detailed Trial Balance'!AC5:AC99,0)))","v":271614.16999999993}]
[null,1,24,null,null,null,null,null,null,{"$f":"H7-L1","v":0}]
[null,1,null,null,null,null,null,null,null,2]
[1,"التاريخ",null,null,{"$f":"IF(C2=\"\",\"\",VLOOKUP(C2,data,3,FALSE))","v":"أصول متداولة"},"رصيد ما قبل\nتاريخ كشف الحساب",null,0,0,0]
[1,null,null,null,{"$f":"IF(C2=\"\",\"\",VLOOKUP(C2,data,4,FALSE))","v":"إستثمارات فى أوراق مالية بغرض المتاجرة"},"رصيد\nفترة كشف الحساب",null,299091.2099999999,27477.039999999997,271614.16999999993]
[null,"من","2013-01-01",null,"وثائق صندوق ثمـــار","رصيد ما بعد\nتاريخ كشف الحساب",null,{"$f":"SUMIFS(Dr._2012,Movement!D2:D1998,C2,Movement!H2:H1998,\">\"&C7)","v":0},{"$f":"SUMIFS(Cr._2012,Movement!D2:D1998,C2,Movement!H2:H1998,\">\"&C7)","v":0},{"$f":"H6-I6","v":0}]
[1,"إلى","2013-12-31",null,{"$f":"IF(E6=\"الأهلى سوسيتية جنرال - جنية مصرى\",'Chart of Accounts'!E29,\"\")","v":""},"الرصيد الإجمالى",null,271614.16999999993,null,"مدين"]
[1,null,null,null,null,null,null,null,null,1]
[1,null,null,null,null,null,null,null,null,2]
[1,null,null,null,null,null,null,null,null,1]
[1,"مدين","دائن","رصيد","البيــــــــــــان","رقم الشيك","المستند","رقم المستند","التاريخ","م",1]
[null,675.91999999992549,0,{"$f":"IF(OR(B12<>\"\",C12<>\"\"),B12-C12,\"\")","v":675.91999999992549},"رصيد أول المدة",null,"قيد إفتتاحية","0/0","2013-01-01",1]
[null,169.47,null,{"$f":"IF(AND(B13=\"\",C13=\"\"),\"\",D12+B13-C13)","v":845.38999999992552},"شراء 1 وثيقة ثمار",null,"قيد يومية",null,"2013-01-10",2]
[null,null,169.08,{"$f":"IF(AND(B14=\"\",C14=\"\"),\"\",D13+B14-C14)","v":676.30999999992548},"إسترداد 1 وثيقة ثمار",null,"قيد يومية",null,"2013-01-14",3]
[null,182906.5,null,{"$f":"IF(AND(B15=\"\",C15=\"\"),\"\",D14+B15-C15)","v":183582.80999999994},"شراء 1074 وثيقة ثمار",null,"قيد يومية",null,"2013-01-27",4]
[null,null,6641.68,{"$f":"IF(AND(B16=\"\",C16=\"\"),\"\",D15+B16-C16)","v":176941.12999999995},"إسترداد 39 وثيقة ثمار",null,"قيد يومية",null,"2013-01-29",5]
[null,null,340.6,{"$f":"IF(AND(B17=\"\",C17=\"\"),\"\",D16+B17-C17)","v":176600.52999999994},"إسترداد 2 وثيقة ثمار",null,"قيد يومية",null,"2013-02-11",6]
[null,null,6811.98,{"$f":"IF(AND(B18=\"\",C18=\"\"),\"\",D17+B18-C18)","v":169788.54999999993},"إسترداد 40 وثيقة ثمار",null,"قيد يومية",null,"2013-02-27",7]
[null,171.84,null,{"$f":"IF(AND(B19=\"\",C19=\"\"),\"\",D18+B19-C19)","v":169960.38999999993},"شراء 1 وثيقة ثمار",null,"قيد يومية",null,"2013-02-28",8]
[null,null,170.3,{"$f":"IF(AND(B20=\"\",C20=\"\"),\"\",D19+B20-C20)","v":169790.08999999994},"إسترداد 1 وثيقة ثمار",null,"قيد يومية",null,"2013-03-12",9]
[null,null,6471.44,{"$f":"IF(AND(B21=\"\",C21=\"\"),\"\",D20+B21-C21)","v":163318.64999999994},"إسترداد 38 وثيقة ثمار",null,"قيد يومية",null,"2013-03-27",10]
[null,115167.48,null,278486.12999999995,"شراء 662 وثيقة ثمار",null,"قيد يومية",null,"2013-04-14",11]
[null,null,343.6,278142.52999999997,"إسترداد 2 وثيقة ثمار",null,"قيد يومية",null,"2013-04-14",12]
[null,null,6356.56,271785.96999999997,"إسترداد 37 وثيقة ثمار",null,"قيد يومية",null,"2013-04-29",13]
[null,null,171.8,{"$f":"IF(AND(B25=\"\",C25=\"\"),\"\",D24+B25-C25)","v":271614.17},"إسترداد 1 وثيقة ثمار",null,"قيد يومية",null,"2013-05-08",14]
[null,null,null,""]
[null,null,null,{"$f":"IF(AND(B27=\"\",C27=\"\"),\"\",D26+B27-C27)","v":""}]
[null,null,null,{"$f":"IF(AND(B28=\"\",C28=\"\"),\"\",D27+B28-C28)","v":""}]
[null,null,null,""]
[null,null,null,""]
[null,null,null,{"$f":"IF(AND(B31=\"\",C31=\"\"),\"\",D30+B31-C31)","v":""}]
[null,null,null,""]
[null,null,null,""]
[null,null,null,{"$f":"IF(AND(B34=\"\",C34=\"\"),\"\",D33+B34-C34)","v":""}]
[null,null,null,{"$f":"IF(AND(B35=\"\",C35=\"\"),\"\",D34+B35-C35)","v":""}]
[null,null,null,{"$f":"IF(AND(B36=\"\",C36=\"\"),\"\",D35+B36-C36)","v":""}]
[null,null,null,""]
[null,null,null,""]
[null,null,null,""]
[null,null,null,""]
{"$rows_left_out":370}
{"sheet":"Movement","index":1,"n_rows":2000,"n_cols":14,"rows_kept":2000,"cut":false,"hidden":false,"merged":[[1999,0,1999,1]]}
["مدين","دائن","إسم الحساب","رقم\nالحساب","البيـــــــــــان","رقم\nالقيد","نوع\nالقيد","التاريخ","رقم\nالشيك","Day","Month","Year"]
[111992,0,"أجهزة ومعدات",{"$f":"IF(C2=\"\",\"\",INDEX('Chart of Accounts'!$A$2:$A$96,MATCH(C2,'Chart of Accounts'!$B$2:$B$96,0)))","v":2},"رصيد أول المدة","0/0","قيد إفتتاحية","2013-01-01",null,{"$f":"IF(H2=\"\",\"\",DAY(H2))","v":1},0,{"$f":"IF(H2=\"\",\"\",YEAR(H2))","v":2013},null,{"$f":"IF(C2=\"\",\"\",VLOOKUP(D2,data,4,0))","v":"أصول ثابتة"}]
[0,28880.109999999993,"مجمع إهلاك أجهزة ومعدات",{"$f":"IF(C3=\"\",\"\",INDEX('Chart of Accounts'!$A$2:$A$96,MATCH(C3,'Chart of Accounts'!$B$2:$B$96,0)))","v":4},"رصيد أول المدة","0/0","قيد إفتتاحية","2013-01-01",null,1,0,2013,null,{"$f":"IF(C3=\"\",\"\",VLOOKUP(D3,data,4,0))","v":"مجمع إهلاك أصول ثابتة"}]
[21363008,0,"مبانى",{"$f":"IF(C4=\"\",\"\",INDEX('Chart of Accounts'!$A$2:$A$96,MATCH(C4,'Chart of Accounts'!$B$2:$B$96,0)))","v":6},"رصيد أول المدة","0/0","قيد إفتتاحية","2013-01-01",null,1,0,2013,null,"إستثمارات عقارية"]
[0,867827.11000000022,"مجمع إهلاك مبانى",{"$f":"IF(C5=\"\",\"\",INDEX('Chart of Accounts'!$A$2:$A$96,MATCH(C5,'Chart of Accounts'!$B$2:$B$96,0)))","v":8},"رصيد أول المدة","0/0","قيد إفتتاحية","2013-01-01",null,1,0,2013,null,"مجمع إهلاك إستثمارات عقارية"]
[7088392.3799999999,0,"أقساط تأجير تمويلى مؤجلة الدفع - طويلة الأجل",{"$f":"IF(C6=\"\",\"\",INDEX('Chart of Accounts'!$A$2:$A$96,MATCH(C6,'Chart of Accounts'!$B$2:$B$96,0)))","v":10},"رصيد أول المدة","0/0","قيد إفتتاحية","2013-01-01",null,1,0,2013,null,{"$f":"IF(C6=\"\",\"\",VLOOKUP(D6,data,4,0))","v":"حسابات مدينة - طويلة الأجل"}]
[0,0,"إيرادات مستحقة",{"$f":"IF(C7=\"\",\"\",INDEX('Chart of Accounts'!$A$2:$A$96,MATCH(C7,'Chart of Accounts'!$B$2:$B$96,0)))","v":12},"رصيد أول المدة","0/0","قيد إفتتاحية","2013-01-01",null,1,0,2013,null,"مدينون وحسابات مدينة أخرى"]
[2786.3100000000009,0,"مصروفات مدفوعة مقدماً",{"$f":"IF(C8=\"\",\"\",INDEX('Chart of Accounts'!$A$2:$A$96,MATCH(C8,'Chart of Accounts'!$B$2:$B$96,0)))","v":13},"رصيد أول المدة","0/0","قيد إفتتاحية","2013-01-01",null,1,0,2013,null,"مدينون وحسابات مدينة أخرى"]
[0,0,"عهد تحت التسوية - هدى عثمان",{"$f":"IF(C9=\"\",\"\",INDEX('Chart of Accounts'!$A$2:$A$96,MATCH(C9,'Chart of Accounts'!$B$2:$B$96,0)))","v":14},"رصيد أول المدة","0/0","قيد إفتتاحية","2013-01-01",null,1,0,2013,null,"مدينون وحسابات مدينة أخرى"]
[0,0,"عهد تحت التسوية - أيمن كمال",{"$f":"IF(C10=\"\",\"\",INDEX('Chart of Accounts'!$A$2:$A$96,MATCH(C10,'Chart of Accounts'!$B$2:$B$96,0)))","v":15},"رصيد أول المدة","0/0","قيد إفتتاحية","2013-01-01",null,1,0,2013,null,"مدينون وحسابات مدينة أخرى"]
[1575198.31,0,"أقساط تأجير تمويلى مؤجلة الدفع - قصيرة الأجل",{"$f":"IF(C11=\"\",\"\",INDEX('Chart of Accounts'!$A$2:$A$96,MATCH(C11,'Chart of Accounts'!$B$2:$B$96,0)))","v":18},"رصيد أول المدة","0/0","قيد إفتتاحية","2013-01-01",null,1,0,2013,null,{"$f":"IF(C11=\"\",\"\",VLOOKUP(D11,data,4,0))","v":"مدينون وحسابات مدينة أخرى"}]
[195000,0,"أوراق قبض",{"$f":"IF(C12=\"\",\"\",INDEX('Chart of Accounts'!$A$2:$A$96,MATCH(C12,'Chart of Accounts'!$B$2:$B$96,0)))","v":19},"رصيد أول المدة","0/0","قيد إفتتاحية","2013-01-01",null,1,0,2013,null,"مدينون وحسابات مدينة أخرى"]
[0,0,"مدينو بيع إستثمارات عقارية - النيل للتأجير التمويلى",{"$f":"IF(C13=\"\",\"\",INDEX('Chart of Accounts'!$A$2:$A$96,MATCH(C13,'Chart of Accounts'!$B$2:$B$96,0)))","v":17},"رصيد أول المدة","0/0","قيد إفتتاحية","2013-01-01",null,1,0,2013,null,"مدينون وحسابات مدينة أخرى"]
[0,0,"مدينون متنوعون - شركة كونكورد العقارية",{"$f":"IF(C14=\"\",\"\",INDEX('Chart of Accounts'!$A$2:$A$96,MATCH(C14,'Chart of Accounts'!$B$2:$B$96,0)))","v":20},"رصيد أول المدة","0/0","قيد إفتتاحية","2013-01-01",null,1,0,2013,null,"مدينون وحسابات مدينة أخرى"]
[675.91999999992549,0,"وثائق صندوق ثمـــار",{"$f":"IF(C15=\"\",\"\",INDEX('Chart of Accounts'!$A$2:$A$96,MATCH(C15,'Chart of Accounts'!$B$2:$B$96,0)))","v":24},"رصيد أول المدة","0/0","قيد إفتتاحية","2013-01-01",null,1,0,2013,null,"إستثمارات فى أوراق مالية بغرض المتاجرة"]
[0,0,"النقدية بالصندوق",{"$f":"IF(C16=\"\",\"\",INDEX('Chart of Accounts'!$A$2:$A$96,MATCH(C16,'Chart of Accounts'!$B$2:$B$96,0)))","v":26},"رصيد أول المدة","0/0","قيد إفتتاحية","2013-01-01",null,1,0,2013,null,"النقدية بالصندوق"]
[0,0,"بنك مصر - جنية مصرى",{"$f":"IF(C17=\"\",\"\",INDEX('Chart of Accounts'!$A$2:$A$96,MATCH(C17,'Chart of Accounts'!$B$2:$B$96,0)))","v":32},"رصيد أول المدة","0/0","قيد إفتتاحية","2013-01-01",null,1,0,2013,null,"بنوك حسابات جارية"]
[137.80999999982305,0,"الأهلى سوسيتية جنرال - جنية مصرى",{"$f":"IF(C18=\"\",\"\",INDEX('Chart of Accounts'!$A$2:$A$96,MATCH(C18,'Chart of Accounts'!$B$2:$B$96,0)))","v":28},"رصيد أول المدة","0/0","قيد إفتتاحية","2013-01-01",null,1,0,2013,null,"بنوك حسابات جارية"]
[29203.010000000009,0,"الشركة المصرفية العربية الدولية - جنية مصرى",{"$f":"IF(C19=\"\",\"\",INDEX('Chart of Accounts'!$A$2:$A$96,MATCH(C19,'Chart of Accounts'!$B$2:$B$96,0)))","v":29},"رصيد أول المدة","0/0","قيد إفتتاحية","2013-01-01",null,1,0,2013,null,{"$f":"IF(C19=\"\",\"\",VLOOKUP(D19,data,4,0))","v":"بنوك حسابات جارية"}]
[115.09,0,"الأهلى المصرى - جنية مصرى",{"$f":"IF(C20=\"\",\"\",INDEX('Chart of Accounts'!$A$2:$A$96,MATCH(C20,'Chart of Accounts'!$B$2:$B$96,0)))","v":31},"رصيد أول المدة","0/0","قيد إفتتاحية","2013-01-01",null,1,0,2013,null,"بنوك حسابات جارية"]
[0,0,"العقارى المصرى العربى - جنية مصرى",{"$f":"IF(C21=\"\",\"\",INDEX('Chart of Accounts'!$A$2:$A$96,MATCH(C21,'Chart of Accounts'!$B$2:$B$96,0)))","v":33},"رصيد أول المدة","0/0","قيد إفتتاحية","2013-01-01",null,1,0,2013,null,"بنوك حسابات جارية"]
[3837,0,"التنمية الصناعية والعمال المصرى - جنية مصرى",{"$f":"IF(C22=\"\",\"\",INDEX('Chart of Accounts'!$A$2:$A$96,MATCH(C22,'Chart of Accounts'!$B$2:$B$96,0)))","v":34},"رصيد أول المدة","0/0","قيد إفتتاحية","2013-01-01",null,1,0,2013,null,{"$f":"IF(C22=\"\",\"\",VLOOKUP(D22,data,4,0))","v":"بنوك حسابات جارية"}]
[0,0,"الأهلى سوسيتية جنرال - يورو (ودائع)",{"$f":"IF(C23=\"\",\"\",INDEX('Chart of Accounts'!$A$2:$A$96,MATCH(C23,'Chart of Accounts'!$B$2:$B$96,0)))","v":36},"رصيد أول المدة","0/0","قيد إفتتاحية","2013-01-01",null,1,0,2013,null,"بنوك ودائع لأجل"]
[0,0,"البنك الأهلى المصرى - جنية مصرى",{"$f":"IF(C24=\"\",\"\",INDEX('Chart of Accounts'!$A$2:$A$96,MATCH(C24,'Chart of Accounts'!$B$2:$B$96,0)))","v":38},"رصيد أول المدة","0/0","قيد إفتتاحية","2013-01-01",null,1,0,2013,null,"بنوك حسابات دائنة"]
[0,108867.1,"مصروفات مستحقة",{"$f":"IF(C25=\"\",\"\",INDEX('Chart of Accounts'!$A$2:$A$96,MATCH(C25,'Chart of Accounts'!$B$2:$B$96,0)))","v":40},"رصيد أول المدة","0/0","قيد إفتتاحية","2013-01-01",null,1,0,2013,null,"دائنون وحسابات دائنة أخرى"]
[0,175.84999999999945,"هيئة التأمينات الإجتماعية",{"$f":"IF(C26=\"\",\"\",INDEX('Chart of Accounts'!$A$2:$A$96,MATCH(C26,'Chart of Accounts'!$B$2:$B$96,0)))","v":41},"رصيد أول المدة","0/0","قيد إفتتاحية","2013-01-01",null,1,0,2013,null,"دائنون وحسابات دائنة أخرى"]
[0,336050,"إيرادات مقدمة",{"$f":"IF(C27=\"\",\"\",INDEX('Chart of Accounts'!$A$2:$A$96,MATCH(C27,'Chart of Accounts'!$B$2:$B$96,0)))","v":42},"رصيد أول المدة","0/0","قيد إفتتاحية","2013-01-01",null,1,0,2013,null,"دائنون وحسابات دائنة أخرى"]
[0,100,"جارى مصلحة الضرائب - ضرائب خصم",{"$f":"IF(C28=\"\",\"\",INDEX('Chart of Accounts'!$A$2:$A$96,MATCH(C28,'Chart of Accounts'!$B$2:$B$96,0)))","v":43},"رصيد أول المدة","0/0","قيد إفتتاحية","2013-01-01",null,1,0,2013,null,"دائنون وحسابات دائنة أخرى"]
[0,0,"جارى مصلحة الضرائب - ضريبة الدخل",{"$f":"IF(C29=\"\",\"\",INDEX('Chart of Accounts'!$A$2:$A$96,MATCH(C29,'Chart of Accounts'!$B$2:$B$96,0)))","v":44},"رصيد أول المدة","0/0","قيد إفتتاحية","2013-01-01",null,1,0,2013,null,"دائنون وحسابات دائنة أخرى"]
[0,24000,"تأمينات للغير - يورو ديلى",{"$f":"IF(C30=\"\",\"\",INDEX('Chart of Accounts'!$A$2:$A$96,MATCH(C30,'Chart of Accounts'!$B$2:$B$96,0)))","v":45},"رصيد أول المدة","0/0","قيد إفتتاحية","2013-01-01",null,1,0,2013,null,"دائنون وحسابات دائنة أخرى"]
[0,195000,"تأمينات للغير - دليشوس انك",{"$f":"IF(C31=\"\",\"\",INDEX('Chart of Accounts'!$A$2:$A$96,MATCH(C31,'Chart of Accounts'!$B$2:$B$96,0)))","v":46},"رصيد أول المدة","0/0","قيد إفتتاحية","2013-01-01",null,1,0,2013,null,"دائنون وحسابات دائنة أخرى"]
[0,1355480,"أوراق دفع",{"$f":"IF(C32=\"\",\"\",INDEX('Chart of Accounts'!$A$2:$A$96,MATCH(C32,'Chart of Accounts'!$B$2:$B$96,0)))","v":47},"رصيد أول المدة","0/0","قيد إفتتاحية","2013-01-01",null,1,0,2013,null,"دائنون وحسابات دائنة أخرى"]
[0,14652.960000000001,"أرباح مؤجلة من البيع وإعادة التأجير",{"$f":"IF(C33=\"\",\"\",INDEX('Chart of Accounts'!$A$2:$A$96,MATCH(C33,'Chart of Accounts'!$B$2:$B$96,0)))","v":48},"رصيد أول المدة","0/0","قيد إفتتاحية","2013-01-01",null,1,0,2013,null,{"$f":"IF(C33=\"\",\"\",VLOOKUP(D33,data,4,0))","v":"دائنون وحسابات دائنة أخرى"}]
[0,0,"دائنون متنوعون - شركة إسكان خريجى الجيزويت",{"$f":"IF(C34=\"\",\"\",INDEX('Chart of Accounts'!$A$2:$A$96,MATCH(C34,'Chart of Accounts'!$B$2:$B$96,0)))","v":49},"رصيد أول المدة","0/0","قيد إفتتاحية","2013-01-01",null,1,0,2013,null,"دائنون وحسابات دائنة أخرى"]
[0,0,"دائنون متنوعون - مكتب صالح وحجاب",{"$f":"IF(C35=\"\",\"\",INDEX('Chart of Accounts'!$A$2:$A$96,MATCH(C35,'Chart of Accounts'!$B$2:$B$96,0)))","v":50},"رصيد أول المدة","0/0","قيد إفتتاحية","2013-01-01",null,1,0,2013,null,"دائنون وحسابات دائنة أخرى"]
[0,600000,"دائنون متنوعون - حازم بدران",{"$f":"IF(C36=\"\",\"\",INDEX('Chart of Accounts'!$A$2:$A$96,MATCH(C36,'Chart of Accounts'!$B$2:$B$96,0)))","v":51},"رصيد أول المدة","0/0","قيد إفتتاحية","2013-01-01",null,1,0,2013,null,"دائنون وحسابات دائنة أخرى"]
[0,0,"شركة إسكان خريجى الجيزويت",{"$f":"IF(C37=\"\",\"\",INDEX('Chart of Accounts'!$A$2:$A$96,MATCH(C37,'Chart of Accounts'!$B$2:$B$96,0)))","v":53},"رصيد أول المدة","0/0","قيد إفتتاحية","2013-01-01",null,1,0,2013,null,"حسابات دائنة للشركة القابضة"]
[0,140000,"شركة سوفيكو للإستثمارات المالية (ش.م.م)",{"$f":"IF(C38=\"\",\"\",INDEX('Chart of Accounts'!$A$2:$A$96,MATCH(C38,'Chart of Accounts'!$B$2:$B$96,0)))","v":54},"رصيد أول المدة","0/0","قيد إفتتاحية","2013-01-01",null,1,0,2013,null,"حسابات دائنة للشركة القابضة"]
[0,0,"الأستاذ / محمد أشرف عمر عمر",{"$f":"IF(C39=\"\",\"\",INDEX('Chart of Accounts'!$A$2:$A$96,MATCH(C39,'Chart of Accounts'!$B$2:$B$96,0)))","v":56},"رصيد أول المدة","0/0","قيد إفتتاحية","2013-01-01",null,1,0,2013,null,"حسابات جارية دائنة - مساهمين"]
[0,0,"الأستاذ / طارق أمين ملش محمد",{"$f":"IF(C40=\"\",\"\",INDEX('Chart of Accounts'!$A$2:$A$96,MATCH(C40,'Chart of Accounts'!$B$2:$B$96,0)))","v":57},"رصيد أول المدة","0/0","قيد إفتتاحية","2013-01-01",null,1,0,2013,null,"حسابات جارية دائنة - مساهمين"]
{"$rows_left_out":1961}
{"sheet":"Chart of Accounts","index":2,"n_rows":96,"n_cols":5,"rows_kept":96,"cut":false,"hidden":false,"merged":[]}
["رقم\nالحساب","إسم الحساب","طبيعة الحساب","مجموعة الحساب"]
[{"$f":"ROW()-1","v":1},"أصول ثابتة","أصول طويلة الأجل","أصول طويلة الأجل"]
[{"$f":"ROW()-1","v":2},"أجهزة ومعدات","أصول طويلة الأجل","أصول ثابتة"]
[3,"مجمع إهلاك أصول ثابتة","إلتزامات طويلة الأجل","إلتزامات طويلة الأجل"]
[4,"مجمع إهلاك أجهزة ومعدات","إلتزامات طويلة الأجل","مجمع إهلاك أصول ثابتة"]
[5,"إستثمارات عقارية","أصول طويلة الأجل","أصول طويلة الأجل"]
[6,"مبانى","أصول طويلة الأجل","إستثمارات عقارية"]
[7,"مجمع إهلاك إستثمارات عقارية","إلتزامات طويلة الأجل","إلتزامات طويلة الأجل"]
[8,"مجمع إهلاك مبانى","إلتزامات طويلة الأجل","مجمع إهلاك إستثمارات عقارية"]
[9,"حسابات مدينة - طويلة الأجل","أصول متداولة","أصول طويلة الأجل"]
[10,"أقساط تأجير تمويلى مؤجلة الدفع - طويلة الأجل","أصول متداولة","حسابات مدينة - طويلة الأجل"]
[11,"مدينون وحسابات مدينة أخرى","أصول متداولة","أصول متداولة"]
[12,"إيرادات مستحقة","أصول متداولة","مدينون وحسابات مدينة أخرى"]
[13,"مصروفات مدفوعة مقدماً","أصول متداولة","مدينون وحسابات مدينة أخرى"]
[14,"عهد تحت التسوية - هدى عثمان","أصول متداولة","مدينون وحسابات مدينة أخرى"]
[15,"عهد تحت التسوية - أيمن كمال","أصول متداولة","مدينون وحسابات مدينة أخرى"]
[16,"مدينو شراء إستثمارات عقارية","أصول متداولة","مدينون وحسابات مدينة أخرى"]
[17,"مدينو بيع إستثمارات عقارية - النيل للتأجير التمويلى","أصول متداولة","مدينون وحسابات مدينة أخرى"]
[18,"أقساط تأجير تمويلى مؤجلة الدفع - قصيرة الأجل","أصول متداولة","مدينون وحسابات مدينة أخرى"]
[19,"أوراق قبض","أصول متداولة","مدينون وحسابات مدينة أخرى"]
[20,"مدينون متنوعون - شركة كونكورد العقارية","أصول متداولة","مدينون وحسابات مدينة أخرى"]
[21,"حسابات مدينة لدى الشركة القابضة","أصول متداولة","أصول متداولة"]
[22,"شركة سوفيكو للإستثمارات المالية","أصول متداولة","حسابات مدينة لدى الشركة القابضة"]
[23,"إستثمارات فى أوراق مالية بغرض المتاجرة","أصول متداولة","أصول متداولة"]
[24,"وثائق صندوق ثمـــار","أصول متداولة","إستثمارات فى أوراق مالية بغرض المتاجرة"]
[25,"نقدية بالصندوق ولدى البنوك","أصول متداولة","أصول متداولة"]
[26,"النقدية بالصندوق","نقدية بالصندوق ولدى البنوك","النقدية بالصندوق"]
[{"$f":"ROW()-1","v":27},"بنوك حسابات جارية","أصول متداولة","أصول متداولة"]
[28,"الأهلى سوسيتية جنرال - جنية مصرى","نقدية بالصندوق ولدى البنوك","بنوك حسابات جارية","حساب رقم / 11-20312371024"]
[29,"الشركة المصرفية العربية الدولية - جنية مصرى","نقدية بالصندوق ولدى البنوك","بنوك حسابات جارية","MTL\nMedium Term Loan"]
[30,"الشركة المصرفية العربية الدولية - جنية مصرى (ذو عائد)","نقدية بالصندوق ولدى البنوك","بنوك حسابات جارية"]
[31,"الأهلى المصرى - جنية مصرى","نقدية بالصندوق ولدى البنوك","بنوك حسابات جارية"]
[32,"بنك مصر - جنية مصرى","نقدية بالصندوق ولدى البنوك","بنوك حسابات جارية"]
[33,"العقارى المصرى العربى - جنية مصرى","نقدية بالصندوق ولدى البنوك","بنوك حسابات جارية"]
[34,"التنمية الصناعية والعمال المصرى - جنية مصرى","نقدية بالصندوق ولدى البنوك","بنوك حسابات جارية"]
[35,"بنوك ودائع لأجل","أصول متداولة","أصول متداولة"]
[36,"الأهلى سوسيتية جنرال - يورو (ودائع)","أصول متداولة","بنوك ودائع لأجل"]
[37,"بنوك حسابات دائنة","إلتزامات متداولة","إلتزامات متداولة"]
[38,"البنك الأهلى المصرى - جنية مصرى","إلتزامات متداولة","بنوك حسابات دائنة"]
[39,"دائنون وحسابات دائنة أخرى","إلتزامات متداولة","إلتزامات متداولة"]
{"$rows_left_out":56}