{"text_format":"1","workbook":"xlsx","n_sheets":3,"sheets":["تفاصيل المعادلة ","البيانات","التفاصيل"],"not_rendered":{"charts":0,"images":0,"macros":0,"external_links":0,"defined_names":4,"comments":0,"pivot_tables":0},"unopened":[],"bounds":{"document_bytes":16777216,"sheet_cells":100000,"rows_first":2000,"rows_last":500,"rows_between":2000,"halvings":0,"cell_chars":16384,"cell_head_chars":4096},"cells_cut":0,"cells_raw":0,"read":"whole","date_system":"1900"}

{"sheet":"تفاصيل المعادلة ","index":0,"n_rows":11,"n_cols":9,"rows_kept":11,"cut":false,"hidden":false,"merged":[]}
["النوع","النوع","العرض","العمق","الارتفاع","العدد","كمية المساحة ","الكلفة ","الأجمالي"]
["جوانب","AB",56,0.56000000000000005,0.75,2,{"$f":"D2*E2*F2","v":0.84000000000000008},16.329999999999998,{"$f":"H2*G2","v":13.7172}]
["القاعدة","AB",0.96399999999999997,0.56000000000000005,0.75,1,{"$f":"C3*D3*F3","v":0.53983999999999999},16.329999999999998,{"$f":"H3*G3","v":8.8155871999999995}]
["الرف","AB",0.96399999999999997,0.54,null,1,{"$f":"C4*D4*F4","v":0.52056000000000002},16.329999999999998,8.5007447999999997]
["المسطرة","AB",0.96399999999999997,null,0.12,2,{"$f":"C5*E5*F5","v":0.23135999999999998},16.329999999999998,3.7781087999999992]
[]
[]
[]
[]
[]
[null,null,null,null,null,null,{"$f":"SUM(G2:G10)","v":2.1317600000000003}]

{"sheet":"البيانات","index":1,"n_rows":207,"n_cols":21,"rows_kept":207,"cut":false,"hidden":false,"merged":[]}
["ت","قياس الكابينة","MDF","PVC","ظهر","مسند","سعر MDF","سعر PVC","سعر الظهر","سعر المسند","مواد تشغيل ","الأجمالي",null,null,null,null,null,null,null,null,{"$f":"INDEX(MyFindData,SMALL(IF(ISNUMBER(SEARCH(FindText,MyFindData)),ROW(MyFindData),\"\"),ROW())-ROW(INDEX(MyFindData,1,1))+1)","v":{"$error":"#NUM!"}}]
[1,"AB 100*56*75","2.1",14.8,0.63,4,1,2,3,4,5,100,null,null,null,null,null,null,null,null,{"$error":"#NUM!"}]
[2,"AB 90*55*75","1.99",13.92,0.56999999999999995,7,null,null,null,null,null,101,null,null,null,null,null,null,null,null,{"$error":"#NUM!"}]
[3,"AB 80*55*75","1.85",13.12,0.5,6,null,null,null,null,null,102,null,null,null,null,null,null,null,null,{"$error":"#NUM!"}]
[4,"AB 75*55*75","1.85",13.12,0.5,4,null,null,null,null,null,103,null,null,null,null,null,null,null,null,{"$error":"#NUM!"}]
[5,"AB 70*55*75","1.72",12.32,0.44,4,null,null,null,null,null,104,null,null,null,null,null,null,null,null,{"$error":"#NUM!"}]
[6,"AB 60*55*75","1.59",11.52,0.37,7,null,null,null,null,null,105,null,null,null,null,null,null,null,null,{"$error":"#NUM!"}]
[7,"AB 50*55*75","1.45",10.72,0.31,4,null,null,null,null,null,106,null,null,null,null,null,null,null,null,{"$error":"#NUM!"}]
[8,"AB 45*55*75","1.39",10.32,0.27,7,null,null,null,null,null,107,null,null,null,null,null,null,null,null,{"$error":"#NUM!"}]
[9,"AB 40*55*75","1.25",9.92,0.24,4,null,null,null,null,null,108,null,null,null,null,null,null,null,null,{"$error":"#NUM!"}]
[10,"AB 35*55*75","1.22",9.52,0.22,4,null,null,null,null,null,109,null,null,null,null,null,null,null,null,{"$error":"#NUM!"}]
[11,"AB 30*55*75","1.19",9.1199999999999992,0.21,4,null,null,null,null,null,110,null,null,null,null,null,null,null,null,{"$error":"#NUM!"}]
[12,"AB 25*55*75",null,null,null,5,null,null,null,null,null,111,null,null,null,null,null,null,null,null,{"$error":"#NUM!"}]
[13,"AB 20*55*75","1.05",8.32,0.18,4,null,null,null,null,null,112,null,null,null,null,null,null,null,null,{"$error":"#NUM!"}]
[14,"AB 15*55*75","1",8,0.18,5,null,null,null,null,null,113,null,null,null,null,null,null,null,null,{"$error":"#NUM!"}]
[15,"ASB 100*55*75","1.78",14.8,0.63,5,null,null,null,null,null,114,null,null,null,null,null,null,null,null,{"$error":"#NUM!"}]
[16,"ASB 90*55*75","1.68",13.92,0.56999999999999995,51,null,null,null,null,null,115,null,null,null,null,null,null,null,null,{"$error":"#NUM!"}]
[17,"AOB 90*55*75","1.88",13.92,0.56999999999999995,4,null,null,null,null,null,null,null,null,null,null,null,null,null,null,{"$error":"#NUM!"}]
[18,"AOB 60*55*75","1.52",11.52,0.37,4,null,null,null,null,null,null,null,null,null,null,null,null,null,null,{"$error":"#NUM!"}]
[19,"ABC 90*90*55*75","3.3",17,1.28,5,null,null,null,null,null,null,null,null,null,null,null,null,null,null,{"$error":"#NUM!"}]
[20,"ABB110*55*75","2.63",19.2,0.79,4,null,null,null,null,null,null,null,null,null,null,null,null,null,null,{"$error":"#NUM!"}]
[21,"ABB 105*55*75","2.19",16,0.66,4,null,null,null,null,null,null,null,null,null,null,null,null,null,null,{"$error":"#NUM!"}]
[22,"ABB 100*55*75",null,null,null,4,null,null,null,null,null,null,null,null,null,null,null,null,null,null,{"$error":"#NUM!"}]
[23,"ABM 40*55*75","1.22",9.52,0.22,null,null,null,null,null,null,null,null,null,null,null,null,null,null,null,{"$error":"#NUM!"}]
[24,"ATBC 90*90*56*75",null,null,null,null,null,null,null,null,null,null,null,null,null,null,null,null,null,null,{"$error":"#NUM!"}]
[25,"AW 100*33*75","1.38",11.2,0.71,4,null,null,null,null,null,null,null,null,null,null,null,null,null,null,{"$error":"#NUM!"}]
[26,"AW 90*33*75","1.28",10.6,0.64,5,null,null,null,null,null,null,null,null,null,null,null,null,null,null,{"$error":"#NUM!"}]
[27,"AW 80*33*75","1.19",10.039999999999999,0.56000000000000005,5,null,null,null,null,null,null,null,null,null,null,null,null,null,null,{"$error":"#NUM!"}]
[28,"AW 75*33*75","1.19",10.039999999999999,0.56000000000000005,4,null,null,null,null,null,null,null,null,null,null,null,null,null,null,{"$error":"#NUM!"}]
[29,"AW 70*33*75","1.09",9.42,0.49,4,null,null,null,null,null,null,null,null,null,null,null,null,null,null,{"$error":"#NUM!"}]
[30,"AW 60*33*75","1",8.8000000000000007,0.42,4,null,null,null,null,null,null,null,null,null,null,null,null,null,null,{"$error":"#NUM!"}]
[31,"AW 50*33*75","0.91",8.1999999999999993,0.35,5,null,null,null,null,null,null,null,null,null,null,null,null,null,null,{"$error":"#NUM!"}]
[32,"AW 45*33*75","0.86",7.92,0.31,4,null,null,null,null,null,null,null,null,null,null,null,null,null,null,{"$error":"#NUM!"}]
[33,"AW 40*33*75","0.82",7.6,0.27,14,null,null,null,null,null,null,null,null,null,null,null,null,null,null,{"$error":"#NUM!"}]
[34,"AW 35*33*75","0.77",7.3,0.24,6,null,null,null,null,null,null,null,null,null,null,null,null,null,null,{"$error":"#NUM!"}]
[35,"AW 30*33*75","0.72",7,0.2,4,null,null,null,null,null,null,null,null,null,null,null,null,null,null,{"$error":"#NUM!"}]
[36,"AW 25*33*75","0.72",7,0.2,4,null,null,null,null,null,null,null,null,null,null,null,null,null,null,{"$error":"#NUM!"}]
[37,"AW 20*33*75","0.63",6.4,0.13,4,null,null,null,null,null,null,null,null,null,null,null,null,null,null,{"$error":"#NUM!"}]
[38,"ABW 75*33*75","1.14",9.8000000000000007,0.53,4,null,null,null,null,null,null,null,null,null,null,null,null,null,null,{"$error":"#NUM!"}]
[39,"AWC 60*60*33*75","1.59",12.28,0.84,5,null,null,null,null,null,null,null,null,null,null,null,null,null,null,{"$error":"#NUM!"}]
[40,"ATWC 60*60*33*75","1.59",15.6,0.84,5,null,null,null,null,null,null,null,null,null,null,null,null,null,null,{"$error":"#NUM!"}]
[41,"AWL42 40*42*75",null,null,null,null,null,null,null,null,null,null,null,null,null,null,null,null,null,null,{"$error":"#NUM!"}]
[42,"AWL42 45*42*75",null,null,null,null,null,null,null,null,null,null,null,null,null,null,null,null,null,null,{"$error":"#NUM!"}]
[43,"AWL42 50*42*75",null,null,null,null,null,null,null,null,null,null,null,null,null,null,null,null,null,null,{"$error":"#NUM!"}]
[44,"AWL42 60*42*75","1.09",9.42,0.49,null,null,null,null,null,null,null,null,null,null,null,null,null,null,null,{"$error":"#NUM!"}]
[45,"AWL42 75*42*75",null,null,null,null,null,null,null,null,null,null,null,null,null,null,null,null,null,null,{"$error":"#NUM!"}]
[46,"AWL42 80*42*75",null,null,null,null,null,null,null,null,null,null,null,null,null,null,null,null,null,null,{"$error":"#NUM!"}]
[47,"AWL42 90*42*75",null,null,null,null,null,null,null,null,null,null,null,null,null,null,null,null,null,null,{"$error":"#NUM!"}]
[48,"ABW 75*42*75",null,null,null,null,null,null,null,null,null,null,null,null,null,null,null,null,null,null,{"$error":"#NUM!"}]
[49,"AW 100*33*90",null,null,null,null,null,null,null,null,null,null,null,null,null,null,null,null,null,null,{"$error":"#NUM!"}]
[50,"AW 90*33*90","1.63",13.68,0.77,8,null,null,null,null,null,null,null,null,null,null,null,null,null,null,{"$error":"#NUM!"}]
[51,"AW 80*33*90","1.51",12.88,0.68,8,null,null,null,null,null,null,null,null,null,null,null,null,null,null,{"$error":"#NUM!"}]
[52,"AW 75*33*90","1.38",12.08,0.59,8,null,null,null,null,null,null,null,null,null,null,null,null,null,null,{"$error":"#NUM!"}]
[53,"AW 60*33*90","1.26",11.28,0.51,8,null,null,null,null,null,null,null,null,null,null,null,null,null,null,{"$error":"#NUM!"}]
[54,"AW 50*33*90","1.14",10.48,0.42,8,null,null,null,null,null,null,null,null,null,null,null,null,null,null,{"$error":"#NUM!"}]
[55,"AW 45*33*90","1.08",10.08,0.37,8,null,null,null,null,null,null,null,null,null,null,null,null,null,null,{"$error":"#NUM!"}]
[56,"AW 40*33*90","1.02",9.68,0.33,8,null,null,null,null,null,null,null,null,null,null,null,null,null,null,{"$error":"#NUM!"}]
[57,"AW 35*33*90",null,null,null,null,null,null,null,null,null,null,null,null,null,null,null,null,null,null,{"$error":"#NUM!"}]
[58,"AW 30*33*90",null,null,null,null,null,null,null,null,null,null,null,null,null,null,null,null,null,null,{"$error":"#NUM!"}]
[59,"ABW 75*33*90","1.45",12.4,0.64,8,null,null,null,null,null,null,null,null,null,null,null,null,null,null,{"$error":"#NUM!"}]
[60,"AWC 60*60*33*90","2.02",15.6,1.02,10,null,null,null,null,null,null,null,null,null,null,null,null,null,null,{"$error":"#NUM!"}]
[61,"ATWC 60*60*33*90","2.03",15.6,1.02,10,null,null,null,null,null,null,null,null,null,null,null,null,null,null,{"$error":"#NUM!"}]
[62,"AWL42 100*42*90",null,null,null,null,null,null,null,null,null,null,null,null,null,null,null,null,null,null,{"$error":"#NUM!"}]
[63,"AWL42 90*42*90",null,null,null,null,null,null,null,null,null,null,null,null,null,null,null,null,null,null,{"$error":"#NUM!"}]
[64,"AWL42 80*42*90",null,null,null,null,null,null,null,null,null,null,null,null,null,null,null,null,null,null,{"$error":"#NUM!"}]
[65,"AWL42 75*42*90",null,null,null,null,null,null,null,null,null,null,null,null,null,null,null,null,null,null,{"$error":"#NUM!"}]
[66,"AWL42 70*42*90",null,null,null,null,null,null,null,null,null,null,null,null,null,null,null,null,null,null,{"$error":"#NUM!"}]
[67,"AWL42 60*42*90","1.79",13.08,0.51,8,null,null,null,null,null,null,null,null,null,null,null,null,null,null,{"$error":"#NUM!"}]
[68,"AWL42 50*42*90","1.62",12.28,0.42,8,null,null,null,null,null,null,null,null,null,null,null,null,null,null,{"$error":"#NUM!"}]
[69,"AWL42 45*42*90","1.53",11.48,0.37,8,null,null,null,null,null,null,null,null,null,null,null,null,null,null,{"$error":"#NUM!"}]
[70,"AWL42 40*42*90",null,null,null,null,null,null,null,null,null,null,null,null,null,null,null,null,null,null,{"$error":"#NUM!"}]
[71,"AWL42 35*42*90",null,null,null,null,null,null,null,null,null,null,null,null,null,null,null,null,null,null,{"$error":"#NUM!"}]
[72,"AWL42 30*42*90",null,null,null,null,null,null,null,null,null,null,null,null,null,null,null,null,null,null,{"$error":"#NUM!"}]
[73,"ABW 75*42*90",null,null,null,null,null,null,null,null,null,null,null,null,null,null,null,null,null,null,{"$error":"#NUM!"}]
[74,"AW 100*33*110",null,null,null,null,null,null,null,null,null,null,null,null,null,null,null,null,null,null,{"$error":"#NUM!"}]
[75,"AW 90*33*110","1.88",15.54,0.95,null,null,null,null,null,null,null,null,null,null,null,null,null,null,null,{"$error":"#NUM!"}]
[76,"AW 80*33*110","1.75",14.73,0.84,null,null,null,null,null,null,null,null,null,null,null,null,null,null,null,{"$error":"#NUM!"}]
[77,"AW 75*33*110",null,null,null,null,null,null,null,null,null,null,null,null,null,null,null,null,null,null,{"$error":"#NUM!"}]
[78,"AW 70*33*110",null,null,null,null,null,null,null,null,null,null,null,null,null,null,null,null,null,null,{"$error":"#NUM!"}]
[79,"AW 60*33*110",null,null,null,null,null,null,null,null,null,null,null,null,null,null,null,null,null,null,{"$error":"#NUM!"}]
{"$rows_left_out":128}
{"sheet":"التفاصيل","index":2,"n_rows":1387,"n_cols":9,"rows_kept":1387,"cut":false,"hidden":false,"merged":[]}
["نوع الكابينة ","مبلغ التكلفة ","مبلغ البيع ","صافي الربح ","رقم الفاتورة ","اسم الزبون ","الجهة ","الكود ","الملاحظات"]
["AB 100*56*75",{"$f":"IFERROR(VLOOKUP($A2,البيانات!$B$2:$L$207,11,FALSE),\"\")","v":100},null,{"$f":"IFERROR(C2-B2,\"\")","v":-100}]
["AB 90*55*75",{"$f":"IFERROR(VLOOKUP($A3,البيانات!$B$2:$L$207,11,FALSE),\"\")","v":101},null,{"$f":"IFERROR(C3-B3,\"\")","v":-101}]
["ASB 90*55*75",{"$f":"IFERROR(VLOOKUP($A4,البيانات!$B$2:$L$207,11,FALSE),\"\")","v":115},null,-115]
["AB 90*55*75",{"$f":"IFERROR(VLOOKUP($A5,البيانات!$B$2:$L$207,11,FALSE),\"\")","v":101},null,-101]
["AB 80*55*75",{"$f":"IFERROR(VLOOKUP($A6,البيانات!$B$2:$L$207,11,FALSE),\"\")","v":102},null,-102]
["AB 100*56*75",{"$f":"IFERROR(VLOOKUP($A7,البيانات!$B$2:$L$207,11,FALSE),\"\")","v":100},null,-100]
[null,{"$f":"IFERROR(VLOOKUP($A8,البيانات!$B$2:$L$207,11,FALSE),\"\")","v":""},null,""]
[null,{"$f":"IFERROR(VLOOKUP($A9,البيانات!$B$2:$L$207,11,FALSE),\"\")","v":""},null,""]
[null,{"$f":"IFERROR(VLOOKUP($A10,البيانات!$B$2:$L$207,11,FALSE),\"\")","v":""},null,""]
[null,{"$f":"IFERROR(VLOOKUP($A11,البيانات!$B$2:$L$207,11,FALSE),\"\")","v":""},null,""]
[null,{"$f":"IFERROR(VLOOKUP($A12,البيانات!$B$2:$L$207,11,FALSE),\"\")","v":""},null,""]
[null,{"$f":"IFERROR(VLOOKUP($A13,البيانات!$B$2:$L$207,11,FALSE),\"\")","v":""},null,""]
[null,{"$f":"IFERROR(VLOOKUP($A14,البيانات!$B$2:$L$207,11,FALSE),\"\")","v":""},null,""]
[null,{"$f":"IFERROR(VLOOKUP($A15,البيانات!$B$2:$L$207,11,FALSE),\"\")","v":""},null,""]
[null,{"$f":"IFERROR(VLOOKUP($A16,البيانات!$B$2:$L$207,11,FALSE),\"\")","v":""},null,""]
[null,{"$f":"IFERROR(VLOOKUP($A17,البيانات!$B$2:$L$207,11,FALSE),\"\")","v":""},null,""]
[null,{"$f":"IFERROR(VLOOKUP($A18,البيانات!$B$2:$L$207,11,FALSE),\"\")","v":""},null,""]
[null,{"$f":"IFERROR(VLOOKUP($A19,البيانات!$B$2:$L$207,11,FALSE),\"\")","v":""},null,""]
[null,{"$f":"IFERROR(VLOOKUP($A20,البيانات!$B$2:$L$207,11,FALSE),\"\")","v":""},null,""]
[null,{"$f":"IFERROR(VLOOKUP($A21,البيانات!$B$2:$L$207,11,FALSE),\"\")","v":""},null,""]
[null,{"$f":"IFERROR(VLOOKUP($A22,البيانات!$B$2:$L$207,11,FALSE),\"\")","v":""},null,""]
[null,{"$f":"IFERROR(VLOOKUP($A23,البيانات!$B$2:$L$207,11,FALSE),\"\")","v":""},null,""]
[null,{"$f":"IFERROR(VLOOKUP($A24,البيانات!$B$2:$L$207,11,FALSE),\"\")","v":""},null,""]
[null,{"$f":"IFERROR(VLOOKUP($A25,البيانات!$B$2:$L$207,11,FALSE),\"\")","v":""},null,""]
[null,{"$f":"IFERROR(VLOOKUP($A26,البيانات!$B$2:$L$207,11,FALSE),\"\")","v":""},null,""]
[null,{"$f":"IFERROR(VLOOKUP($A27,البيانات!$B$2:$L$207,11,FALSE),\"\")","v":""},null,""]
[null,{"$f":"IFERROR(VLOOKUP($A28,البيانات!$B$2:$L$207,11,FALSE),\"\")","v":""},null,""]
[null,{"$f":"IFERROR(VLOOKUP($A29,البيانات!$B$2:$L$207,11,FALSE),\"\")","v":""},null,""]
[null,{"$f":"IFERROR(VLOOKUP($A30,البيانات!$B$2:$L$207,11,FALSE),\"\")","v":""},null,""]
[null,{"$f":"IFERROR(VLOOKUP($A31,البيانات!$B$2:$L$207,11,FALSE),\"\")","v":""},null,""]
[null,{"$f":"IFERROR(VLOOKUP($A32,البيانات!$B$2:$L$207,11,FALSE),\"\")","v":""},null,""]
[null,{"$f":"IFERROR(VLOOKUP($A33,البيانات!$B$2:$L$207,11,FALSE),\"\")","v":""},null,""]
[null,{"$f":"IFERROR(VLOOKUP($A34,البيانات!$B$2:$L$207,11,FALSE),\"\")","v":""},null,""]
[null,{"$f":"IFERROR(VLOOKUP($A35,البيانات!$B$2:$L$207,11,FALSE),\"\")","v":""},null,""]
[null,{"$f":"IFERROR(VLOOKUP($A36,البيانات!$B$2:$L$207,11,FALSE),\"\")","v":""},null,""]
[null,{"$f":"IFERROR(VLOOKUP($A37,البيانات!$B$2:$L$207,11,FALSE),\"\")","v":""},null,""]
[null,{"$f":"IFERROR(VLOOKUP($A38,البيانات!$B$2:$L$207,11,FALSE),\"\")","v":""},null,""]
[null,{"$f":"IFERROR(VLOOKUP($A39,البيانات!$B$2:$L$207,11,FALSE),\"\")","v":""},null,""]
[null,{"$f":"IFERROR(VLOOKUP($A40,البيانات!$B$2:$L$207,11,FALSE),\"\")","v":""},null,""]
[null,{"$f":"IFERROR(VLOOKUP($A41,البيانات!$B$2:$L$207,11,FALSE),\"\")","v":""},null,""]
[null,{"$f":"IFERROR(VLOOKUP($A42,البيانات!$B$2:$L$207,11,FALSE),\"\")","v":""},null,""]
[null,{"$f":"IFERROR(VLOOKUP($A43,البيانات!$B$2:$L$207,11,FALSE),\"\")","v":""},null,""]
[null,{"$f":"IFERROR(VLOOKUP($A44,البيانات!$B$2:$L$207,11,FALSE),\"\")","v":""},null,""]
[null,{"$f":"IFERROR(VLOOKUP($A45,البيانات!$B$2:$L$207,11,FALSE),\"\")","v":""},null,""]
[null,{"$f":"IFERROR(VLOOKUP($A46,البيانات!$B$2:$L$207,11,FALSE),\"\")","v":""},null,""]
[null,{"$f":"IFERROR(VLOOKUP($A47,البيانات!$B$2:$L$207,11,FALSE),\"\")","v":""},null,""]
[null,{"$f":"IFERROR(VLOOKUP($A48,البيانات!$B$2:$L$207,11,FALSE),\"\")","v":""},null,""]
[null,{"$f":"IFERROR(VLOOKUP($A49,البيانات!$B$2:$L$207,11,FALSE),\"\")","v":""},null,""]
[null,{"$f":"IFERROR(VLOOKUP($A50,البيانات!$B$2:$L$207,11,FALSE),\"\")","v":""},null,""]
[null,{"$f":"IFERROR(VLOOKUP($A51,البيانات!$B$2:$L$207,11,FALSE),\"\")","v":""},null,""]
[null,{"$f":"IFERROR(VLOOKUP($A52,البيانات!$B$2:$L$207,11,FALSE),\"\")","v":""},null,""]
[null,{"$f":"IFERROR(VLOOKUP($A53,البيانات!$B$2:$L$207,11,FALSE),\"\")","v":""},null,""]
[null,{"$f":"IFERROR(VLOOKUP($A54,البيانات!$B$2:$L$207,11,FALSE),\"\")","v":""},null,""]
[null,{"$f":"IFERROR(VLOOKUP($A55,البيانات!$B$2:$L$207,11,FALSE),\"\")","v":""},null,""]
[null,{"$f":"IFERROR(VLOOKUP($A56,البيانات!$B$2:$L$207,11,FALSE),\"\")","v":""},null,""]
[null,{"$f":"IFERROR(VLOOKUP($A57,البيانات!$B$2:$L$207,11,FALSE),\"\")","v":""},null,""]
[null,{"$f":"IFERROR(VLOOKUP($A58,البيانات!$B$2:$L$207,11,FALSE),\"\")","v":""},null,""]
[null,{"$f":"IFERROR(VLOOKUP($A59,البيانات!$B$2:$L$207,11,FALSE),\"\")","v":""},null,""]
[null,{"$f":"IFERROR(VLOOKUP($A60,البيانات!$B$2:$L$207,11,FALSE),\"\")","v":""},null,""]
[null,{"$f":"IFERROR(VLOOKUP($A61,البيانات!$B$2:$L$207,11,FALSE),\"\")","v":""},null,""]
[null,{"$f":"IFERROR(VLOOKUP($A62,البيانات!$B$2:$L$207,11,FALSE),\"\")","v":""},null,""]
[null,{"$f":"IFERROR(VLOOKUP($A63,البيانات!$B$2:$L$207,11,FALSE),\"\")","v":""},null,""]
[null,{"$f":"IFERROR(VLOOKUP($A64,البيانات!$B$2:$L$207,11,FALSE),\"\")","v":""},null,""]
[null,{"$f":"IFERROR(VLOOKUP($A65,البيانات!$B$2:$L$207,11,FALSE),\"\")","v":""},null,""]
[null,{"$f":"IFERROR(VLOOKUP($A66,البيانات!$B$2:$L$207,11,FALSE),\"\")","v":""},null,""]
[null,{"$f":"IFERROR(VLOOKUP($A67,البيانات!$B$2:$L$207,11,FALSE),\"\")","v":""},null,{"$f":"IFERROR(C67-B67,\"\")","v":""}]
[null,{"$f":"IFERROR(VLOOKUP($A68,البيانات!$B$2:$L$207,11,FALSE),\"\")","v":""},null,""]
[null,{"$f":"IFERROR(VLOOKUP($A69,البيانات!$B$2:$L$207,11,FALSE),\"\")","v":""},null,""]
[null,{"$f":"IFERROR(VLOOKUP($A70,البيانات!$B$2:$L$207,11,FALSE),\"\")","v":""},null,""]
[null,{"$f":"IFERROR(VLOOKUP($A71,البيانات!$B$2:$L$207,11,FALSE),\"\")","v":""},null,""]
[null,{"$f":"IFERROR(VLOOKUP($A72,البيانات!$B$2:$L$207,11,FALSE),\"\")","v":""},null,""]
[null,{"$f":"IFERROR(VLOOKUP($A73,البيانات!$B$2:$L$207,11,FALSE),\"\")","v":""},null,""]
[null,{"$f":"IFERROR(VLOOKUP($A74,البيانات!$B$2:$L$207,11,FALSE),\"\")","v":""},null,""]
[null,{"$f":"IFERROR(VLOOKUP($A75,البيانات!$B$2:$L$207,11,FALSE),\"\")","v":""},null,""]
[null,{"$f":"IFERROR(VLOOKUP($A76,البيانات!$B$2:$L$207,11,FALSE),\"\")","v":""},null,""]
[null,{"$f":"IFERROR(VLOOKUP($A77,البيانات!$B$2:$L$207,11,FALSE),\"\")","v":""},null,""]
[null,{"$f":"IFERROR(VLOOKUP($A78,البيانات!$B$2:$L$207,11,FALSE),\"\")","v":""},null,""]
[null,{"$f":"IFERROR(VLOOKUP($A79,البيانات!$B$2:$L$207,11,FALSE),\"\")","v":""},null,""]
[null,{"$f":"IFERROR(VLOOKUP($A80,البيانات!$B$2:$L$207,11,FALSE),\"\")","v":""},null,""]
{"$rows_left_out":1307}