{"text_format":"1","workbook":"xlsx","n_sheets":9,"sheets":["index","ST-tems -138","Templete","101","102","103","104","105","106"],"not_rendered":{"charts":0,"images":0,"macros":1,"external_links":0,"defined_names":1,"comments":0,"pivot_tables":0},"unopened":[],"bounds":{"document_bytes":16777216,"sheet_cells":100000,"rows_first":2000,"rows_last":500,"rows_between":2000,"halvings":0,"cell_chars":16384,"cell_head_chars":4096},"cells_cut":0,"cells_raw":0,"read":"whole","date_system":"1900"}

{"sheet":"index","index":0,"n_rows":9,"n_cols":12,"rows_kept":9,"cut":false,"hidden":false,"merged":[]}
[]
[]
[null,null,"رقم الطلبيه","التاريخ ","امين المخزن"]
[null,null,101,"2018-01-01",null,null,null,null,null,null,null,{"$f":"IF(C13<>\"\",VLOOKAnyCol(dataazzam,C13,1,2),\"\")","v":""}]
[null,null,102,"2017-05-01"]
[null,null,103]
[null,null,104]
[null,null,105]
[null,null,106]

{"sheet":"ST-tems -138","index":1,"n_rows":1173,"n_cols":5,"rows_kept":1173,"cut":false,"hidden":false,"merged":[]}
[]
[null,"رقم الصنف","الصنف","المجموعه","الوحده"]
[1,110309304,"         تراوت     ","اسماك مدخنة","KGM"]
[2,110805104,"           كمومبرت كج","جبن مطبوخ","EA."]
[3,110805603,"           بيبي بل   ","جبن مطبوخ","EA."]
[4,111103324,"             كبدبط حلل ","فواجراة","EA."]
[5,120101107,"   كبدة      ","بتلو","KGM"]
[6,120101109,"                بتلومشفى  ","بتلو","KGM"]
[7,120101110,"ف/م 4أجزاء","بتلو","KGM"]
[8,120101111," بتلو","VEEL  فلتو","KGM"]
[9,120101112,"    بتلوروزبيف","بتلو","KGM"]
[10,120101115,"  فلتو بتلو ","بتلو","KGM"]
[11,120101117,"كبدةبتلو/م","بتلو","KGM"]
[12,120101123,"                ف/بتلو4قطع","بتلو","KGM"]
[13,120102107,"                ف/ضا/مشفى ","ضانى","KGM"]
[14,120102109,"                افخاد ضانى","ضانى","KGM"]
[15,120102111,"                ريش ضانى/ب","ضانى","KGM"]
[16,120102112,"                فخدضانى عظ","ضانى","KGM"]
[17,120102113,"                ريش ضانى م","ضانى","KGM"]
[18,120102115,"                ريش ضانى  ","ضانى","KGM"]
[19,120103103,"               عروق      ","كندوز","KGM"]
[20,120103111,"               روزبيف    ","كندوز","KGM"]
[21,120103203,"               كندوز","Nفلتومستور","KGM"]
[22,120103204,"               وش فخدة مس","كندوز","KGM"]
[23,120103208,"               فلتو/ك/بلد","كندوز","KGM"]
[24,120103210,"               ظهرفخدةبرا","كندوز","KGM"]
[25,120103211,"               امامى كتف ","كندوز","KGM"]
[26,120103212,"               ج امامى سن","كندوز","KGM"]
[27,120103213,"               امامى موزة","كندوز","KGM"]
[28,120103214,"               وش ف برزيل","كندوز","KGM"]
[29,120103215,"               ك/ظهرفخدةأ","كندوز","KGM"]
[30,120103217,"               كتف كندوزم","كندوز","KGM"]
[31,120109106,"      فرنك فورتر","لحوم نصف مصنعة","KGM"]
[32,120109113,"      سجق فراخ ل","لحوم نصف مصنعة","KGM"]
[33,120109114,"      سجق بقرى  ","لحوم نصف مصنعة","KGM"]
[34,120110010," كبيبةمينى ","لحوم مصنعه سندوتشات","KGM"]
[35,120110011," كبيبةكبيرة","لحوم مصنعه سندوتشات","KGM"]
[36,120110012," كبيبة فراخ","لحوم مصنعه سندوتشات","KGM"]
[37,120110013," كفتة بانيه","لحوم مصنعه سندوتشات","KGM"]
[38,120201202,"            لحم صدر   ","ديك رومى","KGM"]
[39,120202102,"                فراخ مجمدة","فراخ","EA."]
[40,120202201,"                صدرمشفى   ","فراخ","KGM"]
[41,120202206,"                وراك مخلية","فراخ","KGM"]
[42,120202213,"                صدرفراخ130","فراخ","KGM"]
[43,120202214,"                صدرفرخ100ج","فراخ","KGM"]
[44,120202215,"                فراخ مجمدة","فراخ","EA."]
[45,120202231,"                فراخ برقبة","فراخ","EA."]
[46,120202232,"                ص200:160جم","فراخ","KGM"]
[47,120203102," بط مزارع  ","بط","EA."]
[48,120203103,"                  صدربط مشفى","بط","KGM"]
[49,120204101,"حمام بلدى ","حمام/سمان","EA."]
[50,120205101," بيض ابيض  ","بيض","EA."]
[51,120205106," بيض60:50جم","بيض","EA."]
[52,120301201,"فيليه     ","سمك فيليه مستورد","KGM"]
[53,120301202,"سمك فيليه ","سمك فيليه مستورد","KGM"]
[54,120301204,"موسى مجمد ","سمك فيليه مستورد","KGM"]
[55,120301208," قشر بياض  ","سمك فيليه مستورد","KGM"]
[56,120301210,"سبيط      ","سمك فيليه مستورد","KGM"]
[57,120301211,"طازج نظيف","سمك فيليه مستورد ","KGM"]
[58,120301215,"سمك سالمون","سمك فيليه مستورد","KGM"]
{"$rows_left_out":1114}
{"sheet":"Templete","index":2,"n_rows":200,"n_cols":9,"rows_kept":200,"cut":false,"hidden":false,"merged":[[9,1,9,2],[7,5,7,6],[5,5,5,6],[3,5,3,6],[2,1,2,8],[8,1,8,2]]}
[]
[]
[null,"طـــلبية احتياجات التشغيل"]
[null,null,null,null,"رقــــم الطــلــبــيــه :",null,null,null,"بالطائره لحاجه العمل الماسه"]
[]
[null,null,null,null,"الــــتـــاريـــــــــــخ :",null,null,{"$f":"VLOOKAnyCol(dataazzam,G6,1,2)","v":"مجففة680جم"},"بسياره الطلبيه"]
[]
[null,null,null,null,"طريقه الارسال المطلوبه:","بالطائره لحاجه العمل الماسه"]
[null,"استكمالاً للطلببيه رقم  :"]
[null,"المــــــــــــــــــــــؤرخه :"]
[]
[null,"م","رقم الصنف","الصنف","المجموعه","الوحده","الكميه المطلوبه","الرصيد","ملاحظات"]
[null,null,121401462,{"$f":"IF(C13<>\"\",VLOOKAnyCol(dataazzam,C13,1,2),\"\")","v":"        تونكيز    "},{"$f":"IF(C13<>\"\",VLOOKAnyCol(dataazzam,C13,1,3),\"\")","v":"بسكويت انواع"},{"$f":"IF(C13<>\"\",VLOOKAnyCol(dataazzam,C13,1,4),\"\")","v":"EA."}]
[null,null,null,"","",""]
[null,null,null,"","",""]
[null,null,null,"","",""]
[null,null,null,"","",""]
[null,null,null,"","",""]
[null,null,null,"","",""]
[null,null,null,"","",""]
[null,null,null,"","",""]
[null,null,null,"","",""]
[null,null,null,"","",""]
[null,null,null,"","",""]
[null,null,null,"","",""]
[null,null,null,"","",""]
[null,null,null,"","",""]
[null,null,null,"","",""]
[null,null,null,"","",""]
[null,null,null,"","",""]
[null,null,null,"","",""]
[null,null,null,"","",""]
[null,null,null,"","",""]
[null,null,null,"","",""]
[null,null,null,"","",""]
[null,null,null,"","",""]
[null,null,null,"","",""]
[null,null,null,"","",""]
[null,null,null,"","",""]
[null,null,null,"","",""]
[null,null,null,"","",""]
[null,null,null,"","",""]
[null,null,null,"","",""]
[null,null,null,"","",""]
[null,null,null,{"$f":"IF(C45<>\"\",VLOOKAnyCol(dataazzam,C45,1,2),\"\")","v":""},{"$f":"IF(C45<>\"\",VLOOKAnyCol(dataazzam,C45,1,3),\"\")","v":""},{"$f":"IF(C45<>\"\",VLOOKAnyCol(dataazzam,C45,1,4),\"\")","v":""}]
[null,null,null,"","",""]
[null,null,null,"","",""]
[null,null,null,"","",""]
[null,null,null,"","",""]
[null,null,null,"","",""]
[null,null,null,"","",""]
[null,null,null,"","",""]
[null,null,null,"","",""]
[null,null,null,"","",""]
[null,null,null,"","",""]
[null,null,null,"","",""]
[null,null,null,"","",""]
[null,null,null,"","",""]
[null,null,null,"","",""]
[null,null,null,"","",""]
{"$rows_left_out":141}
{"sheet":"101","index":3,"n_rows":200,"n_cols":9,"rows_kept":200,"cut":false,"hidden":false,"merged":[[2,1,2,8],[3,5,3,6],[5,5,5,6],[7,5,7,6],[8,1,8,2],[9,1,9,2]]}
[]
[]
[null,"طـــلبية احتياجات التشغيل"]
[null,null,null,null,"رقــــم الطــلــبــيــه :",{"$f":"index!C4","v":101},null,null,"بالطائره لحاجه العمل الماسه"]
[]
[null,null,null,null,"الــــتـــاريـــــــــــخ :",{"$f":"IF(index!D4=\"\",\"\",VLOOKUP(F4,index!$C$4:$D$656,2,0))","v":"2018-01-01"},null,{"$f":"VLOOKAnyCol(dataazzam,G6,1,2)","v":"مجففة680جم"},"بسياره الطلبيه"]
[]
[null,null,null,null,"طريقه الارسال المطلوبه:","بالطائره لحاجه العمل الماسه"]
[null,"استكمالاً للطلببيه رقم  :"]
[null,"المــــــــــــــــــــــؤرخه :"]
[]
[null,"م","رقم الصنف","الصنف","المجموعه","الوحده","الكميه المطلوبه","الرصيد","ملاحظات"]
[null,null,121401462,{"$f":"IF(C13<>\"\",VLOOKAnyCol(dataazzam,C13,1,2),\"\")","v":"        تونكيز    "},{"$f":"IF(C13<>\"\",VLOOKAnyCol(dataazzam,C13,1,3),\"\")","v":"بسكويت انواع"},{"$f":"IF(C13<>\"\",VLOOKAnyCol(dataazzam,C13,1,4),\"\")","v":"EA."}]
[null,null,null,"","",""]
[null,null,null,"","",""]
[null,null,null,"","",""]
[null,null,null,"","",""]
[null,null,null,"","",""]
[null,null,null,"","",""]
[null,null,null,"","",""]
[null,null,null,"","",""]
[null,null,null,"","",""]
[null,null,null,"","",""]
[null,null,null,"","",""]
[null,null,null,"","",""]
[null,null,null,"","",""]
[null,null,null,"","",""]
[null,null,null,"","",""]
[null,null,null,"","",""]
[null,null,null,"","",""]
[null,null,null,"","",""]
[null,null,null,"","",""]
[null,null,null,"","",""]
[null,null,null,"","",""]
[null,null,null,"","",""]
[null,null,null,"","",""]
[null,null,null,"","",""]
[null,null,null,"","",""]
[null,null,null,"","",""]
[null,null,null,"","",""]
[null,null,null,"","",""]
[null,null,null,"","",""]
[null,null,null,"","",""]
[null,null,null,"","",""]
[null,null,null,"","",""]
[null,null,null,"","",""]
[null,null,null,"","",""]
[null,null,null,"","",""]
[null,null,null,"","",""]
[null,null,null,"","",""]
[null,null,null,"","",""]
[null,null,null,"","",""]
[null,null,null,"","",""]
[null,null,null,"","",""]
[null,null,null,"","",""]
[null,null,null,"","",""]
[null,null,null,"","",""]
[null,null,null,"","",""]
[null,null,null,"","",""]
[null,null,null,"","",""]
{"$rows_left_out":141}
{"sheet":"102","index":4,"n_rows":200,"n_cols":9,"rows_kept":200,"cut":false,"hidden":false,"merged":[[2,1,2,8],[3,5,3,6],[5,5,5,6],[7,5,7,6],[8,1,8,2],[9,1,9,2]]}
[]
[]
[null,"طـــلبية احتياجات التشغيل"]
[null,null,null,null,"رقــــم الطــلــبــيــه :",102,null,null,"بالطائره لحاجه العمل الماسه"]
[]
[null,null,null,null,"الــــتـــاريـــــــــــخ :",{"$f":"IF(index!D4=\"\",\"\",VLOOKUP(F4,index!$C$4:$D$656,2,0))","v":"2017-05-01"},null,{"$f":"VLOOKAnyCol(dataazzam,G6,1,2)","v":"مجففة680جم"},"بسياره الطلبيه"]
[]
[null,null,null,null,"طريقه الارسال المطلوبه:","بالطائره لحاجه العمل الماسه"]
[null,"استكمالاً للطلببيه رقم  :"]
[null,"المــــــــــــــــــــــؤرخه :"]
[]
[null,"م","رقم الصنف","الصنف","المجموعه","الوحده","الكميه المطلوبه","الرصيد","ملاحظات"]
[null,null,121401462,{"$f":"IF(C13<>\"\",VLOOKAnyCol(dataazzam,C13,1,2),\"\")","v":"        تونكيز    "},{"$f":"IF(C13<>\"\",VLOOKAnyCol(dataazzam,C13,1,3),\"\")","v":"بسكويت انواع"},{"$f":"IF(C13<>\"\",VLOOKAnyCol(dataazzam,C13,1,4),\"\")","v":"EA."}]
[null,null,null,"","",""]
[null,null,null,"","",""]
[null,null,null,"","",""]
[null,null,null,"","",""]
[null,null,null,"","",""]
[null,null,null,"","",""]
[null,null,null,"","",""]
[null,null,null,"","",""]
[null,null,null,"","",""]
[null,null,null,"","",""]
[null,null,null,"","",""]
[null,null,null,"","",""]
[null,null,null,"","",""]
[null,null,null,"","",""]
[null,null,null,"","",""]
[null,null,null,"","",""]
[null,null,null,"","",""]
[null,null,null,"","",""]
[null,null,null,"","",""]
[null,null,null,"","",""]
[null,null,null,"","",""]
[null,null,null,"","",""]
[null,null,null,"","",""]
[null,null,null,"","",""]
[null,null,null,"","",""]
[null,null,null,"","",""]
[null,null,null,"","",""]
[null,null,null,"","",""]
[null,null,null,"","",""]
[null,null,null,"","",""]
[null,null,null,"","",""]
[null,null,null,"","",""]
[null,null,null,"","",""]
[null,null,null,"","",""]
[null,null,null,"","",""]
[null,null,null,"","",""]
[null,null,null,"","",""]
[null,null,null,"","",""]
[null,null,null,"","",""]
[null,null,null,"","",""]
[null,null,null,"","",""]
[null,null,null,"","",""]
[null,null,null,"","",""]
[null,null,null,"","",""]
[null,null,null,"","",""]
[null,null,null,"","",""]
[null,null,null,"","",""]
{"$rows_left_out":141}
{"sheet":"103","index":5,"n_rows":200,"n_cols":9,"rows_kept":200,"cut":false,"hidden":false,"merged":[[2,1,2,8],[3,5,3,6],[5,5,5,6],[7,5,7,6],[8,1,8,2],[9,1,9,2]]}
[]
[]
[null,"طـــلبية احتياجات التشغيل"]
[null,null,null,null,"رقــــم الطــلــبــيــه :",103,null,null,"بالطائره لحاجه العمل الماسه"]
[]
[null,null,null,null,"الــــتـــاريـــــــــــخ :",{"$f":"IF(index!D4=\"\",\"\",VLOOKUP(F4,index!$C$4:$D$656,2,0))","v":"00:00:00"},null,{"$f":"VLOOKAnyCol(dataazzam,G6,1,2)","v":"مجففة680جم"},"بسياره الطلبيه"]
[]
[null,null,null,null,"طريقه الارسال المطلوبه:","بالطائره لحاجه العمل الماسه"]
[null,"استكمالاً للطلببيه رقم  :"]
[null,"المــــــــــــــــــــــؤرخه :"]
[]
[null,"م","رقم الصنف","الصنف","المجموعه","الوحده","الكميه المطلوبه","الرصيد","ملاحظات"]
[null,null,121401462,{"$f":"IF(C13<>\"\",VLOOKAnyCol(dataazzam,C13,1,2),\"\")","v":"        تونكيز    "},{"$f":"IF(C13<>\"\",VLOOKAnyCol(dataazzam,C13,1,3),\"\")","v":"بسكويت انواع"},{"$f":"IF(C13<>\"\",VLOOKAnyCol(dataazzam,C13,1,4),\"\")","v":"EA."}]
[null,null,null,"","",""]
[null,null,null,"","",""]
[null,null,null,"","",""]
[null,null,null,"","",""]
[null,null,null,"","",""]
[null,null,null,"","",""]
[null,null,null,"","",""]
[null,null,null,"","",""]
[null,null,null,"","",""]
[null,null,null,"","",""]
[null,null,null,"","",""]
[null,null,null,"","",""]
[null,null,null,"","",""]
[null,null,null,"","",""]
[null,null,null,"","",""]
[null,null,null,"","",""]
[null,null,null,"","",""]
[null,null,null,"","",""]
[null,null,null,"","",""]
[null,null,null,"","",""]
[null,null,null,"","",""]
[null,null,null,"","",""]
[null,null,null,"","",""]
[null,null,null,"","",""]
[null,null,null,"","",""]
[null,null,null,"","",""]
[null,null,null,"","",""]
[null,null,null,"","",""]
[null,null,null,"","",""]
[null,null,null,"","",""]
[null,null,null,"","",""]
[null,null,null,"","",""]
[null,null,null,"","",""]
[null,null,null,"","",""]
[null,null,null,"","",""]
[null,null,null,"","",""]
[null,null,null,"","",""]
[null,null,null,"","",""]
[null,null,null,"","",""]
[null,null,null,"","",""]
[null,null,null,"","",""]
[null,null,null,"","",""]
[null,null,null,"","",""]
[null,null,null,"","",""]
[null,null,null,"","",""]
[null,null,null,"","",""]
[null,null,null,"","",""]
{"$rows_left_out":141}
{"sheet":"104","index":6,"n_rows":200,"n_cols":9,"rows_kept":200,"cut":false,"hidden":false,"merged":[[2,1,2,8],[3,5,3,6],[5,5,5,6],[7,5,7,6],[8,1,8,2],[9,1,9,2]]}
[]
[]
[null,"طـــلبية احتياجات التشغيل"]
[null,null,null,null,"رقــــم الطــلــبــيــه :",104,null,null,"بالطائره لحاجه العمل الماسه"]
[]
[null,null,null,null,"الــــتـــاريـــــــــــخ :",{"$f":"IF(index!D4=\"\",\"\",VLOOKUP(F4,index!$C$4:$D$656,2,0))","v":"00:00:00"},null,{"$f":"VLOOKAnyCol(dataazzam,G6,1,2)","v":"مجففة680جم"},"بسياره الطلبيه"]
[]
[null,null,null,null,"طريقه الارسال المطلوبه:","بالطائره لحاجه العمل الماسه"]
[null,"استكمالاً للطلببيه رقم  :"]
[null,"المــــــــــــــــــــــؤرخه :"]
[]
[null,"م","رقم الصنف","الصنف","المجموعه","الوحده","الكميه المطلوبه","الرصيد","ملاحظات"]
[null,null,121401462,{"$f":"IF(C13<>\"\",VLOOKAnyCol(dataazzam,C13,1,2),\"\")","v":"        تونكيز    "},{"$f":"IF(C13<>\"\",VLOOKAnyCol(dataazzam,C13,1,3),\"\")","v":"بسكويت انواع"},{"$f":"IF(C13<>\"\",VLOOKAnyCol(dataazzam,C13,1,4),\"\")","v":"EA."}]
[null,null,null,"","",""]
[null,null,null,"","",""]
[null,null,null,"","",""]
[null,null,null,"","",""]
[null,null,null,"","",""]
[null,null,null,"","",""]
[null,null,null,"","",""]
[null,null,null,"","",""]
[null,null,null,"","",""]
[null,null,null,"","",""]
[null,null,null,"","",""]
[null,null,null,"","",""]
[null,null,null,"","",""]
[null,null,null,"","",""]
[null,null,null,"","",""]
[null,null,null,"","",""]
[null,null,null,"","",""]
[null,null,null,"","",""]
[null,null,null,"","",""]
[null,null,null,"","",""]
[null,null,null,"","",""]
[null,null,null,"","",""]
[null,null,null,"","",""]
[null,null,null,"","",""]
[null,null,null,"","",""]
[null,null,null,"","",""]
[null,null,null,"","",""]
[null,null,null,"","",""]
[null,null,null,"","",""]
[null,null,null,"","",""]
[null,null,null,"","",""]
[null,null,null,"","",""]
[null,null,null,"","",""]
[null,null,null,"","",""]
[null,null,null,"","",""]
[null,null,null,"","",""]
[null,null,null,"","",""]
[null,null,null,"","",""]
[null,null,null,"","",""]
[null,null,null,"","",""]
[null,null,null,"","",""]
[null,null,null,"","",""]
[null,null,null,"","",""]
[null,null,null,"","",""]
[null,null,null,"","",""]
[null,null,null,"","",""]
[null,null,null,"","",""]
{"$rows_left_out":141}
{"sheet":"105","index":7,"n_rows":200,"n_cols":9,"rows_kept":200,"cut":false,"hidden":false,"merged":[[2,1,2,8],[3,5,3,6],[5,5,5,6],[7,5,7,6],[8,1,8,2],[9,1,9,2]]}
[]
[]
[null,"طـــلبية احتياجات التشغيل"]
[null,null,null,null,"رقــــم الطــلــبــيــه :",105,null,null,"بالطائره لحاجه العمل الماسه"]
[]
[null,null,null,null,"الــــتـــاريـــــــــــخ :",{"$f":"IF(index!D4=\"\",\"\",VLOOKUP(F4,index!$C$4:$D$656,2,0))","v":"00:00:00"},null,{"$f":"VLOOKAnyCol(dataazzam,G6,1,2)","v":"مجففة680جم"},"بسياره الطلبيه"]
[]
[null,null,null,null,"طريقه الارسال المطلوبه:","بالطائره لحاجه العمل الماسه"]
[null,"استكمالاً للطلببيه رقم  :"]
[null,"المــــــــــــــــــــــؤرخه :"]
[]
[null,"م","رقم الصنف","الصنف","المجموعه","الوحده","الكميه المطلوبه","الرصيد","ملاحظات"]
[null,null,121401462,{"$f":"IF(C13<>\"\",VLOOKAnyCol(dataazzam,C13,1,2),\"\")","v":"        تونكيز    "},{"$f":"IF(C13<>\"\",VLOOKAnyCol(dataazzam,C13,1,3),\"\")","v":"بسكويت انواع"},{"$f":"IF(C13<>\"\",VLOOKAnyCol(dataazzam,C13,1,4),\"\")","v":"EA."}]
[null,null,null,"","",""]
[null,null,null,"","",""]
[null,null,null,"","",""]
[null,null,null,"","",""]
[null,null,null,"","",""]
[null,null,null,"","",""]
[null,null,null,"","",""]
[null,null,null,"","",""]
[null,null,null,"","",""]
[null,null,null,"","",""]
[null,null,null,"","",""]
[null,null,null,"","",""]
[null,null,null,"","",""]
[null,null,null,"","",""]
[null,null,null,"","",""]
[null,null,null,"","",""]
[null,null,null,"","",""]
[null,null,null,"","",""]
[null,null,null,"","",""]
[null,null,null,"","",""]
[null,null,null,"","",""]
[null,null,null,"","",""]
[null,null,null,"","",""]
[null,null,null,"","",""]
[null,null,null,"","",""]
[null,null,null,"","",""]
[null,null,null,"","",""]
[null,null,null,"","",""]
[null,null,null,"","",""]
[null,null,null,"","",""]
[null,null,null,"","",""]
[null,null,null,"","",""]
[null,null,null,"","",""]
[null,null,null,"","",""]
[null,null,null,"","",""]
[null,null,null,"","",""]
[null,null,null,"","",""]
[null,null,null,"","",""]
[null,null,null,"","",""]
[null,null,null,"","",""]
[null,null,null,"","",""]
[null,null,null,"","",""]
[null,null,null,"","",""]
[null,null,null,"","",""]
[null,null,null,"","",""]
[null,null,null,"","",""]
[null,null,null,"","",""]
{"$rows_left_out":141}
{"sheet":"106","index":8,"n_rows":200,"n_cols":9,"rows_kept":200,"cut":false,"hidden":false,"merged":[[2,1,2,8],[3,5,3,6],[5,5,5,6],[7,5,7,6],[8,1,8,2],[9,1,9,2]]}
[]
[]
[null,"طـــلبية احتياجات التشغيل"]
[null,null,null,null,"رقــــم الطــلــبــيــه :",106,null,null,"بالطائره لحاجه العمل الماسه"]
[]
[null,null,null,null,"الــــتـــاريـــــــــــخ :",{"$f":"IF(index!D4=\"\",\"\",VLOOKUP(F4,index!$C$4:$D$656,2,0))","v":"00:00:00"},null,{"$f":"VLOOKAnyCol(dataazzam,G6,1,2)","v":"مجففة680جم"},"بسياره الطلبيه"]
[]
[null,null,null,null,"طريقه الارسال المطلوبه:","بالطائره لحاجه العمل الماسه"]
[null,"استكمالاً للطلببيه رقم  :"]
[null,"المــــــــــــــــــــــؤرخه :"]
[]
[null,"م","رقم الصنف","الصنف","المجموعه","الوحده","الكميه المطلوبه","الرصيد","ملاحظات"]
[null,null,121401462,{"$f":"IF(C13<>\"\",VLOOKAnyCol(dataazzam,C13,1,2),\"\")","v":"        تونكيز    "},{"$f":"IF(C13<>\"\",VLOOKAnyCol(dataazzam,C13,1,3),\"\")","v":"بسكويت انواع"},{"$f":"IF(C13<>\"\",VLOOKAnyCol(dataazzam,C13,1,4),\"\")","v":"EA."}]
[null,null,null,"","",""]
[null,null,null,"","",""]
[null,null,null,"","",""]
[null,null,null,"","",""]
[null,null,null,"","",""]
[null,null,null,"","",""]
[null,null,null,"","",""]
[null,null,null,"","",""]
[null,null,null,"","",""]
[null,null,null,"","",""]
[null,null,null,"","",""]
[null,null,null,"","",""]
[null,null,null,"","",""]
[null,null,null,"","",""]
[null,null,null,"","",""]
[null,null,null,"","",""]
[null,null,null,"","",""]
[null,null,null,"","",""]
[null,null,null,"","",""]
[null,null,null,"","",""]
[null,null,null,"","",""]
[null,null,null,"","",""]
[null,null,null,"","",""]
[null,null,null,"","",""]
[null,null,null,"","",""]
[null,null,null,"","",""]
[null,null,null,"","",""]
[null,null,null,"","",""]
[null,null,null,"","",""]
[null,null,null,"","",""]
[null,null,null,"","",""]
[null,null,null,"","",""]
[null,null,null,"","",""]
[null,null,null,"","",""]
[null,null,null,"","",""]
[null,null,null,"","",""]
[null,null,null,"","",""]
[null,null,null,"","",""]
[null,null,null,"","",""]
[null,null,null,"","",""]
[null,null,null,"","",""]
[null,null,null,"","",""]
[null,null,null,"","",""]
[null,null,null,"","",""]
[null,null,null,"","",""]
[null,null,null,"","",""]
[null,null,null,"","",""]
{"$rows_left_out":140}