{"text_format":"1","workbook":"xlsx","n_sheets":9,"sheets":["index","ST-tems -138","Templete","101","102","103","104","105","106"],"not_rendered":{"charts":0,"images":0,"macros":1,"external_links":0,"defined_names":1,"comments":0,"pivot_tables":0},"unopened":[],"bounds":{"document_bytes":16777216,"sheet_cells":100000,"rows_first":2000,"rows_last":500,"rows_between":2000,"halvings":0,"cell_chars":16384,"cell_head_chars":4096},"cells_cut":0,"cells_raw":0,"read":"whole","date_system":"1900"}

{"sheet":"index","index":0,"n_rows":9,"n_cols":12,"rows_kept":9,"cut":false,"hidden":false,"merged":[]}
[]
[]
[null,null,"رقم الطلبيه","التاريخ ","امين المخزن"]
[null,null,101,"2018-01-01",null,null,null,null,null,null,null,{"$f":"IF(C13<>\"\",VLOOKAnyCol(dataazzam,C13,1,2),\"\")","v":""}]
[null,null,102,"2017-05-01"]
[null,null,103]
[null,null,104]
[null,null,105]
[null,null,106]

{"sheet":"ST-tems -138","index":1,"n_rows":1173,"n_cols":5,"rows_kept":1173,"cut":false,"hidden":false,"merged":[]}
[]
[null,"رقم الصنف","الصنف","المجموعه","الوحده"]
[1,110309304,"         تراوت     ","اسماك مدخنة","KGM"]
[2,110805104,"           كمومبرت كج","جبن مطبوخ","EA."]
[3,110805603,"           بيبي بل   ","جبن مطبوخ","EA."]
[4,111103324,"             كبدبط حلل ","فواجراة","EA."]
[5,120101107,"   كبدة      ","بتلو","KGM"]
[6,120101109,"                بتلومشفى  ","بتلو","KGM"]
[7,120101110,"ف/م 4أجزاء","بتلو","KGM"]
[8,120101111," بتلو","VEEL  فلتو","KGM"]
[9,120101112,"    بتلوروزبيف","بتلو","KGM"]
[10,120101115,"  فلتو بتلو ","بتلو","KGM"]
[11,120101117,"كبدةبتلو/م","بتلو","KGM"]
[12,120101123,"                ف/بتلو4قطع","بتلو","KGM"]
[13,120102107,"                ف/ضا/مشفى ","ضانى","KGM"]
[14,120102109,"                افخاد ضانى","ضانى","KGM"]
[15,120102111,"                ريش ضانى/ب","ضانى","KGM"]
[16,120102112,"                فخدضانى عظ","ضانى","KGM"]
[17,120102113,"                ريش ضانى م","ضانى","KGM"]
[18,120102115,"                ريش ضانى  ","ضانى","KGM"]
[19,120103103,"               عروق      ","كندوز","KGM"]
[20,120103111,"               روزبيف    ","كندوز","KGM"]
[21,120103203,"               كندوز","Nفلتومستور","KGM"]
[22,120103204,"               وش فخدة مس","كندوز","KGM"]
[23,120103208,"               فلتو/ك/بلد","كندوز","KGM"]
[24,120103210,"               ظهرفخدةبرا","كندوز","KGM"]
[25,120103211,"               امامى كتف ","كندوز","KGM"]
[26,120103212,"               ج امامى سن","كندوز","KGM"]
[27,120103213,"               امامى موزة","كندوز","KGM"]
[28,120103214,"               وش ف برزيل","كندوز","KGM"]
[29,120103215,"               ك/ظهرفخدةأ","كندوز","KGM"]
[30,120103217,"               كتف كندوزم","كندوز","KGM"]
[31,120109106,"      فرنك فورتر","لحوم نصف مصنعة","KGM"]
[32,120109113,"      سجق فراخ ل","لحوم نصف مصنعة","KGM"]
[33,120109114,"      سجق بقرى  ","لحوم نصف مصنعة","KGM"]
[34,120110010," كبيبةمينى ","لحوم مصنعه سندوتشات","KGM"]
[35,120110011," كبيبةكبيرة","لحوم مصنعه سندوتشات","KGM"]
[36,120110012," كبيبة فراخ","لحوم مصنعه سندوتشات","KGM"]
[37,120110013," كفتة بانيه","لحوم مصنعه سندوتشات","KGM"]
[38,120201202,"            لحم صدر   ","ديك رومى","KGM"]
[39,120202102,"                فراخ مجمدة","فراخ","EA."]
[40,120202201,"                صدرمشفى   ","فراخ","KGM"]
[41,120202206,"                وراك مخلية","فراخ","KGM"]
[42,120202213,"                صدرفراخ130","فراخ","KGM"]
[43,120202214,"                صدرفرخ100ج","فراخ","KGM"]
[44,120202215,"                فراخ مجمدة","فراخ","EA."]
[45,120202231,"                فراخ برقبة","فراخ","EA."]
[46,120202232,"                ص200:160جم","فراخ","KGM"]
[47,120203102," بط مزارع  ","بط","EA."]
[48,120203103,"                  صدربط مشفى","بط","KGM"]
[49,120204101,"حمام بلدى ","حمام/سمان","EA."]
[50,120205101," بيض ابيض  ","بيض","EA."]
[51,120205106," بيض60:50جم","بيض","EA."]
[52,120301201,"فيليه     ","سمك فيليه مستورد","KGM"]
[53,120301202,"سمك فيليه ","سمك فيليه مستورد","KGM"]
[54,120301204,"موسى مجمد ","سمك فيليه مستورد","KGM"]
[55,120301208," قشر بياض  ","سمك فيليه مستورد","KGM"]
[56,120301210,"سبيط      ","سمك فيليه مستورد","KGM"]
[57,120301211,"طازج نظيف","سمك فيليه مستورد ","KGM"]
[58,120301215,"سمك سالمون","سمك فيليه مستورد","KGM"]
[59,120301216," سمك ف س بل","سمك فيليه مستورد","KGM"]
[60,120301217," سبيط مجمد ","سمك فيليه مستورد","KGM"]
[61,120301218,"سمك باسفيك","سمك فيليه مستورد","KGM"]
[62,120301219,"    استاكوزا م","سمك فيليه مستورد","KGM"]
[63,120301220,"    سمك اسكالو","سمك فيليه مستورد","KGM"]
[64,120301221,"    سمك السكا ","سمك فيليه مستورد","KGM"]
[65,120301222,"    سمك باسا  ","سمك فيليه مستورد","KGM"]
[66,120301304,"    زيل استاكو","سمك فيليه مستورد","KGM"]
[67,120301305,"    س فيلي كود","سمك فيليه مستورد","KGM"]
[68,120302101,"               طازج      ","جمبرى","KGM"]
[69,120302108,"               ج/بقشرةمتو","جمبرى","KGM"]
[70,120302202,"               مجمد متوسط","جمبرى","KGM"]
[71,120302203,"               جمبو15كيلو","جمبرى","KGM"]
[72,120302205,"               جمبرىم/بدو","جمبرى","KGM"]
[73,120302209,"               ج/صغيربدون","جمبرى","KGM"]
[74,120302210,"               صغيربدو100","جمبرى","KGM"]
[75,120302212,"               ج110/100/ب","جمبرى","KGM"]
[76,120303201,"             مجمده     ","ستاكوزا","KGM"]
[77,120304302,"             علب 1715جم","تونةعلب","TIN"]
[78,120304303,"             ع/ تونه170","تونةعلب","TIN"]
[79,120304304,"             علبة 160جم","تونةعلب","TIN"]
[80,120304306,"             تونة150جرا","تونةعلب","TIN"]
[81,120304310,"             تونة1700جم","تونةعلب","TIN"]
[82,120304311,"             علبة1850جم","تونةعلب","TIN"]
[83,120304312,"             تونه روز  ","تونةعلب","TIN"]
[84,120304314,"             تونه185جم ","تونةعلب","TIN"]
[85,120304318,"             تونةقطع140","تونةعلب","TIN"]
[86,120304319,"             تونةقطع185","تونةعلب","TIN"]
[87,120305304,"              كفيار احمر","كافيار","JAR"]
[88,120305305,"              كفيار اسود","كافيار","JAR"]
[89,120307301,"        علبة50جرام","انشوجةبالزيت","TIN"]
[90,120309303,"         سيمون     ","اسماك مدخنة","KGM"]
[91,120309305,"         تراوت مدخن","اسماك مدخنة","KGM"]
[92,120310202,"             كا/صـوابع ","كابوريا","KGM"]
[93,120311100,"          بقرى مدخن ","لحوم مدخنة","KGM"]
[94,120311101,"          رومى مدخن ","لحوم مدخنة","KGM"]
[95,120311103,"          فراخ مدخنة","لحوم مدخنة","KGM"]
[96,120311108,"          تيرين خضار","لحوم مدخنة","KGM"]
[97,120311110,"          ص بط مدخن ","لحوم مدخنة","KGM"]
[98,120311111,"          سلمى مطهى ","لحوم مدخنة","KGM"]
[99,120311112,"          روستو بقرى","لحوم مدخنة","KGM"]
[100,120311114,"          فراخ روستو","لحوم مدخنة","KGM"]
[101,120311116,"          فراخ جيلتي","لحوم مدخنة","KGM"]
[102,120311117,"          تلبينكو مد","لحوم مدخنة","KGM"]
[103,120311118,"          ترين سلمون","لحوم مدخنة","KGM"]
[104,120311122,"          ترين بط   ","لحوم مدخنة","KGM"]
[105,120401202,"          مجمدة كجم ","بسلة خضراء","KGM"]
[106,120401307,"          بسله بجزر ","بسلة خضراء","KGM"]
[107,120402202,"               مجمدة كجم0","بامية","KGM"]
[108,120403202,"       مجمدة كجم ","فاصوليا خضراء","KGM"]
[109,120404202,"               خرشوف مجمد","خرشوف","KGM"]
[110,120405102,"               بوم فريتس ","بطاطس","KGM"]
[111,120405110,"               بطا/روندال","بطاطس","KGM"]
[112,120405303,"               بطاطس سوتي","بطاطس","KGM"]
[113,120405306,"               بطاطس بودر","بطاطس","KGM"]
[114,120405307,"               كروكيت","بطاطس    ","KGM"]
[115,120405308,"               بطاطس هاش ","بطاطس","KGM"]
[116,120405309,"               كروكت فراخ","بطاطس","KGM"]
[117,120405310,"               ب /لوريت  ","بطاطس","KGM"]
[118,120405312,"               بط مكعبات ","بطاطس","KGM"]
[119,120406103,"                 بودرةكجم  ","ثوم","KGM"]
[120,120407308," صلصة3كيلو ","طماطم","TIN"]
[121,null,"مجففة680جم","طماطم","TIN"]
[122,120407325," ط/مقشر2500","طماطم","TIN"]
[123,120407326,"  ط/مجفف280 ","طماطم","JAR"]
[124,120407327,"  ط/مقش2550ج","طماطم","TIN"]
[125,120407328,"               طم400جممقش","طماطم","TIN"]
[126,120407336,"               طماطم2850ج","طماطم","TIN"]
[127,120409202,"               مجمدة كجم ","سبانخ","KGM"]
[128,120414203,"             محشى ورق ع","ورق عنب","KGM"]
[129,120414304,"             محش ورق عن","ورق عنب","KGM"]
[130,120416316,"               صافى2840جم","مشروم","TIN"]
[131,120416318,"               م/ش 850/جم","مشروم","TIN"]
[132,120416319,"               ص 425/م","مشروم800","TIN"]
[133,120416320,"               ص 460/م","مشروم800","TIN"]
[134,120416322,"               مشروم مجفف","مشروم","KGM"]
[135,120416323,"               مشروم صحيح","مشروم","TIN"]
[136,120416327,"               مشروم425جم","مشروم","TIN"]
[137,120416329,"               م/ش460/مصف","مشروم","TIN"]
[138,120425102,"                 قلب فجل مس","فجل","JAR"]
[139,120427102,"              بروكلىمجمد","بروكلى","KGM"]
[140,120502306,"                 كمبوت820جم","خوخ","TIN"]
[141,120502307,"                 ك0خوخ800جم","خوخ","TIN"]
[142,120502310,"                 خوخ830جم  ","خوخ","TIN"]
[143,120504302,"       كمبوت850جم","كمبوت اناناس ","TIN"]
[144,120504311,"       اناناس 825","كمبوت اناناس ","TIN"]
[145,120504313,"       كمبوت اناناس ","836GMS    ","TIN"]
[146,120504316,"       أناناس 810","كمبوت اناناس ","TIN"]
[147,120504317,"       اناناس 820","كمبوت اناناس ","TIN"]
[148,120505301,"            علبة 850جم","فروت سلد","TIN"]
[149,120505302,"            فروت  820ج","فروت سلد","TIN"]
[150,120505310,"            ف0س 800جم ","فروت سلد","TIN"]
[151,120505311,"            ف س 830جم ","فروت سلد","TIN"]
[152,120506305,"                كريز كيلو ","كريز","KGM"]
[153,120508305,"                 بلحةلوزشع","بلح3","PKT"]
[154,120508309,"                 بلح5بدون ش","بلح","PKT"]
[155,120601101,"       سباجتى كجم","مكرونةوسمبوسه","KGM"]
[156,120601102,"       مقصوصة كجم","مكرونةوسمبوسه","KGM"]
[157,120601103,"       شعرية كجم ","مكرونةوسمبوسه","KGM"]
[158,120601104,"       شريط  كجم ","مكرونةوسمبوسه","KGM"]
[159,120601106,"       بنة كجم   ","مكرونةوسمبوسه","KGM"]
[160,120601109,"       مرمرية    ","مكرونةوسمبوسه","KGM"]
[161,120601112,"       لزنياسبانخ","مكرونةوسمبوسه","KGM"]
[162,120601113,"       لزانياسادة","مكرونةوسمبوسه","KGM"]
[163,120601117,"       سبرنج خضار","مكرونةوسمبوسه","KGM"]
[164,120601123,"       اسبرنج جبن","مكرونةوسمبوسه","KGM"]
[165,120601125,"       سمبوسةجبنة","مكرونةوسمبوسه","KGM"]
[166,120601126,"       سمبوسةخضار","مكرونةوسمبوسه","KGM"]
[167,120601127,"       سمبوسةلحمة","مكرونةوسمبوسه","KGM"]
[168,120601133,"       اسبرنج مشر","مكرونةوسمبوسه","KGM"]
[169,120601139,"       فتنوشينى ب","مكرونةوسمبوسه","KGM"]
[170,120601145,"       مكرونةسوست","مكرونةوسمبوسه","KGM"]
[171,120601148,"       سوسته الون","مكرونةوسمبوسه","KGM"]
[172,120601150,"       تورتل-مجفف","مكرونةوسمبوسه","KGM"]
[173,120601154,"       مكرونه بنه","مكرونةوسمبوسه","KGM"]
[174,120603103,"        دقيق سميد ","دقيق بانواعه","KGM"]
[175,120603105,"        كسكسى     ","دقيق بانواعه","KGM"]
[176,120603106,"        محلى 50كجم","دقيق بانواعه","KGM"]
[177,120603130,"        ميفن ميكس ","دقيق بانواعه","KGM"]
[178,120603132,"        رده ناعمه ","دقيق بانواعه","KGM"]
[179,120603133,"        روجن فيكس ","دقيق بانواعه","KGM"]
[180,120603134,"        ديا بلجت  ","دقيق بانواعه","KGM"]
[181,120603135,"        تيروبان   ","دقيق بانواعه","KGM"]
[182,120603137,"        برونيز ميك","دقيق بانواعه","KGM"]
[183,120603140,"        نيربان    ","دقيق بانواعه","KGM"]
[184,120603141,"        بزرقرعمقشر","دقيق بانواعه","KGM"]
[185,120603143,"        دقيق72%   ","دقيق بانواعه","KGM"]
[186,120603149,"        خبزصغيربلد","دقيق بانواعه","EA."]
[187,120603176,"        جلاش      ","دقيق بانواعه","KGM"]
[188,120603183,"        كنافة شعر ","دقيق بانواعه","KGM"]
[189,120604405,"          كورن فليكس","كورن فليكس","BOX"]
[190,120605101,"           بالكيلو   ","ارز سياحى","KGM"]
[191,120605103,"           أرز بسماتى","ارز سياحى","KGM"]
[192,120605105,"           بسمتى مغلى","ارز سياحى","KGM"]
[193,120605106,"           ارز3%كسر  ","ارز سياحى","KGM"]
[194,120606315,"                 نشا ذرة   ","نشا","KGM"]
[195,120606319,"                 بكنج ح16جر","نشا","PKT"]
[196,120606320,"                 نشاح240جرا","نشا","PKT"]
[197,120608101,"           برغل كجم  ","برغل/فريك","KGM"]
[198,120609303,"                 ناعم      ","سكر","KGM"]
[199,120609401,"                 بودره     ","سكر","KGM"]
[200,120701301,"                اسود حصى  ","فلفل","KGM"]
[201,120701302,"                ابيض كجم  ","فلفل","KGM"]
[202,120701308,"                فلفل اسود ","فلفل","KGM"]
[203,120701309,"                فلفل اسودح","فلفل","KGM"]
[204,120702301,"           فلفل احمرك","فلفل احمر","KGM"]
[205,120703301,"                 ناعمة كجم ","شطة","KGM"]
[206,120704101,"               حصى كم    ","كسبرة","KGM"]
[207,120704301,"               ناعمة كجم ","كسبرة","KGM"]
[208,120705101,"                حصى كم    ","كمون","KGM"]
[209,120705301,"                بلدى كجم  ","كمون","KGM"]
[210,120706101,"         حبهان مطحن","عطارة-حبهان","KGM"]
[211,120707102,"          مسحوق     ","جوزة الطيب","KGM"]
[212,120708301,"            و.لورو كجم","ورق لورو","KGM"]
[213,120709303,"                حبوب كارى ","كارى","JAR"]
[214,120709308,"                كارىبودرة ","كارى","KGM"]
[215,120710301,"                ناعم كجم  ","كركم","KGM"]
[216,120713301,"                ناعمة كجم ","قرفة","KGM"]
[217,120716101,"               قرنفل ناعم","قرنفل","KGM"]
[218,120718307,"                 ملح400جم  ","ملح","PKT"]
[219,120718310,"                 ملح350جرام","ملح","PKT"]
[220,120718311,"                 ملح 500جم ","ملح","PKT"]
[221,120718312,"                 ملح300جم  ","ملح","PKT"]
[222,120718313,"                 ملح250جم  ","ملح","PKT"]
[223,120718314,"                 ملح700جم ب","ملح","PKT"]
[224,120718315,"                 ملح600جم  ","ملح","PKT"]
[225,120719101,"               توابل للشى","توابل","TIN"]
[226,120719102,"               خلطةدواجن ","توابل","TIN"]
[227,120719103,"               الشرق القص","توابل","TIN"]
[228,120722301,"          بالكيلو   ","حبة البركه","KGM"]
[229,120722302,"          عصفر كيلو ","حبة البركه","KGM"]
[230,120727101,"                بالكيلو   ","زعتر","KGM"]
[231,120737103,"            نعناع2:1.5"," النعناع","BOX"]
[232,120740109,"      كركدية2جم ","         عبوات","TIN"]
[233,120740111,"      كاموميل5ز1","         عبوات","PKT"]
[234,120740112,"      بابونج 1,5","         عبوات","PKT"]
[235,120740113,"      كاموميل2جم","         عبوات","PKT"]
[236,120740115,"      ينسون2:1.5","         عبوات","TIN"]
[237,120740117,"      كركديه    ","         عبوات","KGM"]
[238,120801101,"          ثلجه   كجم","جبنة بيضاء","KGM"]
[239,120801107,"          ملح خفيف  ","جبنة بيضاء","KGM"]
[240,120801109,"          بالصفيحة ","جبنة بيضاء ","KGM"]
[241,120801111,"          فيتايونانى","جبنة بيضاء","KGM"]
[242,120801113,"          فيتا125جم ","جبنة بيضاء","TIN"]
[243,120801114,"          جبن قريش  ","جبنة بيضاء","KGM"]
[244,120801116,"          دومتى250جم","جبنة بيضاء","TIN"]
[245,120802101,"           صحيح   كجم","جبنة رومى","KGM"]
[246,120803304,"          مثلث محلى ","جبن روكفور","CRT"]
[247,120803307,"          ريكفورد25ج","جبن روكفور","EA."]
[248,120804101,"           صحيح   كجم","جبنة شيدر","KGM"]
[249,120804107,"           ج.شيدرحمرا","جبنة شيدر","KGM"]
[250,120805101,"           ايدام     ","جبن مطبوخ","KGM"]
[251,120805103,"           جودة      ","جبن مطبوخ","KGM"]
[252,120805105,"           مينى ايدام","جبن مطبوخ","KGM"]
[253,120805106,"           اميتال ط  ","جبن مطبوخ","KGM"]
[254,120805107,"           جريير     ","جبن مطبوخ","KGM"]
[255,120805111,"           ج موتزاريل","جبن مطبوخ","KGM"]
[256,120805112,"           ف/بيبى بيل","جبن مطبوخ","EA."]
[257,120805116,"           كمومبير125","جبن مطبوخ","EA."]
[258,120805117,"           جوده محلى ","جبن مطبوخ","KGM"]
[259,120805118,"           ايدام محلى","جبن مطبوخ","KGM"]
[260,120805119,"           موتزاريلاق","جبن مطبوخ","KGM"]
[261,120805120,"           كريم تشيز4","جبن مطبوخ","JRK"]
[262,120805121,"           مسكاربونى ","جبن مطبوخ","EA."]
[263,120805124,"           جبن تشز900","جبن مطبوخ","JAR"]
[264,120806301,"       باكو 200جم","جبنة فيلدلفيا","PKT"]
[265,120806303,"       فيلدفيا300","جبنة فيلدلفيا","PKT"]
[266,120806304,"       ج فيلدفيا ","جبنة فيلدلفيا","TIN"]
[267,120807304,"         ج/مطبوخةمث","جبنة مطبوخة","EA."]
[268,120808304,"           كيرى بقطعة","جبنه كيرى","EA."]
[269,120903101,"      كامل الدسم","لبن طويل العمر","PKT"]
[270,120903102,"      نصف دسم   ","لبن طويل العمر","PKT"]
[271,120903317,"      لبن 200ملى","لبن طويل العمر","TIN"]
[272,120903318,"      لبن0منزوع0","لبن طويل العمر","PKT"]
[273,120903332,"      كامل الدسم","لبن طويل العمر","LTR"]
[274,120903333,"      نصف دسم   ","لبن طويل العمر","LTR"]
[275,120903337,"      لبن كامل  ","لبن طويل العمر","PKT"]
[276,120904306,"               زبادى80فاك","زبادى","EA."]
[277,120904307,"               زبادى80جم ","زبادى","EA."]
[278,120904322,"               زبادى105جم","زبادى","EA."]
[279,120904323,"               زبادى75جم ","زبادى","EA."]
[280,120905304,"               شانتييه   ","كريمه","KGM"]
[281,120905307,"               كراميل92جم","كريمه","PKT"]
[282,120905308,"               بدون سكر  ","كريمه","KGM"]
[283,120905316,"               بودرةكريمة","كريمه","KGM"]
[284,120905324,"               كريمةنباتى","كريمه","LTR"]
[285,120905326,"               كراميل184ج","كريمه","PKT"]
[286,120905328,"               كريمه خفق ","كريمه","PKT"]
[287,120905341,"               كرميل دور ","كريمه","KGM"]
[288,120905343,"               ك لبانى كي","كريمه","KGM"]
[289,120905345,"               ويب اس حشو","كريمه","KGM"]
[290,120905351,"               تشيزميكس  ","كريمه","KGM"]
[291,120905363,"               ك/خفق بدون","كريمه","LTR"]
[292,120906001,"         جزربدون عر","خضار وفاكهه","KGM"]
[293,120906003,"         نعناع أخضر","خضار وفاكهه","KGM"]
[294,120906004,"         فلفل اخضر ","خضار وفاكهه","KGM"]
[295,120906007,"         خيار      ","خضار وفاكهه","KGM"]
[296,120906008,"         كرفس فرنس ","خضار وفاكهه","KGM"]
[297,120906009,"         كابوتشا   ","خضار وفاكهه","KGM"]
[298,120906010,"         بازنجان رو","خضار وفاكهه","KGM"]
[299,120906011,"         بازنجان بل","خضار وفاكهه","KGM"]
[300,120906012,"         بازنجان أب","خضار وفاكهه","KGM"]
[301,120906013,"         كرفس بلدى ","خضار وفاكهه","KGM"]
[302,120906015,"         فاصوليا خض","خضار وفاكهه","KGM"]
[303,120906016,"         ليمون بلدى","خضار وفاكهه","KGM"]
[304,120906017,"         طماطم سلطه","خضار وفاكهه","KGM"]
[305,120906018,"         ليمون أضال","خضار وفاكهه","KGM"]
[306,120906019,"         بطاطس     ","خضار وفاكهه","KGM"]
[307,120906020,"         كرنب أحمر ","خضار وفاكهه","KGM"]
[308,120906022,"         شبت       ","خضار وفاكهه","KGM"]
[309,120906023,"         كسبره خضرا","خضار وفاكهه","KGM"]
[310,120906024,"         بقدونس    ","خضار وفاكهه","KGM"]
[311,120906025,"         بصل جاف بل","خضار وفاكهه","KGM"]
[312,120906027,"         كوسه نوار ","خضار وفاكهه","KGM"]
[313,120906028,"         كرنب      ","خضار وفاكهه","KGM"]
[314,120906030,"         قرع عسل   ","خضار وفاكهه","KGM"]
[315,120906032,"         طماطم شيرى","خضار وفاكهه","KGM"]
[316,120906033,"         فلفل روم ص","خضار وفاكهه","KGM"]
[317,120906034,"         فلفل روم ح","خضار وفاكهه","KGM"]
[318,120906035,"         فلفل شطه  ","خضار وفاكهه","KGM"]
[319,120906036,"         كوسه كبيره","خضار وفاكهه","KGM"]
[320,120906038,"         افاوكادوا ","خضار وفاكهه","KGM"]
[321,120906039,"         روز مارى  ","خضار وفاكهه","KGM"]
[322,120906040,"         لولو روسو ","خضار وفاكهه","KGM"]
[323,120906041,"         فجل صينى  ","خضار وفاكهه","KGM"]
[324,120906042,"         زعتر      ","خضار وفاكهه","KGM"]
[325,120906043,"         ريحان     ","خضار وفاكهه","KGM"]
[326,120906044,"         كرنب ابيض ","خضار وفاكهه","EA."]
[327,120906046,"         كرات بدون ","خضار وفاكهه","KGM"]
[328,120906047,"         بنجر بدون ","خضار وفاكهه","KGM"]
[329,120906049,"         اسبارجوس  ","خضار وفاكهه","KGM"]
[330,120906050,"         ثوم صينى  ","خضار وفاكهه","KGM"]
[331,120906051,"         خس احمر   ","خضار وفاكهه","KGM"]
[332,120906502,"         عنب احمر  ","خضار وفاكهه","KGM"]
[333,120906503,"         موز مستورد","خضار وفاكهه","KGM"]
[334,120906504,"         كمثرى مستو","خضار وفاكهه","KGM"]
[335,120906505,"         برقوق مستو","خضار وفاكهه","KGM"]
[336,120906506,"         عنب ابيض  ","خضار وفاكهه","KGM"]
[337,120906507,"         عنب اسود  ","خضار وفاكهه","KGM"]
[338,120906508,"         كيوى مستور","خضار وفاكهه","EA."]
[339,120906509,"         خوخ مستورد","خضار وفاكهه","KGM"]
[340,120906511,"         انانس مستو","خضار وفاكهه","KGM"]
[341,120906512,"         موز مزارع ","خضار وفاكهه","KGM"]
[342,120906514,"         تفاح اخضرم","خضار وفاكهه","KGM"]
[343,120906515,"         تفاح احمرم","خضار وفاكهه","KGM"]
[344,120906516,"         تفاح اصفرم","خضار وفاكهه","KGM"]
[345,120906518,"         برتقال بصر","خضار وفاكهه","KGM"]
[346,120906519,"         برتقال بلد","خضار وفاكهه","KGM"]
[347,120906521,"         برتقال صيف","خضار وفاكهه","KGM"]
[348,120906522,"         يوسفى كبير","خضار وفاكهه","KGM"]
[349,120906523,"         موز مغربى ","خضار وفاكهه","KGM"]
[350,120906525,"         عنب جافكلي","خضار وفاكهه","KGM"]
[351,120906526,"         برقوق أصفر","خضار وفاكهه","KGM"]
[352,120906531,"         فراولةطازج","خضار وفاكهه","KGM"]
[353,120906532,"         كمثرى خشاب","خضار وفاكهه","KGM"]
[354,120906533,"         كانتلوب مم","خضار وفاكهه","KGM"]
[355,120906539,"         كمثرى ثلجة","خضار وفاكهه","KGM"]
[356,120906540,"         جوافة نبات","خضار وفاكهه","KGM"]
[357,120906541,"         جريب فروت ","خضار وفاكهه","KGM"]
[358,120906543,"         بطيخ5كيلوف","خضار وفاكهه","KGM"]
[359,120906544,"         يوسفىتانجد","خضار وفاكهه","KGM"]
[360,120906545,"         رومان     ","خضار وفاكهه","KGM"]
[361,120906547,"         مانجوتيمور","خضار وفاكهه","KGM"]
[362,120906549,"         عنب أحمرمس","خضار وفاكهه","KGM"]
[363,120906551,"         تفاح سكرى ","خضار وفاكهه","KGM"]
[364,120906552,"         موزبلدى   ","خضار وفاكهه","KGM"]
[365,121001306,"          طبيعى     ","مسلى طبيعى","KGM"]
[366,121001308,"          زبدة 25كجم","مسلى طبيعى","KGM"]
[367,121003301,"             علبة 935جم","زيت ذرة","TIN"]
[368,121003309,"             محلى2لتر  ","زيت ذرة","BOT"]
[369,121003311,"             زيت درة3لت","زيت ذرة","BOT"]
[370,121003313,"             زيت1لترزرة","زيت ذرة","TIN"]
[371,121004304,"         ز زيتون1لت","زيوت متنوعة","LTR"]
[372,121004308,"         سمسم500ملى","زيوت متنوعة","BOT"]
[373,121004311,"         زيت ز500م ","زيوت متنوعة","BOT"]
[374,121004312,"         زيت زيتون2","زيوت متنوعة","BOT"]
[375,121004314,"         ز زيتون500","زيوت متنوعة","BOT"]
[376,121004318,"         ز/من8ألى1 ","زيوت متنوعة","BOT"]
[377,121007101,"   ز/ع 2لتر  ","زيت نباتى للتحمير","BOT"]
[378,121007102,"   ز/ع 1لتر  ","زيت نباتى للتحمير","BOT"]
[379,121007103,"   ز/ع 3لتر  ","زيت نباتى للتحمير","BOT"]
[380,121007105,"   زيت للقلى ","زيت نباتى للتحمير","TIN"]
[381,121007107,"   زيت قلى لت","زيت نباتى للتحمير","LTR"]
[382,121007114,"   قلى390ر17ل","زيت نباتى للتحمير","TIN"]
[383,121101301,"             خ0مستور125","اكل طفل","JAR"]
[384,121101302,"             ف0مستور130","اكل طفل","JAR"]
[385,121101305,"             اكل طفل خض","اكل طفل","JAR"]
[386,121101306,"             خضار120جم ","اكل طفل","JAR"]
[387,121101307,"             فاكهه125جم","اكل طفل","JAR"]
[388,121104306,"               بقرى5ز1كجم","شوربه","TIN"]
[389,121104307,"               م/دجاج5ز1ك","شوربه","TIN"]
[390,121104308,"               شوربة سمك ","شوربه","TIN"]
[391,121104309,"               م/بقرى1100","شوربه","TIN"]
[392,121104310,"               مرقةدج1100","شوربه","TIN"]
[393,121201303,"       فاصوليا3كج","فاصوليا بيضاء","TIN"]
[394,121201304,"       بيضاء380صا","فاصوليا بيضاء","TIN"]
[395,121201305,"       فصولياب/صل","فاصوليا بيضاء","TIN"]
[396,121201308,"       فاصوليا400","فاصوليا بيضاء","TIN"]
[397,121202101,"                 عدس اصفر ك","عدس","KGM"]
[398,121202103,"                 بجبة كيلو ","عدس","KGM"]
[399,121204308,"            فو2800جم/ص","فول مدمس","TIN"]
[400,121204309,"            فول م3كيلو","فول مدمس","TIN"]
[401,121204313,"            حمراء380صا","فول مدمس","TIN"]
[402,121204314,"            ف/ح400/ج ص","فول مدمس","TIN"]
[403,121204315,"            فاصوليا ح ","فول مدمس","TIN"]
[404,121204318,"            فصوليا حمر","فول مدمس","TIN"]
[405,121204319,"            ف/ح2500/جم","فول مدمس","TIN"]
[406,121204320,"            فصوليا حمر","فول مدمس","TIN"]
[407,121204331,"            فول400جرام","فول مدمس","TIN"]
[408,121204332,"            فول ح 350 ","فول مدمس","TIN"]
[409,121205102,"                أبيض كم   ","سمسم","KGM"]
[410,121206303,"      (بيبىكور400","ذرة(بيبى كورن","CRT"]
[411,121206305,"      (ذ/ح950/ز2ص","ذرة(بيبى كورن","TIN"]
[412,121206306,"      (ص      ","ذرة(بيبى كورن425","TIN"]
[413,121206308,"      (درةحب410جم","ذرة(بيبى كورن","TIN"]
[414,121206309,"      (عبوات ذرة ","ذرة(بيبى كورن","TIN"]
[415,121206310,"      (ذرة850ز2ص ","ذرة(بيبى كورن","TIN"]
[416,121206311,"      (ذرة425صافى","ذرة(بيبى كورن","TIN"]
[417,121206314,"      (حبوب ذره,,","ذرة(بيبى كورن","TIN"]
[418,121206315,"      (حبوب ذره  ","ذرة(بيبى كورن","TIN"]
[419,121206317,"      (ذره كورن  ","ذرة(بيبى كورن","TIN"]
[420,121206318,"      (ح ذره2125ج","ذرة(بيبى كورن","TIN"]
[421,121206319,"      (ح/دره425مص","ذرة(بيبى كورن","TIN"]
[422,121207303,"                 حمص مطبوخ3","حمص","TIN"]
[423,121207305,"                 ح/ش 400/جم","حمص","TIN"]
[424,121207308,"                 ح/مسلوق380","حمص","TIN"]
[425,121301102,"               أسود مخلى ","زيتون","KGM"]
[426,121301310,"               طبيعىمحلى ","زيتون","KGM"]
[427,121301311,"               زتون شرائح","زيتون","KGM"]
[428,121301312,"               زتون1600مص","زيتون","TIN"]
[429,121301313,"               ز/م00/1600","زيتون","TIN"]
[430,121301314,"               ز/ش/اسود  ","زيتون","TIN"]
[431,121301315,"               ز/م1450م/س","زيتون","TIN"]
[432,121301318,"               اسود/م1560","زيتون","TIN"]
[433,121301319,"               اسودم2200ج","زيتون","TIN"]
[434,121302307,"                مشكل كيلو ","مخلل","KGM"]
[435,121302313,"                بصل مخلل  ","مخلل","KGM"]
[436,121302314,"                خيارقشةمخل","مخلل","KGM"]
[437,121302316,"                خيار فرنس ","مخلل","TIN"]
[438,121302317,"                بصل360مخلل","مخلل","JAR"]
[439,121302318,"                م/بصل330جم","مخلل","JAR"]
[440,121302319,"                م-خيار310ج","مخلل","JAR"]
[441,121302320,"                خ/مخلل680ج","مخلل","JAR"]
[442,121302321,"                خيار360جم ","مخلل","JAR"]
[443,121303303,"         كابرى750جم","كابرى بالخل","JAR"]
[444,121303311,"         حبوب كابرى","كابرى بالخل","JAR"]
[445,121303312,"         حبوب كابرى","كابرى بالخل","JAR"]
[446,121304501,"               جم محلى","كاتشب340","BOT"]
[447,121304506,"               كاتشب200جم","كاتشب","JAR"]
[448,121304507,"               كتشب ح 10ج","كاتشب","PKT"]
[449,121304508,"               كاتشب9جرام","كاتشب","PKT"]
[450,121305319,"                 صوص أبيض  ","صوص","TIN"]
[451,121305324,"                 ص محار500ج","صوص","BOT"]
[452,121305325,"                 ص /صويالتر","صوص","BOT"]
[453,121305335,"                 ص/كوكى مان","صوص","LTR"]
[454,121305338,"                 صويا كوكى2","صوص","BOT"]
[455,121305341,"                 صوص 900تيل","صوص","TIN"]
[456,121306323,"      م /السحرى ","مستردةومايونيز","JRK"]
[457,121306327,"      مستردة4كجم","مستردةومايونيز","JAR"]
[458,121306331,"      مسترده محب","مستردةومايونيز","JAR"]
[459,121306332,"      مسترده محل","مستردةومايونيز","TIN"]
[460,121306335,"      مينز3290جم","مستردةومايونيز","JRK"]
[461,121306336,"      مايونيزح10","مستردةومايونيز","PKT"]
[462,121307101,"               سايبه  كجم","طحينة","KGM"]
[463,121401310,"        تاك 40جرام","بسكويت انواع","PKT"]
[464,121401419,"        جم6قطع  ","بسكويت انواع50","PKT"]
[465,121401460,"        بيك رولزص ","بسكويت انواع","EA."]
[466,121401462,"        تونكيز    ","بسكويت انواع","EA."]
[467,121401490,"        كاكوفا36جر","بسكويت انواع","PKT"]
[468,121401491,"        بسكوت وافر","بسكويت انواع","PKT"]
[469,121401493,"        بسكوت لمبا","بسكويت انواع","PKT"]
[470,121401508,"        بسكوكاكا24","بسكويت انواع","PKT"]
[471,121401646,"        شيبس34:30ج","بسكويت انواع","PKT"]
[472,121401668,"        بوريو6قطع ","بسكويت انواع","EA."]
[473,121401670,"        اوريو3قطع ","بسكويت انواع","EA."]
[474,121402307,"             فارميسيل1ك","شيكولتة","KGM"]
[475,121402324,"             ك0ساده    ","شيكولتة","KGM"]
[476,121402330,"             كفرتور2500","شيكولتة","PKT"]
[477,121402341,"             ش/كفر2500ج","شيكولتة","PKT"]
[478,121402346,"             بلبن سادة ","شيكولتة","CRT"]
[479,121402395,"             سويزا15جم ","شيكولتة","BOX"]
[480,121402433,"             شكولتةفلتس","شيكولتة","PKT"]
[481,121402436,"             شكولتة17جم","شيكولتة","EA."]
[482,121402458,"             طوفى كيلو ","شيكولتة","KGM"]
[483,121402459,"             شوكولتة11ج","شيكولتة","EA."]
[484,121403303,"               ب0أاخرى   ","كاكاو","KGM"]
[485,121501320,"                مربىفراوله","مربى","KGM"]
[486,121501321,"                مربىمشمش  ","مربى","KGM"]
[487,121501324,"                مشمش  ك   ","مربى","KGM"]
[488,121502307,"             جلوكوز    ","عسل نحل","KGM"]
[489,121601301,"    مشمشية1كج ","فواكه جافة/مسكرة","KGM"]
[490,121601303,"    زبيب مستور","فواكه جافة/مسكرة","KGM"]
[491,121601305,"    قراصيا كج ","فواكه جافة/مسكرة","KGM"]
[492,121601307,"    قشرةمسكرة ","فواكه جافة/مسكرة","KGM"]
[493,121602301,"           كيلومستورد","قمر الدين","KGM"]
[494,121603301,"             مبشور   كج","جوز هند","KGM"]
[495,121604301,"              بندق مقشرك","مكسرات","KGM"]
[496,121604302,"              لوز  كيلو ","مكسرات","KGM"]
[497,121604303,"              فستق مقشرك","مكسرات","KGM"]
[498,121604305,"              عين جمل   ","مكسرات","KGM"]
[499,121604307,"              لوزشرائح  ","مكسرات","KGM"]
[500,121605306,"          بدون ملح ك","فول سودانى","KGM"]
[501,121605603,"          باكو25:20ج","فول سودانى","PKT"]
[502,121706301,"                  ابيض زجاجة","خل","BOT"]
[503,121706306,"                  زجاجة900جم","خل","BOT"]
[504,121706307,"                  بلسمك500مل","خل","BOT"]
[505,121706308,"                  خل أبيض925","خل","BOT"]
[506,121706309,"                  خ/طبيعى850","خل","BOT"]
[507,121706310,"                  خل1لترأبيض","خل","BOT"]
[508,121707104,"             بودرةمحلى ","جيلتينا","KGM"]
[509,121707307,"             جيلي فكس  ","جيلتينا","TIN"]
[510,121707312,"             جيلى تزين ","جيلتينا","TIN"]
[511,121707314,"             تو/فواكهه ","جيلتينا","BOT"]
[512,121707315,"             توب/ف1/كجم","جيلتينا","BOT"]
[513,121707316,"             توبنج /ش  ","جيلتينا","BOT"]
[514,121707319,"             توبنج1100ج","جيلتينا","BOT"]
[515,121707320,"             توبنج1100ج","جيلتينا","BOT"]
[516,121707321,"             جيلاتينا  ","جيلتينا","KGM"]
[517,121707322,"             ب/ج/كرمل5ك","جيلتينا","JRK"]
[518,121707326,"             بابنج كرمل","جيلتينا","KGM"]
[519,121707327,"             بابنج شكول","جيلتينا","KGM"]
[520,121707328,"             بابنج شفاف","جيلتينا","KGM"]
[521,121707331,"             جيلى ساخن ","جيلتينا","KGM"]
[522,121707333,"             ببينج شيكو","جيلتينا","KGM"]
[523,121707334,"             جيل ع بارد","جيلتينا","KGM"]
[524,121707335,"             جيلي فراول","جيلتينا","KGM"]
[525,121708101,"             بالكيلو   ","فانيليا","KGM"]
[526,121710102,"                 لون اصفر  ","لون","KGM"]
[527,121710103,"                 لون أخضر  ","لون","KGM"]
[528,121711307,"    مسحوق خبيز","خميرة/بيكينجبودر","KGM"]
[529,121711308,"    خميرة500جم","خميرة/بيكينجبودر","PKT"]
[530,121711310,"    خ0تركى450ج","خميرة/بيكينجبودر","PKT"]
[531,121711311,"    خ.محلى450ج","خميرة/بيكينجبودر","PKT"]
[532,121712104,"      كيك اسفنجى","محسنات خبزوكيك","KGM"]
[533,121712107,"      كيك ميكس  ","محسنات خبزوكيك","KGM"]
[534,121712109,"      مارزبان","محسنات خبزوكيك   ","KGM"]
[535,121712110,"      بلك فورست","محسنات خبزوكيك ","KGM"]
[536,121712111,"      موس فراولة","محسنات خبزوكيك","KGM"]
[537,121712113,"      محسن خبز","محسنات خبزوكيك  ","KGM"]
[538,121712114,"      موس فانيلي","محسنات خبزوكيك","KGM"]
[539,121712115,"      موس شكولته","محسنات خبزوكيك","KGM"]
[540,121712120,"      شكو تيرامي","محسنات خبزوكيك","KGM"]
[541,121712123,"      سوبربيتا  ","محسنات خبزوكيك","KGM"]
[542,121712125,"      محسنات خبزوكيك"," Eسوبرجاما","KGM"]
[543,121712127,"      بودرةكك اح","محسنات خبزوكيك","KGM"]
[544,121805304,"           توت احمر4ك","حشو تورتة","TIN"]
[545,121805312,"           حشوعنب اسو","حشو تورتة","TIN"]
[546,121805319,"           حشوتفاح4كي","حشو تورتة","JRK"]
[547,121805331,"           حشوفرولةمح","حشو تورتة","KGM"]
[548,121805334,"           ح/توت أحمر","حشو تورتة","KGM"]
[549,121805335,"           حشو ش بندق","حشو تورتة","KGM"]
[550,121806102,"              محلى","فوندام      ","KGM"]
[551,210202203,"                طاسة      ","طاسة","EA."]
[552,210206201,"        علبة مخرمة","اوعية بلستيك","EA."]
[553,220102203,"           كبشةللغرف ","ادوات غرف","EA."]
[554,220102204,"           سباتول    ","ادوات غرف","EA."]
[555,220102205,"           كبشة كبيرة","ادوات غرف","EA."]
[556,220102206,"           مقصوصةكبير","ادوات غرف","EA."]
[557,220102211,"           معلقه ايس ","ادوات غرف","EA."]
[558,220102213,"           كبشةيد طوي","ادوات غرف","EA."]
[559,220102217,"           سباتول    ","ادوات غرف","EA."]
[560,220102218,"           اسبامسطرين","ادوات غرف","EA."]
[561,220102224,"           ملعقةايس0ك","ادوات غرف","EA."]
[562,220102225,"           كبشة للغرف","ادوات غرف","EA."]
[563,220102234,"           معيار2 لتر","ادوات غرف","EA."]
[564,220102235,"           معيار1 لتر","ادوات غرف","EA."]
[565,220102236,"           مقوار تفاح","ادوات غرف","EA."]
[566,220102237,"           م/بارزيان ","ادوات غرف","EA."]
[567,220102239,"           اسباتول رف","ادوات غرف","EA."]
[568,220102241,"           اسباتول1مت","ادوات غرف","EA."]
[569,220102242,"           اسباتول4بو","ادوات غرف","EA."]
[570,220103212,"               للبيض     ","قطاعه","EA."]
[571,220103217,"               كنابية40  ","قطاعه","EA."]
[572,220103218,"               عجلة بيتسا","قطاعه","EA."]
[573,220103219,"               خرامة عجين","قطاعه","EA."]
[574,220104102,"               فرخ سيلكون","فورمه","EA."]
[575,220104214,"               عادة      ","فورمه","EA."]
[576,220104216,"               ف تورتة 20","فورمه","EA."]
[577,220104237,"               بلبلة16/5م","فورمه","EA."]
[578,220104238,"               بلبلة8/3 م","فورمه","EA."]
[579,220104239,"               بلبلة2/1 م","فورمه","EA."]
[580,220104240,"               بلبلة16/9م","فورمه","EA."]
[581,220104241,"               بلبلة8/5 م","فورمه","EA."]
[582,220104242,"               بلبلة4/1 م","فورمه","EA."]
[583,220104243,"               بلبلة16/5س","فورمه","EA."]
[584,220104244,"               بلبلة2/1س ","فورمه","EA."]
[585,220104245,"               بلبلة8/5س ","فورمه","EA."]
[586,220104246,"               بلبلة4/1س ","فورمه","EA."]
[587,220104249,"               كيس كريمةم","فورمه","EA."]
[588,220104251,"               ق.تورته30س","فورمه","EA."]
[589,220104447,"               فورمه كيك ","فورمه","EA."]
[590,220104448,"               قالب توست ","فورمه","EA."]
[591,220104449,"               فورة24سم  ","فورمه","EA."]
[592,220104450,"               فورمة30سم ","فورمه","EA."]
[593,220105207,"                سلك استانس","مضرب","EA."]
[594,220105208,"                سلك ص  بيض","مضرب","EA."]
[595,220105213,"                مضرب سلك1م","مضرب","EA."]
[596,220106204,"               للخضارستيل","مبشرة","EA."]
[597,220106211,"               مبشرةستنلس","مبشرة","EA."]
[598,220106212,"               مقشرةصغيرة","مبشرة","EA."]
[599,220106214,"               مفرمه ثوم ","مبشرة","EA."]
[600,220106215,"               اده لزاله ","مبشرة","EA."]
[601,220106216,"               مقص مطبخ  ","مبشرة","EA."]
[602,220107206,"         مستحد للسن","ادوات جزارة","EA."]
[603,220107212,"         بلنش بلستك","ادوات جزارة","EA."]
[604,220107214,"         مستحد صلب ","ادوات جزارة","EA."]
[605,220107215,"         مقاس 50×40","ادوات جزارة","EA."]
[606,220107217,"         بلنش أحمر ","ادوات جزارة","EA."]
[607,220107218,"         بلنش أزرق ","ادوات جزارة","EA."]
[608,220107219,"         بلنش أخضر ","ادوات جزارة","EA."]
[609,220107220,"         بلنش أصفر ","ادوات جزارة","EA."]
[610,220107221,"         بلنش  بنى ","ادوات جزارة","EA."]
[611,220107225,"         لوح تقطيع ","ادوات جزارة","EA."]
[612,220108201,"                واحد  بوصه","فرشه","EA."]
[613,220108202,"                اثنين بوصه","فرشه","EA."]
[614,220108204,"                فرشةسلك م ","فرشه","EA."]
[615,220108206,"                فرشةدقيق21","فرشه","EA."]
[616,220109213,"               سكينه فيبر","سكينه","EA."]
[617,220109216,"               سكينةمطبخ ","سكينه","EA."]
[618,220109217,"               سكينةمطبخ ","سكينه","EA."]
[619,220109221,"               سكين مشرشر","سكينه","EA."]
[620,220109231,"               شرائح     ","سكينه","EA."]
[621,220109232,"               شرائح     ","سكينه","EA."]
[622,220109249,"               م/مربع    ","سكينه","EA."]
[623,220109250,"               س 10/بوصه ","سكينه","EA."]
[624,220109251,"               سكينة4بيد ","سكينه","EA."]
[625,220109252,"               سكينة6بوصة","سكينه","EA."]
[626,220109253,"               سكينةمشرشر","سكينه","EA."]
[627,220109256,"               س /س /فيلة","سكينه","EA."]
[628,220109257,"               س /تقطيع12","سكينه","EA."]
[629,220109265,"               ق/استانليس","سكينه","EA."]
[630,220109266,"               ق/استانليس","سكينه","EA."]
[631,220109267,"               ق/مست/صغير","سكينه","EA."]
[632,220109268,"               فطاعه 15سم","سكينه","EA."]
[633,220109269,"               قطاعه 4 سم","سكينه","EA."]
[634,220109270,"               قطاعه 8سم ","سكينه","EA."]
[635,220109271,"               قطاعه 6 سم","سكينه","EA."]
[636,220109273,"               قطاعه3.8مل","سكينه","EA."]
[637,220109274,"               قطاعه6.5مل","سكينه","EA."]
[638,220109281,"               قطاعه م3سم","سكينه","EA."]
[639,220109284,"               قطاعةم 5سم","سكينه","EA."]
[640,220109289,"               س مطبخ20سم","سكينه","EA."]
[641,220109290,"               س مطبخ25سم","سكينه","EA."]
[642,220110122,"    منخل 35سم ","منخل / مصفاة سلك","EA."]
[643,220111102,"                 نشابة 20\" ","رول","EA."]
[644,220202203,"                للومليت22س","طاسه","EA."]
[645,220202204,"                طاسةتيفال ","طاسه","EA."]
[646,220202207,"                طاسةتيفال ","طاسه","EA."]
[647,220202211,"                طاسه18×3سم","طاسه","EA."]
[648,220202214,"                طاسةت32/سم","طاسه","EA."]
[649,220202215,"                ط مالومنيو","طاسه","EA."]
[650,220202216,"                طاسه صوص  ","طاسه","EA."]
[651,220202217,"                طاسه صوص  ","طاسه","EA."]
[652,220203206,"               شنوار ك   ","مصفاه","EA."]
[653,220203211,"               قمع شنوارك","مصفاه","EA."]
[654,220203213,"               سلك قطر20س","مصفاه","EA."]
[655,220203217,"               مصفاه","S باول40سم","EA."]
[656,220203218,"               باول5ز14 ل","مصفاه","EA."]
[657,220203219,"               جاستر200مم","مصفاه","EA."]
[658,220203220,"               جاستر100مم","مصفاه","EA."]
[659,220203221,"               جاستر50ملى","مصفاه","EA."]
[660,220203224,"               مصفاة 22سم","مصفاه","EA."]
[661,220203229,"               جاسترو ثلث","مصفاه","EA."]
[662,220203232,"               جاسترو20سم","مصفاه","EA."]
[663,220203234,"               جاسترو10سم","مصفاه","EA."]
[664,220203235,"               جاستر 1سم ","مصفاه","EA."]
[665,220203236,"               جاستر 10سم","مصفاه","EA."]
[666,220203237,"               جاسترنورم ","مصفاه","EA."]
[667,220203238,"               جاسترنورم ","مصفاه","EA."]
[668,220203240,"               باول مستدي","مصفاه","EA."]
[669,220203241,"               باول مستدي","مصفاه","EA."]
[670,220203242,"               حله صوص   ","مصفاه","EA."]
[671,220203243,"               حله استليس","مصفاه","EA."]
[672,220206203,"         صندوق أصفر","وعاء بلستيك","EA."]
[673,220206209,"         ص /بلغارى ","وعاء بلستيك","EA."]
[674,220206212,"         صندوق أزرق","وعاء بلستيك","EA."]
[675,220302208,"        م0ترقيم   ","ماكينه يدوية","EA."]
[676,220302209,"        عبوه حبر ت","ماكينه يدوية","EA."]
[677,220302210,"        فتاحةكبيرة","ماكينه يدوية","EA."]
[678,220304203,"                 بوصة  ","قفل   2","EA."]
[679,220304207,"                 ز2بوصةزط ","قفل5","EA."]
[680,220401209," ص/الو/فرنس","صوانى وصاجات معدنية","EA."]
[681,220401221," صوانى وصاجات معدنية","SS   صينيه","EA."]
[682,220401315," وير (شبك) ","صوانى وصاجات معدنية","EA."]
[683,220401316," لوح مثقب م","صوانى وصاجات معدنية","EA."]
[684,220401319," لوح خبز   ","صوانى وصاجات معدنية","EA."]
[685,220401321," لوح خبزفرن","صوانى وصاجات معدنية","EA."]
[686,220401335," ص ستنلس   ","صوانى وصاجات معدنية","EA."]
[687,220401338," ص/ب/صغيرة ","صوانى وصاجات معدنية","EA."]
[688,220413201,"           حذاءسابو  ","حذاء سابو","EA."]
[689,220415016,"               غلية مياه ","معدات","EA."]
[690,320101402,"          بيبسى 5ر1","مياه غازيه ","CRT"]
[691,320101403,"          ب 0 د 5ر1 ","مياه غازيه","CRT"]
[692,320101404,"          ميرندا 5ر1","مياه غازيه","CRT"]
[693,320101406,"          كوكا 5ر1  ","مياه غازيه","CRT"]
[694,320101407,"          فانتا 5ر1","مياه غازيه ","CRT"]
[695,320101408,"          سبرايت 5ر1","مياه غازيه","CRT"]
[696,320101409,"          م/غ/كول1ر ","مياه غازيه","CRT"]
[697,320101417,"          سفن اب    ","مياه غازيه","CRT"]
[698,320101418,"          سفن اب0د  ","مياه غازيه","CRT"]
[699,320101420,"          اسبريت1لتر","مياه غازيه","BOT"]
[700,320101421,"          كول2لتر   ","مياه غازيه","BOT"]
[701,320101423,"          ليمون 2لتر","مياه غازيه","BOT"]
[702,320101428,"          بيبسى1لتر ","مياه غازيه","BOT"]
[703,320101429,"          بيبسىليت1ل","مياه غازيه","BOT"]
[704,320101430,"          سفن اب 1لت","مياه غازيه","BOT"]
[705,320101431,"          سفن ليت1لت","مياه غازيه","BOT"]
[706,320101432,"          ميرند 1لتر","مياه غازيه","BOT"]
[707,320102310,"    سفن اب 330","مياه غازيه كبيره","TIN"]
[708,320102314,"    ميراندا330","مياه غازيه كبيره","CRT"]
[709,320102323,"    صودا330مل ","مياه غازيه كبيره","CRT"]
[710,320102324,"    تونيك330مل","مياه غازيه كبيره","CRT"]
[711,320102326,"    كوكاكول/م ","مياه غازيه كبيره","CRT"]
[712,320102327,"    فانتابرتقا","مياه غازيه كبيره","CRT"]
[713,320102328,"    اسبرايت   ","مياه غازيه كبيره","CRT"]
[714,320102332,"    كولليت330م","مياه غازيه كبيره","TIN"]
[715,320102333,"    بيبسى330مل","مياه غازيه كبيره","CRT"]
[716,320102334,"    بيبسىدايت0","مياه غازيه كبيره","CRT"]
[717,320102335,"    سفن دايت30","مياه غازيه كبيره","CRT"]
[718,320102340,"    ل/دايت330م","مياه غازيه كبيره","CRT"]
[719,320102376,"    برتقال250م","مياه غازيه كبيره","TIN"]
[720,320102378,"    ليمون250مل","مياه غازيه كبيره","TIN"]
[721,320102380,"    تونك250ملى","مياه غازيه كبيره","TIN"]
[722,320102381,"    صودا250وتر","مياه غازيه كبيره","TIN"]
[723,320102385,"    كول250مللى","مياه غازيه كبيره","TIN"]
[724,320102386,"    كولزي250مل","مياه غازيه كبيره","TIN"]
[725,320102388,"    كولليت355م","مياه غازيه كبيره","TIN"]
[726,320102389,"    ليمون355مل","مياه غازيه كبيره","TIN"]
[727,320102390,"    كول355مللى","مياه غازيه كبيره","TIN"]
[728,320102392,"    ليمون355دا","مياه غازيه كبيره","TIN"]
[729,320102398,"    ك/بلستك300","مياه غازيه كبيره","BOT"]
[730,320102400,"    لمون300بلا","مياه غازيه كبيره","BOT"]
[731,320102402,"    برتقال300ب","مياه غازيه كبيره","BOT"]
[732,320104302,"علبة بدون ","مشروب شعير بدون كحول","TIN"]
[733,320104303,"علبة بكحول","مشروب شعير بدون كحول","CRT"]
[734,320104305,"تفاح330ملى","مشروب شعير بدون كحول","TIN"]
[735,320104306,"اناناس 330","مشروب شعير بدون كحول","TIN"]
[736,320104309,"بيرةهانكين","مشروب شعير بدون كحول","TIN"]
[737,320104312,"بيرة ماكس ","مشروب شعير بدون كحول","TIN"]
[738,320104314,"خوخ330ملى ","مشروب شعير بدون كحول","TIN"]
[739,320105001,"1م/غازيةكول","مشروبات غازية حوالى","BOT"]
[740,320105003,"1م/ليمون1لت","مشروبات غازية حوالى","BOT"]
[741,320105005,"1م/برتقال1 ","مشروبات غازية حوالى","BOT"]
[742,320105006,"1كولا970مم ","مشروبات غازية حوالى","BOT"]
[743,320105007,"1كولليت970م","مشروبات غازية حوالى","BOT"]
[744,320105008,"1ليمون970مم","مشروبات غازية حوالى","BOT"]
[745,320105009,"1ل/ليت970مم","مشروبات غازية حوالى","BOT"]
[746,320105010,"1برتقال970م","مشروبات غازية حوالى","BOT"]
[747,320107001,"    كولا300ملل","مياه غازيةزجاجات","BOT"]
[748,320107003,"    ليمون300مل","مياه غازيةزجاجات","BOT"]
[749,320107004,"    برتقال300م","مياه غازيةزجاجات","BOT"]
[750,320201303,"                 باكو  9جم ","شاى","THN"]
[751,320201602,"                 شاىحوالى2ج","شاى","BOX"]
[752,320201606,"                 ليبتون2جم","شاى ","BOX"]
[753,320201607,"                 جم كفتريا","شاى2","BOX"]
[754,320201608,"                 اخضرنعناع2","شاى","PKT"]
[755,320201623,"                 اخضر5ر1نعن","شاى","TIN"]
[756,320201632,"                 أخ/نع5ر1ظر","شاى","TIN"]
[757,320201633,"                 أحمر2جم ظر","شاى","PKT"]
[758,320202609,"                  نستله كلسك","بن","JAR"]
[759,320202614,"                  بن اسبرتو ","بن","EA."]
[760,320202615,"                  بن لفازا  ","بن","KGM"]
[761,320202617,"                  بن دون كاف","بن","JAR"]
[762,320202637,"                  ن/جولد50جم","بن","JAR"]
[763,320203601,"        مكعبات10جم","زبدة بالقطعة","THN"]
[764,320203603,"        بلستك10جم ","زبدة بالقطعة","THN"]
[765,320203604,"        زبدةمرجرين","زبدة بالقطعة","THN"]
[766,320203605,"        رويال باك ","زبدة بالقطعة","EA."]
[767,320204601," باكو10ج","         سلطةدريسنج   ","THN"]
[768,320204611," فرنش 8/236","         سلطةدريسنج","BOT"]
[769,320204612," بلوتشيز236","         سلطةدريسنج","BOT"]
[770,320204619," ديمى جلس  ","         سلطةدريسنج","CRT"]
[771,320204621," باربكيو   ","         سلطةدريسنج","JRK"]
[772,320204636," ديمىجلس750","         سلطةدريسنج","TIN"]
[773,320204637," درسينج بدو","         سلطةدريسنج","THN"]
[774,320205604,"     باكوملح1جم","عبوات ملح /فلفل","THN"]
[775,320205605,"     ب فلفل5رجم","عبوات ملح /فلفل","THN"]
[776,320205607,"     ملح1جم مم ","عبوات ملح /فلفل","THN"]
[777,320205608,"     فلفل5رجم م","عبوات ملح /فلفل","THN"]
[778,320206603,"        كريمر م/م ","لبن جاف باكو","THN"]
[779,320206605,"        كريمرش م/م","لبن جاف باكو","THN"]
[780,320206606,"        كريمه10جم ","لبن جاف باكو","PKT"]
[781,320206607,"        جاف2جم بدو","لبن جاف باكو","THN"]
[782,320207601,"            باكو  7جم ","سكر ناعم","THN"]
[783,320207603,"            سكرمنخفض  ","سكر ناعم","THN"]
[784,320207605,"            بدون شعار ","سكر ناعم","THN"]
[785,320207606,"            سكر7جم مم ","سكر ناعم","THN"]
[786,320207617,"            سكرمغلف بد","سكر ناعم","THN"]
[787,320207623,"            سكر5ج شعار","سكر ناعم","THN"]
[788,320208602,"                بدون شعار ","مربى","THN"]
[789,320208615,"                جم زجاج ","مربى30","EA."]
[790,320208617,"                مربى اصناف","مربى","EA."]
[791,320208624,"                م/ب/ف20جم ","مربى","EA."]
[792,320209603,"             عسل ن0بدون","عسل نحل","EA."]
[793,320209606,"             ع ح30جم بد","عسل نحل","EA."]
[794,320209607,"             عسل نحل35ج","عسل نحل","EA."]
[795,320209612,"             ع/نح/ب20/ج","عسل نحل","EA."]
[796,320304301," برتقال    ","عصير علب كرتون 1لتر","CRT"]
[797,320304302," تفاح      ","عصير علب كرتون 1لتر","CRT"]
[798,320304303," مانجو     ","عصير علب كرتون 1لتر","CRT"]
[799,320304304," اناناس    ","عصير علب كرتون 1لتر","CRT"]
[800,320304305," جوافة1لتر ","عصير علب كرتون 1لتر","CRT"]
[801,320304306," تفاح/غ/م  ","عصير علب كرتون 1لتر","CRT"]
[802,320304307," برتقال/غ/م","عصير علب كرتون 1لتر","CRT"]
[803,320304308," عصير/ط/لتر","عصير علب كرتون 1لتر","CRT"]
[804,320304309," كوكتيل1لتر","عصير علب كرتون 1لتر","CRT"]
[805,320304313," عصيرقمردين","عصير علب كرتون 1لتر","LTR"]
[806,320304316," ع خروب 1  ","عصير علب كرتون 1لتر","LTR"]
[807,320304317," اناناس غ م","عصير علب كرتون 1لتر","LTR"]
[808,320304322," ع/طمطم غير","عصير علب كرتون 1لتر","CRT"]
[809,320305301,"          برتقال200م","عصير انواع","CRT"]
[810,320305302,"          جوافه200مل","عصير انواع","CRT"]
[811,320305303,"          تفاح200مل ","عصير انواع","CRT"]
[812,320305305,"          عصيركوكتيل","عصير انواع","CRT"]
[813,320305306,"          عصيرمانجو ","عصير انواع","CRT"]
[814,320305307,"          برتقال200غ","عصير انواع","CRT"]
[815,320305399,"          ليمون1000م","عصير انواع","BOT"]
[816,320305427,"          تفاح/م235م","عصير انواع","TIN"]
[817,320305428,"          ع/جوافة235","عصير انواع","TIN"]
[818,320305429,"          ع/مانجو235","عصير انواع","TIN"]
[819,320305430,"          ع/برتقل235","عصير انواع","TIN"]
[820,320305431,"          أناناس235م","عصير انواع","TIN"]
[821,320401502,"         عبوه1,5لتر","مياه معدنية","BOX"]
[822,320401505,"         بيرييه330م","مياه معدنية","CRT"]
[823,320401509,"         مياه600ملى","مياه معدنية","CRT"]
[824,320401525,"         مباه650ملى","مياه معدنية","BOT"]
[825,320401526,"         م فواره240","مياه معدنية","BOT"]
[826,410104107,"                باينوسكت  ","مبيد","EA."]
[827,410104116,"                ايروسول 60","مبيد","EA."]
[828,410104121,"                سيبركيل   ","مبيد","EA."]
[829,410104124,"                باينوسكت  ","مبيد","EA."]
[830,410104125,"                ديازينون  ","مبيد","LTR"]
[831,410104128,"                ايروسول60 ","مبيد","EA."]
[832,410301114,"        قرص معطر  ","ادوات تواليت","EA."]
[833,410301117,"        ادوات تواليت","AEROSOL400","EA."]
[834,410301118,"        ادوات تواليت"," KILLER250","EA."]
[835,410401104,"            لبنى كبير ","مفرش ورق","THN"]
[836,410401115,"            مفرش أطلس ","مفرش ورق","THN"]
[837,410402103,"         كيس دوار  ","عبوات ورقية","THN"]
[838,420102100,"       لمبادة10% ","منظف/مطهرمطبخ","LTR"]
[839,420102101,"       مادةتلميع","منظف/مطهرمطبخ ","EA."]
[840,420102113,"       صابون سائل","منظف/مطهرمطبخ","KGM"]
[841,420102122,"       مطهرارضيات","منظف/مطهرمطبخ","LTR"]
[842,420102123,"       منظف افران","منظف/مطهرمطبخ","KGM"]
[843,420102126,"       صابون ايدى","منظف/مطهرمطبخ","LTR"]
[844,420102127,"       صابون200مل","منظف/مطهرمطبخ","EA."]
[845,420102131,"       كلوركس    ","منظف/مطهرمطبخ","BOT"]
[846,420102134,"       مبيد300ملى","منظف/مطهرمطبخ","TIN"]
[847,420102138,"       صابون200يد","منظف/مطهرمطبخ","EA."]
[848,420102141,"       م/نقع/استا","منظف/مطهرمطبخ","KGM"]
[849,420102142,"       مسلك بلعات","منظف/مطهرمطبخ","KGM"]
[850,420102143,"       صابون175مل","منظف/مطهرمطبخ","EA."]
[851,420102148,"       توب زد57% ","منظف/مطهرمطبخ","LTR"]
[852,420102149,"       ملثيون ت5%","منظف/مطهرمطبخ","KGM"]
[853,420102150,"       كيل رش عجي","منظف/مطهرمطبخ","KGM"]
[854,420102151,"       رات سوبر ك","منظف/مطهرمطبخ","KGM"]
[855,420102154,"       بوريك عجين","منظف/مطهرمطبخ","EA."]
[856,420102155,"       ص/سائل بدو","منظف/مطهرمطبخ","KGM"]
[857,420102162,"       م/دهون وشح","منظف/مطهرمطبخ","LTR"]
[858,420102164,"       ص/أيد125يد","منظف/مطهرمطبخ","EA."]
[859,420102167,"       ص/سائل بدو","منظف/مطهرمطبخ","LTR"]
[860,420102170,"       ديتول125مل","منظف/مطهرمطبخ","BOT"]
[861,420103127,"مزيل بقع ش","منظفات :مغسلة/وغليات","KGM"]
[862,420103135,"ليفرلين   ","منظفات :مغسلة/وغليات","EA."]
[863,420103136,"ساتينو رول","منظفات :مغسلة/وغليات","EA."]
[864,420103138,"سوماسول   ","منظفات :مغسلة/وغليات","KGM"]
[865,420103142,"اقراص مطهر","منظفات :مغسلة/وغليات","TIN"]
[866,420103144,"ص /كومبكت ","منظفات :مغسلة/وغليات","JAR"]
[867,420103145,"م/أملح بود","منظفات :مغسلة/وغليات","KGM"]
[868,420103147,"رينزول    ","منظفات :مغسلة/وغليات","LTR"]
[869,420103148,"سوماسبشيال","منظفات :مغسلة/وغليات","JRK"]
[870,420103149,"تاسكى سان ","منظفات :مغسلة/وغليات","JRK"]
[871,420103152,"سوما سكال5","منظفات :مغسلة/وغليات","JRK"]
[872,420103159,"مظيل دهون ","منظفات :مغسلة/وغليات","LTR"]
[873,420103160,"منعم ومعطر","منظفات :مغسلة/وغليات","LTR"]
[874,420103161,"صابون اساس","منظفات :مغسلة/وغليات","LTR"]
[875,420103162,"كلور الوان","منظفات :مغسلة/وغليات","LTR"]
[876,420103163,"كلور ابيض ","منظفات :مغسلة/وغليات","LTR"]
[877,420103164,"قاطع صابون","منظفات :مغسلة/وغليات","LTR"]
[878,420103165,"مفتت بقع  ","منظفات :مغسلة/وغليات","LTR"]
[879,420103169,"مزيل املح ","منظفات :مغسلة/وغليات","LTR"]
[880,420103174,"مطهر أسطح ","منظفات :مغسلة/وغليات","LTR"]
[881,420103178,"ورق رول لل","منظفات :مغسلة/وغليات","ROL"]
[882,420103189,"خضاروفاكهه","منظفات :مغسلة/وغليات","EA."]
[883,420103193,"غسيل زجاج ","منظفات :مغسلة/وغليات","LTR"]
[884,420103194,"مسحوق اتوم","منظفات :مغسلة/وغليات","KGM"]
[885,420201103," بكر1500×30","مهمات بلستيك للمطبخ","ROL"]
[886,420201104," جوانتى    ","مهمات بلستيك للمطبخ","THN"]
[887,420201106," ز/بلستك1لت","مهمات بلستيك للمطبخ","BOT"]
[888,420201112," بكرتغليف45","مهمات بلستيك للمطبخ","ROL"]
[889,420201114," جوانتىفنيل","مهمات بلستيك للمطبخ","EA."]
[890,420202201,"          للفضيه    ","كيس بلستيك","THN"]
[891,420202203,"          للثلج     ","كيس بلستيك","KGM"]
[892,420202204,"          بطاطين مخر","كيس بلستيك","KGM"]
[893,420202207,"          ابيض زبالة","كيس بلستيك","THN"]
[894,420202208,"          كيس قمامه ","كيس بلستيك","EA."]
[895,420202212,"          جافةش","كيس بلستيك28×20","KGM"]
[896,420202219,"          كيس اسود  ","كيس بلستيك","EA."]
[897,420202222,"          كيس قمامةص","كيس بلستيك","KGM"]
[898,420202224,"          كيس اسود ك","كيس بلستيك","KGM"]
[899,420203101,"      شماعةبلستك","متنوعات بلستيك","DOZ"]
[900,420203103,"      ع/ث/ج/فوم ","متنوعات بلستيك","EA."]
[901,420301108,"          صابون مغلف","موادتواليت","EA."]
[902,420301109,"          فوط صحية  ","موادتواليت","EA."]
[903,420301111,"          كولونيا   ","موادتواليت","BOT"]
[904,420301113,"          صابون غيرم","موادتواليت","EA."]
[905,420301114,"          فوط صحيةبش","موادتواليت","EA."]
[906,420301122,"          كولونيا اس","موادتواليت","BOT"]
[907,420301123,"          كلونياف اك","موادتواليت","BOT"]
[908,420301142,"          ديتول125مل","موادتواليت","BOT"]
[909,420301143,"          معطرم320مل","موادتواليت","BOT"]
[910,420301144,"          معطرم460مل","موادتواليت","BOT"]
[911,420401101,"         فضى ابيض ك","فوط و مفارش","THN"]
[912,420401102,"         زهبى","فوط و مفارشXرمادى","EA."]
[913,420401108,"         ورق تواليت","فوط و مفارش","ROL"]
[914,420401110,"         دانتيل26مط","فوط و مفارش","EA."]
[915,420401113,"         فوط 2 طبقة","فوط و مفارش","PKT"]
[916,420401115,"         كاشيه    7","فوط و مفارش","THN"]
[917,420401116,"         دانتيل  35","فوط و مفارش","EA."]
[918,420401121,"         فوط  تنشيف","فوط و مفارش","PKT"]
[919,420401122,"         فضى متوسط ","فوط و مفارش","THN"]
[920,420401125,"         مفرش كاس6ط","فوط و مفارش","THN"]
[921,420401129,"         ف0و أبيض 3","فوط و مفارش","PKT"]
[922,420401130,"         ف0وسناكس 3","فوط و مفارش","PKT"]
[923,420401131,"         مفرش 35×22","فوط و مفارش","THN"]
[924,420401133,"         مفرش 26سم ","فوط و مفارش","THN"]
[925,420401134,"         مناشف مطبخ","فوط و مفارش","ROL"]
[926,420401135,"         طبقة80فوط","فوط و مفارش2","BOX"]
[927,420401136,"         مناديل سفر","فوط و مفارش","PKT"]
[928,420401137,"         طبقه     ","فوط و مفارش2","BOX"]
[929,420401138,"         م/مفضض وسط","فوط و مفارش","EA."]
[930,420401139,"         م/مفضض كبي","فوط و مفارش","EA."]
[931,420401140,"         مناديل2اسم","فوط و مفارش","PKT"]
[932,420401143,"         م/صغيراكسب","فوط و مفارش","EA."]
[933,420401144,"         م/وسط اكسب","فوط و مفارش","EA."]
[934,420401146,"         رول تواليت","فوط و مفارش","ROL"]
[935,420401150,"         منديل سناك","فوط و مفارش","PKT"]
[936,420401152,"         كوستر6بدون","فوط و مفارش","EA."]
[937,420401154,"         م/وسط/لبنى","فوط و مفارش","EA."]
[938,420402102,"         كيس دوار","عبوات ورقية  ","THN"]
[939,420402109,"         حافظةورق  ","عبوات ورقية","EA."]
[940,420402111,"         غ مجلةلستك","عبوات ورقية","EA."]
[941,420402112,"         كيس دوار  ","عبوات ورقية","EA."]
[942,420402113,"         دواراكسبري","عبوات ورقية","EA."]
[943,420402115,"         ك دوار بلو","عبوات ورقية","EA."]
[944,420403103,"              ق.تواليت  ","ورقيات","PKT"]
[945,420403104,"              طاقيةطباخ ","ورقيات","EA."]
[946,420403106,"              غ.ق.ت الف ","ورقيات","PKT"]
[947,420403108,"              مسند كراسى","ورقيات","EA."]
[948,420403109,"              غطاء رأس  ","ورقيات","EA."]
[949,420403110,"              ابيض اكسبر","ورقيات","EA."]
[950,420403111,"              مسند ك بدو","ورقيات","EA."]
[951,420403112,"              غطاء ق بدو","ورقيات","PKT"]
[952,420403116,"              غ/م/مؤتمر ","ورقيات","EA."]
[953,420404111,"               علبةدوبلكس","كرتون","EA."]
[954,420404114,"               ق/ت/مفضض  ","كرتون","KGM"]
[955,420404115,"               علبة25×8سم","كرتون","EA."]
[956,420404116,"               قاعدةم16/س","كرتون","KGM"]
[957,420404122,"               قاعدة 26سم","كرتون","KGM"]
[958,420404408,"               كرتون","   6*25*25","EA."]
[959,420405101,"             ورق زبدة00","ورق خام","EA."]
[960,420405102,"             ورق سيلوفا","ورق خام","EA."]
[961,420502101,"        لفافة     ","لوازم الطفال","EA."]
[962,420601106,"             مخدة38×27س","مفروشات","EA."]
[963,420601213,"             بطانيه صوف","مفروشات","EA."]
[964,420602119,"         ملايةسريرب","فوط و مفارش","EA."]
[965,420602182,"         فوطةبونج/م","فوط و مفارش","THN"]
[966,420602189,"         م45×65اكسب","فوط و مفارش","EA."]
[967,420605105," ورق لماكينه الصرافه","Kبكر مقاس ","EA."]
[968,420701101,"         مساحه بيد ","ادوات نظافه","EA."]
[969,420701105,"         زبالةبلستك","ادوات نظافه","EA."]
[970,420701110,"         ليف ألوان ","ادوات نظافه","EA."]
[971,420701114,"         فرشة أظافر","ادوات نظافه","EA."]
[972,420701117,"         مقشةبلستيك","ادوات نظافه","EA."]
[973,420701119,"         جاروف بيدك","ادوات نظافه","EA."]
[974,420701120,"         فوط مسح وب","ادوات نظافه","EA."]
[975,420701121,"         فرشةبيد   ","ادوات نظافه","EA."]
[976,420701126,"         زبالةف/قدم","ادوات نظافه","EA."]
[977,420701128,"         جردل 15لتر","ادوات نظافه","EA."]
[978,420701129,"         بخاخةبلستك","ادوات نظافه","EA."]
[979,420701131,"         فرشةتواليت","ادوات نظافه","EA."]
[980,420701132,"         هارداسبونج","ادوات نظافه","EA."]
[981,420701133,"         منظف زجاج ","ادوات نظافه","EA."]
[982,420701134,"         سكويزربدون","ادوات نظافه","EA."]
[983,420701135,"         جاروف بدون","ادوات نظافه","EA."]
[984,420701142,"         ملمع زجاج1","ادوات نظافه","BOT"]
[985,420701143,"         مقش بدن يد","ادوات نظافه","EA."]
[986,420900105,"    احباروورق طابعات","LAXMARشريط","EA."]
[987,420900106,"    احباروورق طابعات","49A1320حبر","EA."]
[988,420900201,"    أصل + صوره","احباروورق طابعات","CRT"]
[989,420900202,"    أصل+ 2صوره","احباروورق طابعات","CRT"]
[990,420901103,"             لفة ورقلصق","متنوعات","ROL"]
[991,420903101,"  كذلك برقبة","مستلزمات أمن صناعى","EA."]
[992,420903103,"  حذاء جلد  ","مستلزمات أمن صناعى","EA."]
[993,420903105,"  بالطو مطر ","مستلزمات أمن صناعى","EA."]
[994,420903106,"  جوانتى جلد","مستلزمات أمن صناعى","EA."]
[995,420903107,"  جوانتىحرار","مستلزمات أمن صناعى","EA."]
[996,420903108,"  ج تحميل   ","مستلزمات أمن صناعى","EA."]
[997,420903109,"  ج / أحماض ","مستلزمات أمن صناعى","EA."]
[998,420903111,"  مريلة فيبر","مستلزمات أمن صناعى","EA."]
[999,420903112,"  جونتىكاوتش","مستلزمات أمن صناعى","EA."]
[1000,420903114,"  جاكت فسفور","مستلزمات أمن صناعى","EA."]
[1001,420903117,"  خوذةبلستيك","مستلزمات أمن صناعى","EA."]
[1002,420903118,"  كمامةغازات","مستلزمات أمن صناعى","EA."]
[1003,420903120,"  كمامةأتربة","مستلزمات أمن صناعى","EA."]
[1004,420903122,"  كالسون فان","مستلزمات أمن صناعى","EA."]
[1005,420903123,"  حذا جلد طب","مستلزمات أمن صناعى","EA."]
[1006,420903125,"  حذاءجلدخفي","مستلزمات أمن صناعى","EA."]
[1007,420903126,"  كوتشى     ","مستلزمات أمن صناعى","EA."]
[1008,420903128,"  بلطه اقتحا","مستلزمات أمن صناعى","EA."]
[1009,420903129,"  جهاز تنفس ","مستلزمات أمن صناعى","EA."]
[1010,420903130,"  كشاف اضاءه","مستلزمات أمن صناعى","EA."]
[1011,420903131,"  طفايه6ك ثا","مستلزمات أمن صناعى","EA."]
[1012,420903133,"  جونتى محبب","مستلزمات أمن صناعى","EA."]
[1013,420903134,"  سدادة أذن ","مستلزمات أمن صناعى","EA."]
[1014,420903135,"  بالطو ثلجه","مستلزمات أمن صناعى","EA."]
[1015,420903136,"  فلتر كامل ","مستلزمات أمن صناعى","EA."]
[1016,420903138,"  جاكت كحلى ","مستلزمات أمن صناعى","EA."]
[1017,420903139,"  كمامةورقية","مستلزمات أمن صناعى","EA."]
[1018,420903140,"  سابوةأسود ","مستلزمات أمن صناعى","EA."]
[1019,420904101,"بدله طباخ ","القابضه لمصر للطيران","EA."]
[1020,420904102,"بدله تموين","القابضه لمصر للطيران","EA."]
[1021,420904109,"بنطلون جبر","القابضه لمصر للطيران","EA."]
[1022,420904110,"جاكت/طباخ ","القابضه لمصر للطيران","EA."]
[1023,420904111,"بنطلون طبا","القابضه لمصر للطيران","EA."]
[1024,420904114,"افرول خ كح","القابضه لمصر للطيران","EA."]
[1025,420904141,"سويت شيرت ","القابضه لمصر للطيران","EA."]
[1026,420904142,"بولوشيرت  ","القابضه لمصر للطيران","EA."]
[1027,420905001,"             أزن صرف   ","المخازن","EA."]
[1028,420905003,"             أ/صرف يدوى","المخازن","EA."]
[1029,420907001,"             ق/استلم   ","التموين","EA."]
[1030,420907006,"             فاتورة    ","التموين","EA."]
[1031,420907015,"             كارت ترولى","التموين","EA."]
[1032,420909002,"     دفتر احوال","الموارد البشرية","EA."]
[1033,420911001,"           المشتريات"," GRأزن فحص","EA."]
[1034,420913005,"       ورق تصوير ","الدعايةوالعلم","EA."]
[1035,420913009,"       الدعايةوالعلم","    E4 ظرف","EA."]
[1036,510106102,"               لباردا.باص","ترموس","EA."]
[1037,510510102,"         ابريق ازرق","اوعية بلستك","EA."]
[1038,510510103,"         غطاء ابريق","اوعية بلستك","EA."]
[1039,520103103,"        الومنيوم  ","رف فرن معدنى","EA."]
[1040,520103104,"        قلب  قرن ص","رف فرن معدنى","EA."]
[1041,520202119,"     طبق فاكهه ","عدة صينى ايرباص","EA."]
[1042,520202124,"     ف/ش /مزخرف","عدة صينى ايرباص","EA."]
[1043,520202125,"     ط/ف/مزخرف ","عدة صينى ايرباص","EA."]
[1044,520202127,"     ط/عميق مزخ","عدة صينى ايرباص","EA."]
[1045,520202128,"     ط/باردمزخر","عدة صينى ايرباص","EA."]
[1046,520202130,"     ط/حلومزخرف","عدة صينى ايرباص","EA."]
[1047,520202132,"     ط/غرف مزخر","عدة صينى ايرباص","EA."]
[1048,520202133,"     ب/مدورمزخر","عدة صينى ايرباص","EA."]
[1049,520202144,"     ف0قهوةبشعا","عدة صينى ايرباص","EA."]
[1050,520301101,"      مل.شوربة  ","ف0ص0اولى بشعار","EA."]
[1051,520301118,"      ف0ص0اولى بشعار","F ش  أساسى","EA."]
[1052,520301119,"      ف0ص0اولى بشعار"," Fس  أساسى","EA."]
[1053,520302102," شوكة      ","فضيةصلب سياحى بشعار","EA."]
[1054,520302103," ملعقة شاى ","فضيةصلب سياحى بشعار","EA."]
[1055,520402103,"   طبق متوسط ","طبق وغطاءالمونيوم","THN"]
[1056,520402106,"   ط/مقسم3عين","طبق وغطاءالمونيوم","EA."]
[1057,520402107,"   غ0مستطيل  ","طبق وغطاءالمونيوم","EA."]
[1058,520402108,"   فورمةحلوان","طبق وغطاءالمونيوم","THN"]
[1059,520402109,"   ط/سياحىساخ","طبق وغطاءالمونيوم","EA."]
[1060,520402110,"   غ/ذهبى/شعا","طبق وغطاءالمونيوم","THN"]
[1061,520402111,"   غ/فضى/شعار","طبق وغطاءالمونيوم","THN"]
[1062,520402112,"   ط/مقسم2عين","طبق وغطاءالمونيوم","THN"]
[1063,520402114,"   ط/ألمونيوم","طبق وغطاءالمونيوم","THN"]
[1064,520402115,"   غ/فضى/بدون","طبق وغطاءالمونيوم","THN"]
[1065,520402116,"   ط/الو/كرو/","طبق وغطاءالمونيوم","EA."]
[1066,520402118,"   غ/أزرق/شعا","طبق وغطاءالمونيوم","EA."]
[1067,520402119,"   غ/أبيض/شعا","طبق وغطاءالمونيوم","EA."]
[1068,520402120,"   غ/أحمر/شعا","طبق وغطاءالمونيوم","EA."]
[1069,520402122,"   رول 150متر","طبق وغطاءالمونيوم","EA."]
[1070,520402126,"   ط/الو/بدون","طبق وغطاءالمونيوم","THN"]
[1071,520402127,"   غ/أحمربدون","طبق وغطاءالمونيوم","EA."]
[1072,520402128,"   غ/أزرق بدو","طبق وغطاءالمونيوم","EA."]
[1073,520402129,"   غ/ذهبىبدون","طبق وغطاءالمونيوم","EA."]
[1074,520402130,"   غ/أبيض بدو","طبق وغطاءالمونيوم","EA."]
[1075,520402131,"   طبق171×103","طبق وغطاءالمونيوم","EA."]
[1076,520402132,"   ط/د/سياحى ","طبق وغطاءالمونيوم","EA."]
[1077,520402144,"   سرفيس كبير","طبق وغطاءالمونيوم","EA."]
[1078,520402145,"   ط/فضى شعار","طبق وغطاءالمونيوم","EA."]
[1079,520501113,"        ص 1/ز27بيج","صينية بلستيك","EA."]
[1080,520501114,"        ص /بيج /ك ","صينية بلستيك","EA."]
[1081,520501117,"        صينيه ايزي","صينية بلستيك","EA."]
[1082,520501118,"        صينيه صغير","صينية بلستيك","EA."]
[1083,520501119,"        ص اكسبريس ","صينية بلستيك","EA."]
[1084,520501120,"        لبنى2/3متو","صينية بلستيك","EA."]
[1085,520501122,"        ص2/3حكل-صغ","صينية بلستيك","EA."]
[1086,520502109,"          أبيض ","طبق ميلمينXأزرق","EA."]
[1087,520502114,"          ط/مست أ×أز","طبق ميلمين","EA."]
[1088,520502117,"          ط/م/نحاسى/","طبق ميلمين","EA."]
[1089,520502119,"          اكسبريس   ","طبق ميلمين","EA."]
[1090,520503101," ميلمين مست","     غطاءطبق بلستيك","EA."]
[1091,520503102," مربع فاكي","     غطاءطبق بلستيك ","THN"]
[1092,520503103," صينى مستطي","     غطاءطبق بلستيك","EA."]
[1093,520503104," صينى مربع ","     غطاءطبق بلستيك","EA."]
[1094,520503105," باول ص 0مد","     غطاءطبق بلستيك","EA."]
[1095,520503106," غ/اكسبريس ","     غطاءطبق بلستيك","EA."]
[1096,520503111," غطاء للعيش","     غطاءطبق بلستيك","EA."]
[1097,520503113," غ/طبق جديد","     غطاءطبق بلستيك","EA."]
[1098,520505105,"فنجان شاى ","فنجان شاى بلستيك ميل","THN"]
[1099,520505110,"ف/أزر×أبيض","فنجان شاى بلستيك ميل","EA."]
[1100,520505111,"ف/ازرق شعا","فنجان شاى بلستيك ميل","EA."]
[1101,520505112,"ف/ازرق بدو","فنجان شاى بلستيك ميل","EA."]
[1102,520505113,"ف/اكسبريس ","فنجان شاى بلستيك ميل","EA."]
[1103,520505114,"ف/مستهلك/ك","فنجان شاى بلستيك ميل","EA."]
[1104,520506103,"               ابيض      ","أكواب","THN"]
[1105,520506104,"               شفاف      ","أكواب","THN"]
[1106,520506105,"               باول ","أكواب     ","THN"]
[1107,520506108,"               باول مستطل","أكواب","THN"]
[1108,520506113,"               كوب شفاف ج","أكواب","EA."]
[1109,520506116,"               ب/ف/مربع أ","أكواب","EA."]
[1110,520506117,"               غطاء باول ","أكواب","EA."]
[1111,520506118,"               طبق مستطيل","أكواب","EA."]
[1112,520506119,"               باول 7,5  ","أكواب","EA."]
[1113,520506120,"               أكواب"," 7,5X7,5/غ","EA."]
[1114,520506143,"               باول/م/نحا","أكواب","EA."]
[1115,520506144,"               باول مستطي","أكواب","EA."]
[1116,520506154,"               كوب8ونزشعا","أكواب","EA."]
[1117,520506156,"               ط/ف/كحلى/م","أكواب","EA."]
[1118,520507101,"         سكينه     ","فضيه بلستيك","THN"]
[1119,520507102,"         شوكة      ","فضيه بلستيك","THN"]
[1120,520507103,"         ملعقة شاى ","فضيه بلستيك","THN"]
[1121,520507104,"         ملعقةتقليب","فضيه بلستيك","THN"]
[1122,520507105,"         معلقةشوربة","فضيه بلستيك","EA."]
[1123,520508101,"         قاعدةملحة ","اطقم بلستيك","THN"]
[1124,520508104,"         كيس 8×1   ","اطقم بلستيك","EA."]
[1125,520508105,"         ملعقة","اطقم بلستيك2/1×9","THN"]
[1126,520508107,"         ش","اطقم بلستيك1X11كوفير","THN"]
[1127,520508108,"         اطقم بلستيك"," 1 X5كوفير","EA."]
[1128,520508110,"         كوفير 6×1 ","اطقم بلستيك","EA."]
[1129,520508112,"         كوفير1×11ش","اطقم بلستيك","EA."]
[1130,520508114,"         كليبس ابيض","اطقم بلستيك","EA."]
[1131,520508116,"         ك5×1بدون م","اطقم بلستيك","EA."]
[1132,520508119,"         اطقم بلستيك"," 1 X9كوفير","EA."]
[1133,520508120,"         أ","اطقم بلستيك1X10كوفير","EA."]
[1134,520508121,"         كوفير 11×1","اطقم بلستيك","EA."]
[1135,520508122,"         طقم كوفير ","اطقم بلستيك","EA."]
[1136,520508123,"         كوفير اكسب","اطقم بلستيك","EA."]
[1137,520508125,"         كوفير4×1بد","اطقم بلستيك","EA."]
[1138,520508126,"         كوفير10×1 ","اطقم بلستيك","EA."]
[1139,520509104," علب/سند/كب"," علب بلستيك وسناكس ","EA."]
[1140,520509105," علبةكبيرة"," علب بلستيك وسناكس  ","EA."]
[1141,520509106," طبق فوم   "," علب بلستيك وسناكس ","THN"]
[1142,520509108," علبةشفافة "," علب بلستيك وسناكس ","EA."]
[1143,520509109," بلستك بغطا"," علب بلستيك وسناكس ","EA."]
[1144,520509110," غ/علبةوجبا"," علب بلستيك وسناكس ","EA."]
[1145,520509112," لنش بوكس  "," علب بلستيك وسناكس ","EA."]
[1146,520509114," علبةك/ب/ش "," علب بلستيك وسناكس ","EA."]
[1147,520509115," ع/ص /ش متص"," علب بلستيك وسناكس ","EA."]
[1148,520509117," لنش بوكس ش"," علب بلستيك وسناكس ","EA."]
[1149,520509118," سناكس بدون"," علب بلستيك وسناكس ","EA."]
[1150,520509119," علبه لنش ش"," علب بلستيك وسناكس ","EA."]
[1151,520509120," ع/لنش/كحلى"," علب بلستيك وسناكس ","EA."]
[1152,520509121," ع/لنش شروق"," علب بلستيك وسناكس ","EA."]
[1153,520509122," لنش أبيض ش"," علب بلستيك وسناكس ","EA."]
[1154,520509123," ع/وجب/أزرق"," علب بلستيك وسناكس ","EA."]
[1155,520509124," ع/فرنسى22س"," علب بلستيك وسناكس ","EA."]
[1156,520509125," طبق فوم1ك "," علب بلستيك وسناكس ","EA."]
[1157,520509128," ع/وجبةبدون"," علب بلستيك وسناكس ","EA."]
[1158,520509129," ع/سند26بدو"," علب بلستيك وسناكس ","EA."]
[1159,520511101,"       بالعدد    ","شاليمو بلستيك","EA."]
[1160,520516008,"    علبه بغطاء","معدات ايرو كافية","EA."]
[1161,520603101,"ريشة شيش ك","       ريشة شيش كباب","THN"]
[1162,520604102,"           بالباكو   ","خلة اسنان","BOX"]
[1163,520701124,"            كوب مياه/ع","كاس زجاج","EA."]
[1164,520701125,"            كوب زجاج ش","كاس زجاج","EA."]
[1165,520702001,"               ستاره هواء","ستارة","EA."]
[1166,525604101,"           خله بالعدد","خلة اسنان","EA."]
[1167,711202117,"               قفل ازرق  ","هدايا","THN"]
[1168,711202118,"               قفل اصفر  ","هدايا","THN"]
[1169,711202119,"               قفل اخضر  ","هدايا","THN"]
[1170,711202153,"               قفل برتقال","هدايا","THN"]
[1171,721202102,"               منديل معطر","هدايا","THN"]

{"sheet":"Templete","index":2,"n_rows":200,"n_cols":9,"rows_kept":200,"cut":false,"hidden":false,"merged":[[9,1,9,2],[7,5,7,6],[5,5,5,6],[3,5,3,6],[2,1,2,8],[8,1,8,2]]}
[]
[]
[null,"طـــلبية احتياجات التشغيل"]
[null,null,null,null,"رقــــم الطــلــبــيــه :",null,null,null,"بالطائره لحاجه العمل الماسه"]
[]
[null,null,null,null,"الــــتـــاريـــــــــــخ :",null,null,{"$f":"VLOOKAnyCol(dataazzam,G6,1,2)","v":"مجففة680جم"},"بسياره الطلبيه"]
[]
[null,null,null,null,"طريقه الارسال المطلوبه:","بالطائره لحاجه العمل الماسه"]
[null,"استكمالاً للطلببيه رقم  :"]
[null,"المــــــــــــــــــــــؤرخه :"]
[]
[null,"م","رقم الصنف","الصنف","المجموعه","الوحده","الكميه المطلوبه","الرصيد","ملاحظات"]
[null,null,121401462,{"$f":"IF(C13<>\"\",VLOOKAnyCol(dataazzam,C13,1,2),\"\")","v":"        تونكيز    "},{"$f":"IF(C13<>\"\",VLOOKAnyCol(dataazzam,C13,1,3),\"\")","v":"بسكويت انواع"},{"$f":"IF(C13<>\"\",VLOOKAnyCol(dataazzam,C13,1,4),\"\")","v":"EA."}]
[null,null,null,"","",""]
[null,null,null,"","",""]
[null,null,null,"","",""]
[null,null,null,"","",""]
[null,null,null,"","",""]
[null,null,null,"","",""]
[null,null,null,"","",""]
[null,null,null,"","",""]
[null,null,null,"","",""]
[null,null,null,"","",""]
[null,null,null,"","",""]
[null,null,null,"","",""]
[null,null,null,"","",""]
[null,null,null,"","",""]
[null,null,null,"","",""]
[null,null,null,"","",""]
[null,null,null,"","",""]
[null,null,null,"","",""]
[null,null,null,"","",""]
[null,null,null,"","",""]
[null,null,null,"","",""]
[null,null,null,"","",""]
[null,null,null,"","",""]
[null,null,null,"","",""]
[null,null,null,"","",""]
[null,null,null,"","",""]
[null,null,null,"","",""]
[null,null,null,"","",""]
[null,null,null,"","",""]
[null,null,null,"","",""]
[null,null,null,"","",""]
[null,null,null,{"$f":"IF(C45<>\"\",VLOOKAnyCol(dataazzam,C45,1,2),\"\")","v":""},{"$f":"IF(C45<>\"\",VLOOKAnyCol(dataazzam,C45,1,3),\"\")","v":""},{"$f":"IF(C45<>\"\",VLOOKAnyCol(dataazzam,C45,1,4),\"\")","v":""}]
[null,null,null,"","",""]
[null,null,null,"","",""]
[null,null,null,"","",""]
[null,null,null,"","",""]
[null,null,null,"","",""]
[null,null,null,"","",""]
[null,null,null,"","",""]
[null,null,null,"","",""]
[null,null,null,"","",""]
[null,null,null,"","",""]
[null,null,null,"","",""]
[null,null,null,"","",""]
[null,null,null,"","",""]
[null,null,null,"","",""]
[null,null,null,"","",""]
[null,null,null,"","",""]
[null,null,null,"","",""]
[null,null,null,"","",""]
[null,null,null,"","",""]
[null,null,null,"","",""]
[null,null,null,"","",""]
[null,null,null,"","",""]
[null,null,null,"","",""]
[null,null,null,"","",""]
[null,null,null,"","",""]
[null,null,null,"","",""]
[null,null,null,"","",""]
[null,null,null,"","",""]
[null,null,null,"","",""]
[null,null,null,"","",""]
[null,null,null,"","",""]
[null,null,null,{"$f":"IF(C77<>\"\",VLOOKAnyCol(dataazzam,C77,1,2),\"\")","v":""},{"$f":"IF(C77<>\"\",VLOOKAnyCol(dataazzam,C77,1,3),\"\")","v":""},{"$f":"IF(C77<>\"\",VLOOKAnyCol(dataazzam,C77,1,4),\"\")","v":""}]
[null,null,null,"","",""]
[null,null,null,"","",""]
[null,null,null,"","",""]
[null,null,null,"","",""]
[null,null,null,"","",""]
[null,null,null,"","",""]
[null,null,null,"","",""]
[null,null,null,"","",""]
[null,null,null,"","",""]
[null,null,null,"","",""]
[null,null,null,"","",""]
[null,null,null,"","",""]
[null,null,null,"","",""]
[null,null,null,"","",""]
[null,null,null,"","",""]
[null,null,null,"","",""]
[null,null,null,"","",""]
[null,null,null,"","",""]
[null,null,null,"","",""]
[null,null,null,"","",""]
[null,null,null,"","",""]
[null,null,null,"","",""]
[null,null,null,"","",""]
[null,null,null,"","",""]
[null,null,null,"","",""]
[null,null,null,"","",""]
[null,null,null,"","",""]
[null,null,null,"","",""]
[null,null,null,"","",""]
[null,null,null,"","",""]
[null,null,null,"","",""]
[null,null,null,{"$f":"IF(C109<>\"\",VLOOKAnyCol(dataazzam,C109,1,2),\"\")","v":""},{"$f":"IF(C109<>\"\",VLOOKAnyCol(dataazzam,C109,1,3),\"\")","v":""},{"$f":"IF(C109<>\"\",VLOOKAnyCol(dataazzam,C109,1,4),\"\")","v":""}]
[null,null,null,"","",""]
[null,null,null,"","",""]
[null,null,null,"","",""]
[null,null,null,"","",""]
[null,null,null,"","",""]
[null,null,null,"","",""]
[null,null,null,"","",""]
[null,null,null,"","",""]
[null,null,null,"","",""]
[null,null,null,"","",""]
[null,null,null,"","",""]
[null,null,null,"","",""]
[null,null,null,"","",""]
[null,null,null,"","",""]
[null,null,null,"","",""]
[null,null,null,"","",""]
[null,null,null,"","",""]
[null,null,null,"","",""]
[null,null,null,"","",""]
[null,null,null,"","",""]
[null,null,null,"","",""]
[null,null,null,"","",""]
[null,null,null,"","",""]
[null,null,null,"","",""]
[null,null,null,"","",""]
[null,null,null,"","",""]
[null,null,null,"","",""]
[null,null,null,"","",""]
[null,null,null,"","",""]
[null,null,null,"","",""]
[null,null,null,"","",""]
[null,null,null,{"$f":"IF(C141<>\"\",VLOOKAnyCol(dataazzam,C141,1,2),\"\")","v":""},{"$f":"IF(C141<>\"\",VLOOKAnyCol(dataazzam,C141,1,3),\"\")","v":""},{"$f":"IF(C141<>\"\",VLOOKAnyCol(dataazzam,C141,1,4),\"\")","v":""}]
[null,null,null,"","",""]
[null,null,null,"","",""]
[null,null,null,"","",""]
[null,null,null,"","",""]
[null,null,null,"","",""]
[null,null,null,"","",""]
[null,null,null,"","",""]
[null,null,null,"","",""]
[null,null,null,"","",""]
[null,null,null,"","",""]
[null,null,null,"","",""]
[null,null,null,"","",""]
[null,null,null,"","",""]
[null,null,null,"","",""]
[null,null,null,"","",""]
[null,null,null,"","",""]
[null,null,null,"","",""]
[null,null,null,"","",""]
[null,null,null,"","",""]
[null,null,null,"","",""]
[null,null,null,"","",""]
[null,null,null,"","",""]
[null,null,null,"","",""]
[null,null,null,"","",""]
[null,null,null,"","",""]
[null,null,null,"","",""]
[null,null,null,"","",""]
[null,null,null,"","",""]
[null,null,null,"","",""]
[null,null,null,"","",""]
[null,null,null,"","",""]
[null,null,null,{"$f":"IF(C173<>\"\",VLOOKAnyCol(dataazzam,C173,1,2),\"\")","v":""},{"$f":"IF(C173<>\"\",VLOOKAnyCol(dataazzam,C173,1,3),\"\")","v":""},{"$f":"IF(C173<>\"\",VLOOKAnyCol(dataazzam,C173,1,4),\"\")","v":""}]
[null,null,null,"","",""]
[null,null,null,"","",""]
[null,null,null,"","",""]
[null,null,null,"","",""]
[null,null,null,"","",""]
[null,null,null,"","",""]
[null,null,null,"","",""]
[null,null,null,"","",""]
[null,null,null,"","",""]
[null,null,null,"","",""]
[null,null,null,"","",""]
[null,null,null,"","",""]
[null,null,null,"","",""]
[null,null,null,"","",""]
[null,null,null,"","",""]
[null,null,null,"","",""]
[null,null,null,"","",""]
[null,null,null,"","",""]
[null,null,null,"","",""]
[null,null,null,"","",""]
[null,null,null,"","",""]
[null,null,null,"","",""]
[null,null,null,"","",""]
[null,null,null,"","",""]
[null,null,null,"","",""]
[null,null,null,"","",""]
[null,null,null,"","",""]

{"sheet":"101","index":3,"n_rows":200,"n_cols":9,"rows_kept":200,"cut":false,"hidden":false,"merged":[[2,1,2,8],[3,5,3,6],[5,5,5,6],[7,5,7,6],[8,1,8,2],[9,1,9,2]]}
[]
[]
[null,"طـــلبية احتياجات التشغيل"]
[null,null,null,null,"رقــــم الطــلــبــيــه :",{"$f":"index!C4","v":101},null,null,"بالطائره لحاجه العمل الماسه"]
[]
[null,null,null,null,"الــــتـــاريـــــــــــخ :",{"$f":"IF(index!D4=\"\",\"\",VLOOKUP(F4,index!$C$4:$D$656,2,0))","v":"2018-01-01"},null,{"$f":"VLOOKAnyCol(dataazzam,G6,1,2)","v":"مجففة680جم"},"بسياره الطلبيه"]
[]
[null,null,null,null,"طريقه الارسال المطلوبه:","بالطائره لحاجه العمل الماسه"]
[null,"استكمالاً للطلببيه رقم  :"]
[null,"المــــــــــــــــــــــؤرخه :"]
[]
[null,"م","رقم الصنف","الصنف","المجموعه","الوحده","الكميه المطلوبه","الرصيد","ملاحظات"]
[null,null,121401462,{"$f":"IF(C13<>\"\",VLOOKAnyCol(dataazzam,C13,1,2),\"\")","v":"        تونكيز    "},{"$f":"IF(C13<>\"\",VLOOKAnyCol(dataazzam,C13,1,3),\"\")","v":"بسكويت انواع"},{"$f":"IF(C13<>\"\",VLOOKAnyCol(dataazzam,C13,1,4),\"\")","v":"EA."}]
[null,null,null,"","",""]
[null,null,null,"","",""]
[null,null,null,"","",""]
[null,null,null,"","",""]
[null,null,null,"","",""]
[null,null,null,"","",""]
[null,null,null,"","",""]
[null,null,null,"","",""]
[null,null,null,"","",""]
[null,null,null,"","",""]
[null,null,null,"","",""]
[null,null,null,"","",""]
[null,null,null,"","",""]
[null,null,null,"","",""]
[null,null,null,"","",""]
[null,null,null,"","",""]
[null,null,null,"","",""]
[null,null,null,"","",""]
[null,null,null,"","",""]
[null,null,null,"","",""]
[null,null,null,"","",""]
[null,null,null,"","",""]
[null,null,null,"","",""]
[null,null,null,"","",""]
[null,null,null,"","",""]
[null,null,null,"","",""]
[null,null,null,"","",""]
[null,null,null,"","",""]
[null,null,null,"","",""]
[null,null,null,"","",""]
[null,null,null,"","",""]
[null,null,null,"","",""]
[null,null,null,"","",""]
[null,null,null,"","",""]
[null,null,null,"","",""]
[null,null,null,"","",""]
[null,null,null,"","",""]
[null,null,null,"","",""]
[null,null,null,"","",""]
[null,null,null,"","",""]
[null,null,null,"","",""]
[null,null,null,"","",""]
[null,null,null,"","",""]
[null,null,null,"","",""]
[null,null,null,"","",""]
[null,null,null,"","",""]
[null,null,null,"","",""]
[null,null,null,"","",""]
[null,null,null,"","",""]
[null,null,null,"","",""]
[null,null,null,"","",""]
[null,null,null,"","",""]
[null,null,null,"","",""]
[null,null,null,"","",""]
[null,null,null,"","",""]
[null,null,null,"","",""]
[null,null,null,"","",""]
[null,null,null,"","",""]
[null,null,null,"","",""]
[null,null,null,"","",""]
[null,null,null,"","",""]
[null,null,null,"","",""]
[null,null,null,"","",""]
[null,null,null,{"$f":"IF(C77<>\"\",VLOOKAnyCol(dataazzam,C77,1,2),\"\")","v":""},{"$f":"IF(C77<>\"\",VLOOKAnyCol(dataazzam,C77,1,3),\"\")","v":""},{"$f":"IF(C77<>\"\",VLOOKAnyCol(dataazzam,C77,1,4),\"\")","v":""}]
[null,null,null,"","",""]
[null,null,null,"","",""]
[null,null,null,"","",""]
[null,null,null,"","",""]
[null,null,null,"","",""]
[null,null,null,"","",""]
[null,null,null,"","",""]
[null,null,null,"","",""]
[null,null,null,"","",""]
[null,null,null,"","",""]
[null,null,null,"","",""]
[null,null,null,"","",""]
[null,null,null,"","",""]
[null,null,null,"","",""]
[null,null,null,"","",""]
[null,null,null,"","",""]
[null,null,null,"","",""]
[null,null,null,"","",""]
[null,null,null,"","",""]
[null,null,null,"","",""]
[null,null,null,"","",""]
[null,null,null,"","",""]
[null,null,null,"","",""]
[null,null,null,"","",""]
[null,null,null,"","",""]
[null,null,null,"","",""]
[null,null,null,"","",""]
[null,null,null,"","",""]
[null,null,null,"","",""]
[null,null,null,"","",""]
[null,null,null,"","",""]
[null,null,null,"","",""]
[null,null,null,"","",""]
[null,null,null,"","",""]
[null,null,null,"","",""]
[null,null,null,"","",""]
[null,null,null,"","",""]
[null,null,null,"","",""]
[null,null,null,"","",""]
[null,null,null,"","",""]
[null,null,null,"","",""]
[null,null,null,"","",""]
[null,null,null,"","",""]
[null,null,null,"","",""]
[null,null,null,"","",""]
[null,null,null,"","",""]
[null,null,null,"","",""]
[null,null,null,"","",""]
[null,null,null,"","",""]
[null,null,null,"","",""]
[null,null,null,"","",""]
[null,null,null,"","",""]
[null,null,null,"","",""]
[null,null,null,"","",""]
[null,null,null,"","",""]
[null,null,null,"","",""]
[null,null,null,"","",""]
[null,null,null,"","",""]
[null,null,null,"","",""]
[null,null,null,"","",""]
[null,null,null,"","",""]
[null,null,null,"","",""]
[null,null,null,"","",""]
[null,null,null,{"$f":"IF(C141<>\"\",VLOOKAnyCol(dataazzam,C141,1,2),\"\")","v":""},{"$f":"IF(C141<>\"\",VLOOKAnyCol(dataazzam,C141,1,3),\"\")","v":""},{"$f":"IF(C141<>\"\",VLOOKAnyCol(dataazzam,C141,1,4),\"\")","v":""}]
[null,null,null,"","",""]
[null,null,null,"","",""]
[null,null,null,"","",""]
[null,null,null,"","",""]
[null,null,null,"","",""]
[null,null,null,"","",""]
[null,null,null,"","",""]
[null,null,null,"","",""]
[null,null,null,"","",""]
[null,null,null,"","",""]
[null,null,null,"","",""]
[null,null,null,"","",""]
[null,null,null,"","",""]
[null,null,null,"","",""]
[null,null,null,"","",""]
[null,null,null,"","",""]
[null,null,null,"","",""]
[null,null,null,"","",""]
[null,null,null,"","",""]
[null,null,null,"","",""]
[null,null,null,"","",""]
[null,null,null,"","",""]
[null,null,null,"","",""]
[null,null,null,"","",""]
[null,null,null,"","",""]
[null,null,null,"","",""]
[null,null,null,"","",""]
[null,null,null,"","",""]
[null,null,null,"","",""]
[null,null,null,"","",""]
[null,null,null,"","",""]
[null,null,null,"","",""]
[null,null,null,"","",""]
[null,null,null,"","",""]
[null,null,null,"","",""]
[null,null,null,"","",""]
[null,null,null,"","",""]
[null,null,null,"","",""]
[null,null,null,"","",""]
[null,null,null,"","",""]
[null,null,null,"","",""]
[null,null,null,"","",""]
[null,null,null,"","",""]
[null,null,null,"","",""]
[null,null,null,"","",""]
[null,null,null,"","",""]
[null,null,null,"","",""]
[null,null,null,"","",""]
[null,null,null,"","",""]
[null,null,null,"","",""]
[null,null,null,"","",""]
[null,null,null,"","",""]
[null,null,null,"","",""]
[null,null,null,"","",""]
[null,null,null,"","",""]
[null,null,null,"","",""]
[null,null,null,"","",""]
[null,null,null,"","",""]
[null,null,null,"","",""]

{"sheet":"102","index":4,"n_rows":200,"n_cols":9,"rows_kept":200,"cut":false,"hidden":false,"merged":[[2,1,2,8],[3,5,3,6],[5,5,5,6],[7,5,7,6],[8,1,8,2],[9,1,9,2]]}
[]
[]
[null,"طـــلبية احتياجات التشغيل"]
[null,null,null,null,"رقــــم الطــلــبــيــه :",102,null,null,"بالطائره لحاجه العمل الماسه"]
[]
[null,null,null,null,"الــــتـــاريـــــــــــخ :",{"$f":"IF(index!D4=\"\",\"\",VLOOKUP(F4,index!$C$4:$D$656,2,0))","v":"2017-05-01"},null,{"$f":"VLOOKAnyCol(dataazzam,G6,1,2)","v":"مجففة680جم"},"بسياره الطلبيه"]
[]
[null,null,null,null,"طريقه الارسال المطلوبه:","بالطائره لحاجه العمل الماسه"]
[null,"استكمالاً للطلببيه رقم  :"]
[null,"المــــــــــــــــــــــؤرخه :"]
[]
[null,"م","رقم الصنف","الصنف","المجموعه","الوحده","الكميه المطلوبه","الرصيد","ملاحظات"]
[null,null,121401462,{"$f":"IF(C13<>\"\",VLOOKAnyCol(dataazzam,C13,1,2),\"\")","v":"        تونكيز    "},{"$f":"IF(C13<>\"\",VLOOKAnyCol(dataazzam,C13,1,3),\"\")","v":"بسكويت انواع"},{"$f":"IF(C13<>\"\",VLOOKAnyCol(dataazzam,C13,1,4),\"\")","v":"EA."}]
[null,null,null,"","",""]
[null,null,null,"","",""]
[null,null,null,"","",""]
[null,null,null,"","",""]
[null,null,null,"","",""]
[null,null,null,"","",""]
[null,null,null,"","",""]
[null,null,null,"","",""]
[null,null,null,"","",""]
[null,null,null,"","",""]
[null,null,null,"","",""]
[null,null,null,"","",""]
[null,null,null,"","",""]
[null,null,null,"","",""]
[null,null,null,"","",""]
[null,null,null,"","",""]
[null,null,null,"","",""]
[null,null,null,"","",""]
[null,null,null,"","",""]
[null,null,null,"","",""]
[null,null,null,"","",""]
[null,null,null,"","",""]
[null,null,null,"","",""]
[null,null,null,"","",""]
[null,null,null,"","",""]
[null,null,null,"","",""]
[null,null,null,"","",""]
[null,null,null,"","",""]
[null,null,null,"","",""]
[null,null,null,"","",""]
[null,null,null,"","",""]
[null,null,null,"","",""]
[null,null,null,"","",""]
[null,null,null,"","",""]
[null,null,null,"","",""]
[null,null,null,"","",""]
[null,null,null,"","",""]
[null,null,null,"","",""]
[null,null,null,"","",""]
[null,null,null,"","",""]
[null,null,null,"","",""]
[null,null,null,"","",""]
[null,null,null,"","",""]
[null,null,null,"","",""]
[null,null,null,"","",""]
[null,null,null,"","",""]
[null,null,null,"","",""]
[null,null,null,"","",""]
[null,null,null,"","",""]
[null,null,null,"","",""]
[null,null,null,"","",""]
[null,null,null,"","",""]
[null,null,null,"","",""]
[null,null,null,"","",""]
[null,null,null,"","",""]
[null,null,null,"","",""]
[null,null,null,"","",""]
[null,null,null,"","",""]
[null,null,null,"","",""]
[null,null,null,"","",""]
[null,null,null,"","",""]
[null,null,null,"","",""]
[null,null,null,"","",""]
[null,null,null,{"$f":"IF(C77<>\"\",VLOOKAnyCol(dataazzam,C77,1,2),\"\")","v":""},{"$f":"IF(C77<>\"\",VLOOKAnyCol(dataazzam,C77,1,3),\"\")","v":""},{"$f":"IF(C77<>\"\",VLOOKAnyCol(dataazzam,C77,1,4),\"\")","v":""}]
[null,null,null,"","",""]
[null,null,null,"","",""]
[null,null,null,"","",""]
[null,null,null,"","",""]
[null,null,null,"","",""]
[null,null,null,"","",""]
[null,null,null,"","",""]
[null,null,null,"","",""]
[null,null,null,"","",""]
[null,null,null,"","",""]
[null,null,null,"","",""]
[null,null,null,"","",""]
[null,null,null,"","",""]
[null,null,null,"","",""]
[null,null,null,"","",""]
[null,null,null,"","",""]
[null,null,null,"","",""]
[null,null,null,"","",""]
[null,null,null,"","",""]
[null,null,null,"","",""]
[null,null,null,"","",""]
[null,null,null,"","",""]
[null,null,null,"","",""]
[null,null,null,"","",""]
[null,null,null,"","",""]
[null,null,null,"","",""]
[null,null,null,"","",""]
[null,null,null,"","",""]
[null,null,null,"","",""]
[null,null,null,"","",""]
[null,null,null,"","",""]
[null,null,null,"","",""]
[null,null,null,"","",""]
[null,null,null,"","",""]
[null,null,null,"","",""]
[null,null,null,"","",""]
[null,null,null,"","",""]
[null,null,null,"","",""]
[null,null,null,"","",""]
[null,null,null,"","",""]
[null,null,null,"","",""]
[null,null,null,"","",""]
[null,null,null,"","",""]
[null,null,null,"","",""]
[null,null,null,"","",""]
[null,null,null,"","",""]
[null,null,null,"","",""]
[null,null,null,"","",""]
[null,null,null,"","",""]
[null,null,null,"","",""]
[null,null,null,"","",""]
[null,null,null,"","",""]
[null,null,null,"","",""]
[null,null,null,"","",""]
[null,null,null,"","",""]
[null,null,null,"","",""]
[null,null,null,"","",""]
[null,null,null,"","",""]
[null,null,null,"","",""]
[null,null,null,"","",""]
[null,null,null,"","",""]
[null,null,null,"","",""]
[null,null,null,"","",""]
[null,null,null,{"$f":"IF(C141<>\"\",VLOOKAnyCol(dataazzam,C141,1,2),\"\")","v":""},{"$f":"IF(C141<>\"\",VLOOKAnyCol(dataazzam,C141,1,3),\"\")","v":""},{"$f":"IF(C141<>\"\",VLOOKAnyCol(dataazzam,C141,1,4),\"\")","v":""}]
[null,null,null,"","",""]
[null,null,null,"","",""]
[null,null,null,"","",""]
[null,null,null,"","",""]
[null,null,null,"","",""]
[null,null,null,"","",""]
[null,null,null,"","",""]
[null,null,null,"","",""]
[null,null,null,"","",""]
[null,null,null,"","",""]
[null,null,null,"","",""]
[null,null,null,"","",""]
[null,null,null,"","",""]
[null,null,null,"","",""]
[null,null,null,"","",""]
[null,null,null,"","",""]
[null,null,null,"","",""]
[null,null,null,"","",""]
[null,null,null,"","",""]
[null,null,null,"","",""]
[null,null,null,"","",""]
[null,null,null,"","",""]
[null,null,null,"","",""]
[null,null,null,"","",""]
[null,null,null,"","",""]
[null,null,null,"","",""]
[null,null,null,"","",""]
[null,null,null,"","",""]
[null,null,null,"","",""]
[null,null,null,"","",""]
[null,null,null,"","",""]
[null,null,null,"","",""]
[null,null,null,"","",""]
[null,null,null,"","",""]
[null,null,null,"","",""]
[null,null,null,"","",""]
[null,null,null,"","",""]
[null,null,null,"","",""]
[null,null,null,"","",""]
[null,null,null,"","",""]
[null,null,null,"","",""]
[null,null,null,"","",""]
[null,null,null,"","",""]
[null,null,null,"","",""]
[null,null,null,"","",""]
[null,null,null,"","",""]
[null,null,null,"","",""]
[null,null,null,"","",""]
[null,null,null,"","",""]
[null,null,null,"","",""]
[null,null,null,"","",""]
[null,null,null,"","",""]
[null,null,null,"","",""]
[null,null,null,"","",""]
[null,null,null,"","",""]
[null,null,null,"","",""]
[null,null,null,"","",""]
[null,null,null,"","",""]
[null,null,null,"","",""]

{"sheet":"103","index":5,"n_rows":200,"n_cols":9,"rows_kept":200,"cut":false,"hidden":false,"merged":[[2,1,2,8],[3,5,3,6],[5,5,5,6],[7,5,7,6],[8,1,8,2],[9,1,9,2]]}
[]
[]
[null,"طـــلبية احتياجات التشغيل"]
[null,null,null,null,"رقــــم الطــلــبــيــه :",103,null,null,"بالطائره لحاجه العمل الماسه"]
[]
[null,null,null,null,"الــــتـــاريـــــــــــخ :",{"$f":"IF(index!D4=\"\",\"\",VLOOKUP(F4,index!$C$4:$D$656,2,0))","v":"00:00:00"},null,{"$f":"VLOOKAnyCol(dataazzam,G6,1,2)","v":"مجففة680جم"},"بسياره الطلبيه"]
[]
[null,null,null,null,"طريقه الارسال المطلوبه:","بالطائره لحاجه العمل الماسه"]
[null,"استكمالاً للطلببيه رقم  :"]
[null,"المــــــــــــــــــــــؤرخه :"]
[]
[null,"م","رقم الصنف","الصنف","المجموعه","الوحده","الكميه المطلوبه","الرصيد","ملاحظات"]
[null,null,121401462,{"$f":"IF(C13<>\"\",VLOOKAnyCol(dataazzam,C13,1,2),\"\")","v":"        تونكيز    "},{"$f":"IF(C13<>\"\",VLOOKAnyCol(dataazzam,C13,1,3),\"\")","v":"بسكويت انواع"},{"$f":"IF(C13<>\"\",VLOOKAnyCol(dataazzam,C13,1,4),\"\")","v":"EA."}]
[null,null,null,"","",""]
[null,null,null,"","",""]
[null,null,null,"","",""]
[null,null,null,"","",""]
[null,null,null,"","",""]
[null,null,null,"","",""]
[null,null,null,"","",""]
[null,null,null,"","",""]
[null,null,null,"","",""]
[null,null,null,"","",""]
[null,null,null,"","",""]
[null,null,null,"","",""]
[null,null,null,"","",""]
[null,null,null,"","",""]
[null,null,null,"","",""]
[null,null,null,"","",""]
[null,null,null,"","",""]
[null,null,null,"","",""]
[null,null,null,"","",""]
[null,null,null,"","",""]
[null,null,null,"","",""]
[null,null,null,"","",""]
[null,null,null,"","",""]
[null,null,null,"","",""]
[null,null,null,"","",""]
[null,null,null,"","",""]
[null,null,null,"","",""]
[null,null,null,"","",""]
[null,null,null,"","",""]
[null,null,null,"","",""]
[null,null,null,"","",""]
[null,null,null,"","",""]
[null,null,null,"","",""]
[null,null,null,"","",""]
[null,null,null,"","",""]
[null,null,null,"","",""]
[null,null,null,"","",""]
[null,null,null,"","",""]
[null,null,null,"","",""]
[null,null,null,"","",""]
[null,null,null,"","",""]
[null,null,null,"","",""]
[null,null,null,"","",""]
[null,null,null,"","",""]
[null,null,null,"","",""]
[null,null,null,"","",""]
[null,null,null,"","",""]
[null,null,null,"","",""]
[null,null,null,"","",""]
[null,null,null,"","",""]
[null,null,null,"","",""]
[null,null,null,"","",""]
[null,null,null,"","",""]
[null,null,null,"","",""]
[null,null,null,"","",""]
[null,null,null,"","",""]
[null,null,null,"","",""]
[null,null,null,"","",""]
[null,null,null,"","",""]
[null,null,null,"","",""]
[null,null,null,"","",""]
[null,null,null,"","",""]
[null,null,null,"","",""]
[null,null,null,{"$f":"IF(C77<>\"\",VLOOKAnyCol(dataazzam,C77,1,2),\"\")","v":""},{"$f":"IF(C77<>\"\",VLOOKAnyCol(dataazzam,C77,1,3),\"\")","v":""},{"$f":"IF(C77<>\"\",VLOOKAnyCol(dataazzam,C77,1,4),\"\")","v":""}]
[null,null,null,"","",""]
[null,null,null,"","",""]
[null,null,null,"","",""]
[null,null,null,"","",""]
[null,null,null,"","",""]
[null,null,null,"","",""]
[null,null,null,"","",""]
[null,null,null,"","",""]
[null,null,null,"","",""]
[null,null,null,"","",""]
[null,null,null,"","",""]
[null,null,null,"","",""]
[null,null,null,"","",""]
[null,null,null,"","",""]
[null,null,null,"","",""]
[null,null,null,"","",""]
[null,null,null,"","",""]
[null,null,null,"","",""]
[null,null,null,"","",""]
[null,null,null,"","",""]
[null,null,null,"","",""]
[null,null,null,"","",""]
[null,null,null,"","",""]
[null,null,null,"","",""]
[null,null,null,"","",""]
[null,null,null,"","",""]
[null,null,null,"","",""]
[null,null,null,"","",""]
[null,null,null,"","",""]
[null,null,null,"","",""]
[null,null,null,"","",""]
[null,null,null,"","",""]
[null,null,null,"","",""]
[null,null,null,"","",""]
[null,null,null,"","",""]
[null,null,null,"","",""]
[null,null,null,"","",""]
[null,null,null,"","",""]
[null,null,null,"","",""]
[null,null,null,"","",""]
[null,null,null,"","",""]
[null,null,null,"","",""]
[null,null,null,"","",""]
[null,null,null,"","",""]
[null,null,null,"","",""]
[null,null,null,"","",""]
[null,null,null,"","",""]
[null,null,null,"","",""]
[null,null,null,"","",""]
[null,null,null,"","",""]
[null,null,null,"","",""]
[null,null,null,"","",""]
[null,null,null,"","",""]
[null,null,null,"","",""]
[null,null,null,"","",""]
[null,null,null,"","",""]
[null,null,null,"","",""]
[null,null,null,"","",""]
[null,null,null,"","",""]
[null,null,null,"","",""]
[null,null,null,"","",""]
[null,null,null,"","",""]
[null,null,null,"","",""]
[null,null,null,{"$f":"IF(C141<>\"\",VLOOKAnyCol(dataazzam,C141,1,2),\"\")","v":""},{"$f":"IF(C141<>\"\",VLOOKAnyCol(dataazzam,C141,1,3),\"\")","v":""},{"$f":"IF(C141<>\"\",VLOOKAnyCol(dataazzam,C141,1,4),\"\")","v":""}]
[null,null,null,"","",""]
[null,null,null,"","",""]
[null,null,null,"","",""]
[null,null,null,"","",""]
[null,null,null,"","",""]
[null,null,null,"","",""]
[null,null,null,"","",""]
[null,null,null,"","",""]
[null,null,null,"","",""]
[null,null,null,"","",""]
[null,null,null,"","",""]
[null,null,null,"","",""]
[null,null,null,"","",""]
[null,null,null,"","",""]
[null,null,null,"","",""]
[null,null,null,"","",""]
[null,null,null,"","",""]
[null,null,null,"","",""]
[null,null,null,"","",""]
[null,null,null,"","",""]
[null,null,null,"","",""]
[null,null,null,"","",""]
[null,null,null,"","",""]
[null,null,null,"","",""]
[null,null,null,"","",""]
[null,null,null,"","",""]
[null,null,null,"","",""]
[null,null,null,"","",""]
[null,null,null,"","",""]
[null,null,null,"","",""]
[null,null,null,"","",""]
[null,null,null,"","",""]
[null,null,null,"","",""]
[null,null,null,"","",""]
[null,null,null,"","",""]
[null,null,null,"","",""]
[null,null,null,"","",""]
[null,null,null,"","",""]
[null,null,null,"","",""]
[null,null,null,"","",""]
[null,null,null,"","",""]
[null,null,null,"","",""]
[null,null,null,"","",""]
[null,null,null,"","",""]
[null,null,null,"","",""]
[null,null,null,"","",""]
[null,null,null,"","",""]
[null,null,null,"","",""]
[null,null,null,"","",""]
[null,null,null,"","",""]
[null,null,null,"","",""]
[null,null,null,"","",""]
[null,null,null,"","",""]
[null,null,null,"","",""]
[null,null,null,"","",""]
[null,null,null,"","",""]
[null,null,null,"","",""]
[null,null,null,"","",""]
[null,null,null,"","",""]

{"sheet":"104","index":6,"n_rows":200,"n_cols":9,"rows_kept":200,"cut":false,"hidden":false,"merged":[[2,1,2,8],[3,5,3,6],[5,5,5,6],[7,5,7,6],[8,1,8,2],[9,1,9,2]]}
[]
[]
[null,"طـــلبية احتياجات التشغيل"]
[null,null,null,null,"رقــــم الطــلــبــيــه :",104,null,null,"بالطائره لحاجه العمل الماسه"]
[]
[null,null,null,null,"الــــتـــاريـــــــــــخ :",{"$f":"IF(index!D4=\"\",\"\",VLOOKUP(F4,index!$C$4:$D$656,2,0))","v":"00:00:00"},null,{"$f":"VLOOKAnyCol(dataazzam,G6,1,2)","v":"مجففة680جم"},"بسياره الطلبيه"]
[]
[null,null,null,null,"طريقه الارسال المطلوبه:","بالطائره لحاجه العمل الماسه"]
[null,"استكمالاً للطلببيه رقم  :"]
[null,"المــــــــــــــــــــــؤرخه :"]
[]
[null,"م","رقم الصنف","الصنف","المجموعه","الوحده","الكميه المطلوبه","الرصيد","ملاحظات"]
[null,null,121401462,{"$f":"IF(C13<>\"\",VLOOKAnyCol(dataazzam,C13,1,2),\"\")","v":"        تونكيز    "},{"$f":"IF(C13<>\"\",VLOOKAnyCol(dataazzam,C13,1,3),\"\")","v":"بسكويت انواع"},{"$f":"IF(C13<>\"\",VLOOKAnyCol(dataazzam,C13,1,4),\"\")","v":"EA."}]
[null,null,null,"","",""]
[null,null,null,"","",""]
[null,null,null,"","",""]
[null,null,null,"","",""]
[null,null,null,"","",""]
[null,null,null,"","",""]
[null,null,null,"","",""]
[null,null,null,"","",""]
[null,null,null,"","",""]
[null,null,null,"","",""]
[null,null,null,"","",""]
[null,null,null,"","",""]
[null,null,null,"","",""]
[null,null,null,"","",""]
[null,null,null,"","",""]
[null,null,null,"","",""]
[null,null,null,"","",""]
[null,null,null,"","",""]
[null,null,null,"","",""]
[null,null,null,"","",""]
[null,null,null,"","",""]
[null,null,null,"","",""]
[null,null,null,"","",""]
[null,null,null,"","",""]
[null,null,null,"","",""]
[null,null,null,"","",""]
[null,null,null,"","",""]
[null,null,null,"","",""]
[null,null,null,"","",""]
[null,null,null,"","",""]
[null,null,null,"","",""]
[null,null,null,"","",""]
[null,null,null,"","",""]
[null,null,null,"","",""]
[null,null,null,"","",""]
[null,null,null,"","",""]
[null,null,null,"","",""]
[null,null,null,"","",""]
[null,null,null,"","",""]
[null,null,null,"","",""]
[null,null,null,"","",""]
[null,null,null,"","",""]
[null,null,null,"","",""]
[null,null,null,"","",""]
[null,null,null,"","",""]
[null,null,null,"","",""]
[null,null,null,"","",""]
[null,null,null,"","",""]
[null,null,null,"","",""]
[null,null,null,"","",""]
[null,null,null,"","",""]
[null,null,null,"","",""]
[null,null,null,"","",""]
[null,null,null,"","",""]
[null,null,null,"","",""]
[null,null,null,"","",""]
[null,null,null,"","",""]
[null,null,null,"","",""]
[null,null,null,"","",""]
[null,null,null,"","",""]
[null,null,null,"","",""]
[null,null,null,"","",""]
[null,null,null,"","",""]
[null,null,null,{"$f":"IF(C77<>\"\",VLOOKAnyCol(dataazzam,C77,1,2),\"\")","v":""},{"$f":"IF(C77<>\"\",VLOOKAnyCol(dataazzam,C77,1,3),\"\")","v":""},{"$f":"IF(C77<>\"\",VLOOKAnyCol(dataazzam,C77,1,4),\"\")","v":""}]
[null,null,null,"","",""]
[null,null,null,"","",""]
[null,null,null,"","",""]
[null,null,null,"","",""]
[null,null,null,"","",""]
[null,null,null,"","",""]
[null,null,null,"","",""]
[null,null,null,"","",""]
[null,null,null,"","",""]
[null,null,null,"","",""]
[null,null,null,"","",""]
[null,null,null,"","",""]
[null,null,null,"","",""]
[null,null,null,"","",""]
[null,null,null,"","",""]
[null,null,null,"","",""]
[null,null,null,"","",""]
[null,null,null,"","",""]
[null,null,null,"","",""]
[null,null,null,"","",""]
[null,null,null,"","",""]
[null,null,null,"","",""]
[null,null,null,"","",""]
[null,null,null,"","",""]
[null,null,null,"","",""]
[null,null,null,"","",""]
[null,null,null,"","",""]
[null,null,null,"","",""]
[null,null,null,"","",""]
[null,null,null,"","",""]
[null,null,null,"","",""]
[null,null,null,"","",""]
[null,null,null,"","",""]
[null,null,null,"","",""]
[null,null,null,"","",""]
[null,null,null,"","",""]
[null,null,null,"","",""]
[null,null,null,"","",""]
[null,null,null,"","",""]
[null,null,null,"","",""]
[null,null,null,"","",""]
[null,null,null,"","",""]
[null,null,null,"","",""]
[null,null,null,"","",""]
[null,null,null,"","",""]
[null,null,null,"","",""]
[null,null,null,"","",""]
[null,null,null,"","",""]
[null,null,null,"","",""]
[null,null,null,"","",""]
[null,null,null,"","",""]
[null,null,null,"","",""]
[null,null,null,"","",""]
[null,null,null,"","",""]
[null,null,null,"","",""]
[null,null,null,"","",""]
[null,null,null,"","",""]
[null,null,null,"","",""]
[null,null,null,"","",""]
[null,null,null,"","",""]
[null,null,null,"","",""]
[null,null,null,"","",""]
[null,null,null,"","",""]
[null,null,null,{"$f":"IF(C141<>\"\",VLOOKAnyCol(dataazzam,C141,1,2),\"\")","v":""},{"$f":"IF(C141<>\"\",VLOOKAnyCol(dataazzam,C141,1,3),\"\")","v":""},{"$f":"IF(C141<>\"\",VLOOKAnyCol(dataazzam,C141,1,4),\"\")","v":""}]
[null,null,null,"","",""]
[null,null,null,"","",""]
[null,null,null,"","",""]
[null,null,null,"","",""]
[null,null,null,"","",""]
[null,null,null,"","",""]
[null,null,null,"","",""]
[null,null,null,"","",""]
[null,null,null,"","",""]
[null,null,null,"","",""]
[null,null,null,"","",""]
[null,null,null,"","",""]
[null,null,null,"","",""]
[null,null,null,"","",""]
[null,null,null,"","",""]
[null,null,null,"","",""]
[null,null,null,"","",""]
[null,null,null,"","",""]
[null,null,null,"","",""]
[null,null,null,"","",""]
[null,null,null,"","",""]
[null,null,null,"","",""]
[null,null,null,"","",""]
[null,null,null,"","",""]
[null,null,null,"","",""]
[null,null,null,"","",""]
[null,null,null,"","",""]
[null,null,null,"","",""]
[null,null,null,"","",""]
[null,null,null,"","",""]
[null,null,null,"","",""]
[null,null,null,"","",""]
[null,null,null,"","",""]
[null,null,null,"","",""]
[null,null,null,"","",""]
[null,null,null,"","",""]
[null,null,null,"","",""]
[null,null,null,"","",""]
[null,null,null,"","",""]
[null,null,null,"","",""]
[null,null,null,"","",""]
[null,null,null,"","",""]
[null,null,null,"","",""]
[null,null,null,"","",""]
[null,null,null,"","",""]
[null,null,null,"","",""]
[null,null,null,"","",""]
[null,null,null,"","",""]
[null,null,null,"","",""]
[null,null,null,"","",""]
[null,null,null,"","",""]
[null,null,null,"","",""]
[null,null,null,"","",""]
[null,null,null,"","",""]
[null,null,null,"","",""]
[null,null,null,"","",""]
[null,null,null,"","",""]
[null,null,null,"","",""]
[null,null,null,"","",""]

{"sheet":"105","index":7,"n_rows":200,"n_cols":9,"rows_kept":200,"cut":false,"hidden":false,"merged":[[2,1,2,8],[3,5,3,6],[5,5,5,6],[7,5,7,6],[8,1,8,2],[9,1,9,2]]}
[]
[]
[null,"طـــلبية احتياجات التشغيل"]
[null,null,null,null,"رقــــم الطــلــبــيــه :",105,null,null,"بالطائره لحاجه العمل الماسه"]
[]
[null,null,null,null,"الــــتـــاريـــــــــــخ :",{"$f":"IF(index!D4=\"\",\"\",VLOOKUP(F4,index!$C$4:$D$656,2,0))","v":"00:00:00"},null,{"$f":"VLOOKAnyCol(dataazzam,G6,1,2)","v":"مجففة680جم"},"بسياره الطلبيه"]
[]
[null,null,null,null,"طريقه الارسال المطلوبه:","بالطائره لحاجه العمل الماسه"]
[null,"استكمالاً للطلببيه رقم  :"]
[null,"المــــــــــــــــــــــؤرخه :"]
[]
[null,"م","رقم الصنف","الصنف","المجموعه","الوحده","الكميه المطلوبه","الرصيد","ملاحظات"]
[null,null,121401462,{"$f":"IF(C13<>\"\",VLOOKAnyCol(dataazzam,C13,1,2),\"\")","v":"        تونكيز    "},{"$f":"IF(C13<>\"\",VLOOKAnyCol(dataazzam,C13,1,3),\"\")","v":"بسكويت انواع"},{"$f":"IF(C13<>\"\",VLOOKAnyCol(dataazzam,C13,1,4),\"\")","v":"EA."}]
[null,null,null,"","",""]
[null,null,null,"","",""]
[null,null,null,"","",""]
[null,null,null,"","",""]
[null,null,null,"","",""]
[null,null,null,"","",""]
[null,null,null,"","",""]
[null,null,null,"","",""]
[null,null,null,"","",""]
[null,null,null,"","",""]
[null,null,null,"","",""]
[null,null,null,"","",""]
[null,null,null,"","",""]
[null,null,null,"","",""]
[null,null,null,"","",""]
[null,null,null,"","",""]
[null,null,null,"","",""]
[null,null,null,"","",""]
[null,null,null,"","",""]
[null,null,null,"","",""]
[null,null,null,"","",""]
[null,null,null,"","",""]
[null,null,null,"","",""]
[null,null,null,"","",""]
[null,null,null,"","",""]
[null,null,null,"","",""]
[null,null,null,"","",""]
[null,null,null,"","",""]
[null,null,null,"","",""]
[null,null,null,"","",""]
[null,null,null,"","",""]
[null,null,null,"","",""]
[null,null,null,"","",""]
[null,null,null,"","",""]
[null,null,null,"","",""]
[null,null,null,"","",""]
[null,null,null,"","",""]
[null,null,null,"","",""]
[null,null,null,"","",""]
[null,null,null,"","",""]
[null,null,null,"","",""]
[null,null,null,"","",""]
[null,null,null,"","",""]
[null,null,null,"","",""]
[null,null,null,"","",""]
[null,null,null,"","",""]
[null,null,null,"","",""]
[null,null,null,"","",""]
[null,null,null,"","",""]
[null,null,null,"","",""]
[null,null,null,"","",""]
[null,null,null,"","",""]
[null,null,null,"","",""]
[null,null,null,"","",""]
[null,null,null,"","",""]
[null,null,null,"","",""]
[null,null,null,"","",""]
[null,null,null,"","",""]
[null,null,null,"","",""]
[null,null,null,"","",""]
[null,null,null,"","",""]
[null,null,null,"","",""]
[null,null,null,"","",""]
[null,null,null,{"$f":"IF(C77<>\"\",VLOOKAnyCol(dataazzam,C77,1,2),\"\")","v":""},{"$f":"IF(C77<>\"\",VLOOKAnyCol(dataazzam,C77,1,3),\"\")","v":""},{"$f":"IF(C77<>\"\",VLOOKAnyCol(dataazzam,C77,1,4),\"\")","v":""}]
[null,null,null,"","",""]
[null,null,null,"","",""]
[null,null,null,"","",""]
[null,null,null,"","",""]
[null,null,null,"","",""]
[null,null,null,"","",""]
[null,null,null,"","",""]
[null,null,null,"","",""]
[null,null,null,"","",""]
[null,null,null,"","",""]
[null,null,null,"","",""]
[null,null,null,"","",""]
[null,null,null,"","",""]
[null,null,null,"","",""]
[null,null,null,"","",""]
[null,null,null,"","",""]
[null,null,null,"","",""]
[null,null,null,"","",""]
[null,null,null,"","",""]
[null,null,null,"","",""]
[null,null,null,"","",""]
[null,null,null,"","",""]
[null,null,null,"","",""]
[null,null,null,"","",""]
[null,null,null,"","",""]
[null,null,null,"","",""]
[null,null,null,"","",""]
[null,null,null,"","",""]
[null,null,null,"","",""]
[null,null,null,"","",""]
[null,null,null,"","",""]
[null,null,null,"","",""]
[null,null,null,"","",""]
[null,null,null,"","",""]
[null,null,null,"","",""]
[null,null,null,"","",""]
[null,null,null,"","",""]
[null,null,null,"","",""]
[null,null,null,"","",""]
[null,null,null,"","",""]
[null,null,null,"","",""]
[null,null,null,"","",""]
[null,null,null,"","",""]
[null,null,null,"","",""]
[null,null,null,"","",""]
[null,null,null,"","",""]
[null,null,null,"","",""]
[null,null,null,"","",""]
[null,null,null,"","",""]
[null,null,null,"","",""]
[null,null,null,"","",""]
[null,null,null,"","",""]
[null,null,null,"","",""]
[null,null,null,"","",""]
[null,null,null,"","",""]
[null,null,null,"","",""]
[null,null,null,"","",""]
[null,null,null,"","",""]
[null,null,null,"","",""]
[null,null,null,"","",""]
[null,null,null,"","",""]
[null,null,null,"","",""]
[null,null,null,"","",""]
[null,null,null,{"$f":"IF(C141<>\"\",VLOOKAnyCol(dataazzam,C141,1,2),\"\")","v":""},{"$f":"IF(C141<>\"\",VLOOKAnyCol(dataazzam,C141,1,3),\"\")","v":""},{"$f":"IF(C141<>\"\",VLOOKAnyCol(dataazzam,C141,1,4),\"\")","v":""}]
[null,null,null,"","",""]
[null,null,null,"","",""]
[null,null,null,"","",""]
[null,null,null,"","",""]
[null,null,null,"","",""]
[null,null,null,"","",""]
[null,null,null,"","",""]
[null,null,null,"","",""]
[null,null,null,"","",""]
[null,null,null,"","",""]
[null,null,null,"","",""]
[null,null,null,"","",""]
[null,null,null,"","",""]
[null,null,null,"","",""]
[null,null,null,"","",""]
[null,null,null,"","",""]
[null,null,null,"","",""]
[null,null,null,"","",""]
[null,null,null,"","",""]
[null,null,null,"","",""]
[null,null,null,"","",""]
[null,null,null,"","",""]
[null,null,null,"","",""]
[null,null,null,"","",""]
[null,null,null,"","",""]
[null,null,null,"","",""]
[null,null,null,"","",""]
[null,null,null,"","",""]
[null,null,null,"","",""]
[null,null,null,"","",""]
[null,null,null,"","",""]
[null,null,null,"","",""]
[null,null,null,"","",""]
[null,null,null,"","",""]
[null,null,null,"","",""]
[null,null,null,"","",""]
[null,null,null,"","",""]
[null,null,null,"","",""]
[null,null,null,"","",""]
[null,null,null,"","",""]
[null,null,null,"","",""]
[null,null,null,"","",""]
[null,null,null,"","",""]
[null,null,null,"","",""]
[null,null,null,"","",""]
[null,null,null,"","",""]
[null,null,null,"","",""]
[null,null,null,"","",""]
[null,null,null,"","",""]
[null,null,null,"","",""]
[null,null,null,"","",""]
[null,null,null,"","",""]
[null,null,null,"","",""]
[null,null,null,"","",""]
[null,null,null,"","",""]
[null,null,null,"","",""]
[null,null,null,"","",""]
[null,null,null,"","",""]
[null,null,null,"","",""]

{"sheet":"106","index":8,"n_rows":200,"n_cols":9,"rows_kept":200,"cut":false,"hidden":false,"merged":[[2,1,2,8],[3,5,3,6],[5,5,5,6],[7,5,7,6],[8,1,8,2],[9,1,9,2]]}
[]
[]
[null,"طـــلبية احتياجات التشغيل"]
[null,null,null,null,"رقــــم الطــلــبــيــه :",106,null,null,"بالطائره لحاجه العمل الماسه"]
[]
[null,null,null,null,"الــــتـــاريـــــــــــخ :",{"$f":"IF(index!D4=\"\",\"\",VLOOKUP(F4,index!$C$4:$D$656,2,0))","v":"00:00:00"},null,{"$f":"VLOOKAnyCol(dataazzam,G6,1,2)","v":"مجففة680جم"},"بسياره الطلبيه"]
[]
[null,null,null,null,"طريقه الارسال المطلوبه:","بالطائره لحاجه العمل الماسه"]
[null,"استكمالاً للطلببيه رقم  :"]
[null,"المــــــــــــــــــــــؤرخه :"]
[]
[null,"م","رقم الصنف","الصنف","المجموعه","الوحده","الكميه المطلوبه","الرصيد","ملاحظات"]
[null,null,121401462,{"$f":"IF(C13<>\"\",VLOOKAnyCol(dataazzam,C13,1,2),\"\")","v":"        تونكيز    "},{"$f":"IF(C13<>\"\",VLOOKAnyCol(dataazzam,C13,1,3),\"\")","v":"بسكويت انواع"},{"$f":"IF(C13<>\"\",VLOOKAnyCol(dataazzam,C13,1,4),\"\")","v":"EA."}]
[null,null,null,"","",""]
[null,null,null,"","",""]
[null,null,null,"","",""]
[null,null,null,"","",""]
[null,null,null,"","",""]
[null,null,null,"","",""]
[null,null,null,"","",""]
[null,null,null,"","",""]
[null,null,null,"","",""]
[null,null,null,"","",""]
[null,null,null,"","",""]
[null,null,null,"","",""]
[null,null,null,"","",""]
[null,null,null,"","",""]
[null,null,null,"","",""]
[null,null,null,"","",""]
[null,null,null,"","",""]
[null,null,null,"","",""]
[null,null,null,"","",""]
[null,null,null,"","",""]
[null,null,null,"","",""]
[null,null,null,"","",""]
[null,null,null,"","",""]
[null,null,null,"","",""]
[null,null,null,"","",""]
[null,null,null,"","",""]
[null,null,null,"","",""]
[null,null,null,"","",""]
[null,null,null,"","",""]
[null,null,null,"","",""]
[null,null,null,"","",""]
[null,null,null,"","",""]
[null,null,null,"","",""]
[null,null,null,"","",""]
[null,null,null,"","",""]
[null,null,null,"","",""]
[null,null,null,"","",""]
[null,null,null,"","",""]
[null,null,null,"","",""]
[null,null,null,"","",""]
[null,null,null,"","",""]
[null,null,null,"","",""]
[null,null,null,"","",""]
[null,null,null,"","",""]
[null,null,null,"","",""]
[null,null,null,"","",""]
[null,null,null,"","",""]
[null,null,null,"","",""]
[null,null,null,"","",""]
[null,null,null,"","",""]
[null,null,null,"","",""]
[null,null,null,"","",""]
[null,null,null,"","",""]
[null,null,null,"","",""]
[null,null,null,"","",""]
[null,null,null,"","",""]
[null,null,null,"","",""]
[null,null,null,"","",""]
[null,null,null,"","",""]
[null,null,null,"","",""]
[null,null,null,"","",""]
[null,null,null,"","",""]
[null,null,null,"","",""]
[null,null,null,{"$f":"IF(C77<>\"\",VLOOKAnyCol(dataazzam,C77,1,2),\"\")","v":""},{"$f":"IF(C77<>\"\",VLOOKAnyCol(dataazzam,C77,1,3),\"\")","v":""},{"$f":"IF(C77<>\"\",VLOOKAnyCol(dataazzam,C77,1,4),\"\")","v":""}]
[null,null,null,"","",""]
[null,null,null,"","",""]
[null,null,null,"","",""]
[null,null,null,"","",""]
[null,null,null,"","",""]
[null,null,null,"","",""]
[null,null,null,"","",""]
[null,null,null,"","",""]
[null,null,null,"","",""]
[null,null,null,"","",""]
[null,null,null,"","",""]
[null,null,null,"","",""]
[null,null,null,"","",""]
[null,null,null,"","",""]
[null,null,null,"","",""]
[null,null,null,"","",""]
[null,null,null,"","",""]
[null,null,null,"","",""]
[null,null,null,"","",""]
[null,null,null,"","",""]
[null,null,null,"","",""]
[null,null,null,"","",""]
[null,null,null,"","",""]
[null,null,null,"","",""]
[null,null,null,"","",""]
[null,null,null,"","",""]
[null,null,null,"","",""]
[null,null,null,"","",""]
[null,null,null,"","",""]
[null,null,null,"","",""]
[null,null,null,"","",""]
[null,null,null,"","",""]
[null,null,null,"","",""]
[null,null,null,"","",""]
[null,null,null,"","",""]
[null,null,null,"","",""]
[null,null,null,"","",""]
[null,null,null,"","",""]
[null,null,null,"","",""]
[null,null,null,"","",""]
[null,null,null,"","",""]
[null,null,null,"","",""]
[null,null,null,"","",""]
[null,null,null,"","",""]
[null,null,null,"","",""]
[null,null,null,"","",""]
[null,null,null,"","",""]
[null,null,null,"","",""]
[null,null,null,"","",""]
[null,null,null,"","",""]
[null,null,null,"","",""]
[null,null,null,"","",""]
[null,null,null,"","",""]
[null,null,null,"","",""]
[null,null,null,"","",""]
[null,null,null,"","",""]
[null,null,null,"","",""]
[null,null,null,"","",""]
[null,null,null,"","",""]
[null,null,null,"","",""]
[null,null,null,"","",""]
[null,null,null,"","",""]
[null,null,null,"","",""]
[null,null,null,{"$f":"IF(C141<>\"\",VLOOKAnyCol(dataazzam,C141,1,2),\"\")","v":""},{"$f":"IF(C141<>\"\",VLOOKAnyCol(dataazzam,C141,1,3),\"\")","v":""},{"$f":"IF(C141<>\"\",VLOOKAnyCol(dataazzam,C141,1,4),\"\")","v":""}]
[null,null,null,"","",""]
[null,null,null,"","",""]
[null,null,null,"","",""]
[null,null,null,"","",""]
[null,null,null,"","",""]
[null,null,null,"","",""]
[null,null,null,"","",""]
[null,null,null,"","",""]
[null,null,null,"","",""]
[null,null,null,"","",""]
[null,null,null,"","",""]
[null,null,null,"","",""]
[null,null,null,"","",""]
[null,null,null,"","",""]
[null,null,null,"","",""]
[null,null,null,"","",""]
[null,null,null,"","",""]
[null,null,null,"","",""]
[null,null,null,"","",""]
[null,null,null,"","",""]
[null,null,null,"","",""]
[null,null,null,"","",""]
[null,null,null,"","",""]
[null,null,null,"","",""]
[null,null,null,"","",""]
[null,null,null,"","",""]
[null,null,null,"","",""]
[null,null,null,"","",""]
[null,null,null,"","",""]
[null,null,null,"","",""]
[null,null,null,"","",""]
[null,null,null,"","",""]
[null,null,null,"","",""]
[null,null,null,"","",""]
[null,null,null,"","",""]
[null,null,null,"","",""]
[null,null,null,"","",""]
[null,null,null,"","",""]
[null,null,null,"","",""]
[null,null,null,"","",""]
[null,null,null,"","",""]
[null,null,null,"","",""]
[null,null,null,"","",""]
[null,null,null,"","",""]
[null,null,null,"","",""]
[null,null,null,"","",""]
[null,null,null,"","",""]
[null,null,null,"","",""]
[null,null,null,"","",""]
[null,null,null,"","",""]
[null,null,null,"","",""]
[null,null,null,"","",""]
[null,null,null,"","",""]
[null,null,null,"","",""]
[null,null,null,"","",""]
[null,null,null,"","",""]
[null,null,null,"","",""]
[null,null,null,"","",""]
[null,null,null,"","",""]