{"text_format":"1","workbook":"xlsx","n_sheets":5,"sheets":["تفاصيل المعادلة ","المعلومات ","البيانات","التفاصيل","lists"],"not_rendered":{"charts":0,"images":0,"macros":1,"external_links":0,"defined_names":9,"comments":0,"pivot_tables":1},"unopened":[],"bounds":{"document_bytes":16777216,"sheet_cells":100000,"rows_first":2000,"rows_last":500,"rows_between":2000,"halvings":0,"cell_chars":16384,"cell_head_chars":4096},"cells_cut":0,"cells_raw":0,"read":"whole","date_system":"1900"}

{"sheet":"تفاصيل المعادلة ","index":0,"n_rows":11,"n_cols":9,"rows_kept":11,"cut":false,"hidden":true,"merged":[]}
["النوع","النوع","العرض","العمق","الارتفاع","العدد","كمية المساحة ","الكلفة ","الأجمالي"]
["جوانب","AB",56,0.56000000000000005,0.75,2,"=IF(A2=\"جوانب\";D2*E2*F2;IF(A2=\"القاعدة\";C2*D2*F2;IF(A2=\"الرف\";C2*D2*F2;IF(A2=\"المسطرة\";C2*E2*F2;\"\"))))",16.329999999999998,{"$f":"H2*G2","v":{"$error":"#VALUE!"}}]
["القاعدة","AB",0.96399999999999997,0.56000000000000005,0.75,1,null,16.329999999999998,{"$f":"H3*G3","v":0}]
["الرف","AB",0.96399999999999997,0.54,null,1,{"$f":"C4*D4*F4","v":0.52056000000000002},16.329999999999998,8.5007447999999997]
["المسطرة","AB",0.96399999999999997,null,0.12,2,{"$f":"C5*E5*F5","v":0.23135999999999998},16.329999999999998,3.7781087999999992]
[]
[]
[]
[]
[]
[null,null,null,null,null,null,{"$f":"SUM(G2:G10)","v":0.75192000000000003}]

{"sheet":"المعلومات ","index":1,"n_rows":17,"n_cols":21,"rows_kept":17,"cut":false,"hidden":false,"merged":[]}
["التاريخ","رقم الأمر","الجهة ","اسم الزبون","النوع","الملاحظات ","كود المصنع","تكلفة الفاتورة","عدد الأمتار","واقع الحال","التلف","سعر الكلفة ","صافي الربح ","تاريخ التصعيد ","المبلغ ",{"$f":"SUBTOTAL(9,$H:$H:$H:$H)","v":8004.3},"العدد",{"$f":"SUBTOTAL(2,$H:$H:$H:$H)","v":16},{"$f":"TODAY()","v":"2018-03-30"},"الأمتار ",{"$f":"SUBTOTAL(9,$I:$I:$I:$I)","v":73.2}]
["2018-01-01",1,"شركة بهار ","عماد احمد x10","ابواب",null,"AB35-AB14",1718,20.68,null,null,null,{"$f":"H2-J2-K2-L2","v":1718},"2018-01-01",null,null,null,null,{"$f":"TODAY()","v":"2018-03-30"}]
["2018-01-01",1,"شركة بهار ","عماد احمد x10","كابينات ",null,"KH3",334,null,null,null,null,{"$f":"H3-J3-K3-L3","v":334},"2018-01-01",null,null,null,null,"2018-03-30"]
["2018-01-01",1,"شركة بهار ","عماد احمد x10","كورين ",null,"F1",1406,7.9799999999999995,null,null,null,1406,"2018-01-03",null,null,null,null,"2018-03-30"]
["2018-01-01",2,"شركة بهار ","حيدر كريم كاطع Z54","كابينات ",null,"KH1",52,null,null,null,null,52,"2018-01-03",null,null,null,null,"2018-03-30"]
["2018-01-01",3,"شركة بهار ","عباس قاسم علي ","ابواب",null,"AB1",763,15.43,null,null,null,763,"2018-01-03",null,null,null,null,"2018-03-30"]
["2018-01-01",3,"شركة بهار ","عباس قاسم علي ","كابينات ",null,"KH2",23,null,null,null,null,23,"2018-01-09",null,null,null,null,"2018-03-30"]
["2018-01-01",3,"شركة بهار ","عباس قاسم علي ","كوارتز",null,"CD3 ",1041,8.01,null,null,null,1041,"2018-01-09",null,null,null,null,"2018-03-30"]
["2018-01-03",4,"شركة بهار ","مهند علاء Z66","ابواب",null,"AB15",116,2.76,null,null,null,116,"2018-01-09",null,null,null,null,"2018-03-30"]
["2018-01-03",4,"شركة بهار ","مهند علاء Z66","كابينات ",null,"KH4",20,null,null,null,null,20,"2018-01-10",null,null,null,null,"2018-03-30"]
["2018-01-03",4,"شركة بهار ","مهند علاء Z66","كوارتز",null,"CD4",173.3,2.31,null,null,null,173.3,"2018-01-02",null,null,null,null,"2018-03-30"]
["2018-01-02",5,"معرض الأسكان ","محمد ","كابينات ",null,"KH6",83,null,null,null,null,83,"2018-01-02",null,null,null,null,"2018-03-30"]
["2018-01-01",6,"شركة ايفا ","kc 40 المعرض ","كابينات ",null,"KH7",86,null,null,null,null,86,"2018-01-03",null,null,null,null,"2018-03-30"]
["2018-01-01",7,"شركة بهار ","يوناميD 2/2 ","كورين ",null,"F 16",1315,6.74,null,null,null,1315,"2018-01-03",null,null,null,null,"2018-03-30"]
["2018-01-03",7,"شركة بهار ","يوناميD 2/2 ","ابواب",null,"AB 29",362,5.59,null,null,null,362,"2018-01-07",null,null,null,null,"2018-03-30"]
["2018-01-03",7,"شركة بهار ","يوناميD 2/2 ","كابينات ",null,"KH 8",337,null,null,null,null,337,"2018-01-07",null,null,null,null,"2018-03-30"]
["2018-01-03",8,"شركة بهار ","رعد مظلوم Z 68","ابواب",null,"AB 25",175,3.7,null,null,null,175,"2018-01-07",null,null,null,null,"2018-03-30"]

{"sheet":"البيانات","index":2,"n_rows":953,"n_cols":22,"rows_kept":953,"cut":false,"hidden":false,"merged":[]}
[null,"ت","قياس الكابينة","MDFنوع الخشب"," شريط PVC","ظهر( طبقة الفايبر)","مسند بلاستك","سعر MDF","سعر PVC","سعر الظهر","سعر المسند","مواد تشغيل ","الأجمالي",null,null,null,null,null,null,null,null,{"$f":"INDEX(MyFindData,SMALL(IF(ISNUMBER(SEARCH(FindText,MyFindData)),ROW(MyFindData),\"\"),ROW())-ROW(INDEX(MyFindData,1,1))+1)","v":"AW 50*33*90"}]
[{"$f":"COUNTIF($C:$C,C2)","v":1},1,"AB 100*56*75","2.1",14.8,0.63,4,null,null,null,null,null,{"$f":"SUM(H2:L2)","v":0},null,null,null,null,null,null,null,null,{"$error":"#NUM!"}]
[1,2,"AB 90*56*75","1.99",13.92,0.56999999999999995,7,null,null,null,null,null,{"$f":"SUM(H3:L3)","v":0},null,null,null,null,null,null,null,null,{"$error":"#NUM!"}]
[1,3,"AB 80*56*75","1.85",13.12,0.5,6,null,null,null,null,null,0,null,null,null,null,null,null,null,null,{"$error":"#NUM!"}]
[1,4,"AB 75*56*75","1.85",13.12,0.5,4,null,null,null,null,null,0,null,null,null,null,null,null,null,null,{"$error":"#NUM!"}]
[1,5,"AB 70*56*75","1.72",12.32,0.44,4,null,null,null,null,null,0,null,null,null,null,null,null,null,null,{"$error":"#NUM!"}]
[1,6,"AB 60*56*75","1.59",11.52,0.37,7,null,null,null,null,null,0,null,null,null,null,null,null,null,null,{"$error":"#NUM!"}]
[1,7,"AB 50*56*75","1.45",10.72,0.31,4,null,null,null,null,null,0,null,null,null,null,null,null,null,null,{"$error":"#NUM!"}]
[1,8,"AB 45*56*75","1.39",10.32,0.27,7,null,null,null,null,null,0,null,null,null,null,null,null,null,null,{"$error":"#NUM!"}]
[1,9,"AB 40*56*75","1.25",9.92,0.24,4,null,null,null,null,null,0,null,null,null,null,null,null,null,null,{"$error":"#NUM!"}]
[1,10,"AB 35*56*75","1.22",9.52,0.22,4,null,null,null,null,null,0,null,null,null,null,null,null,null,null,{"$error":"#NUM!"}]
[1,11,"AB 30*56*75","1.19",9.1199999999999992,0.21,4,null,null,null,null,null,0,null,null,null,null,null,null,null,null,{"$error":"#NUM!"}]
[1,12,"AB 25*56*75",null,null,null,5,null,null,null,null,null,0,null,null,null,null,null,null,null,null,{"$error":"#NUM!"}]
[1,13,"AB 20*56*75","1.05",8.32,0.18,4,null,null,null,null,null,0,null,null,null,null,null,null,null,null,{"$error":"#NUM!"}]
[1,14,"AB 15*56*75","1",8,0.18,5,null,null,null,null,null,0,null,null,null,null,null,null,null,null,{"$error":"#NUM!"}]
[1,15,"ASB 100*56*75","1.78",14.8,0.63,5,null,null,null,null,null,0,null,null,null,null,null,null,null,null,{"$error":"#NUM!"}]
[1,16,"ASB 90*56*75","1.68",13.92,0.56999999999999995,51,null,null,null,null,null,0,null,null,null,null,null,null,null,null,{"$error":"#NUM!"}]
[1,17,"AOB 90*56*75","1.88",13.92,0.56999999999999995,4,null,null,null,null,null,0,null,null,null,null,null,null,null,null,{"$error":"#NUM!"}]
[1,18,"AOB 60*56*75","1.52",11.52,0.37,4,null,null,null,null,null,0,null,null,null,null,null,null,null,null,{"$error":"#NUM!"}]
[1,19,"ABC 90*90*56*75","3.3",17,1.28,5,null,null,null,null,null,0,null,null,null,null,null,null,null,null,{"$error":"#NUM!"}]
[1,20,"ABB110*56*75","2.63",19.2,0.79,4,null,null,null,null,null,0,null,null,null,null,null,null,null,null,{"$error":"#NUM!"}]
[1,21,"ABB 105*56*75","2.19",16,0.66,4,null,null,null,null,null,0,null,null,null,null,null,null,null,null,{"$error":"#NUM!"}]
[1,22,"ABB 100*56*75",null,null,null,4,null,null,null,null,null,0,null,null,null,null,null,null,null,null,{"$error":"#NUM!"}]
[1,23,"ABM 40*56*75","1.22",9.52,0.22,null,null,null,null,null,null,0,null,null,null,null,null,null,null,null,{"$error":"#NUM!"}]
[1,24,"ATBC 90*90*56*75",null,null,null,null,null,null,null,null,null,0,null,null,null,null,null,null,null,null,{"$error":"#NUM!"}]
[1,25,"AW 100*33*75","1.38",11.2,0.71,4,null,null,null,null,null,0,null,null,null,null,null,null,null,null,{"$error":"#NUM!"}]
[1,26,"AW 90*33*75","1.28",10.6,0.64,5,null,null,null,null,null,0,null,null,null,null,null,null,null,null,{"$error":"#NUM!"}]
[1,27,"AW 80*33*75","1.19",10.039999999999999,0.56000000000000005,5,null,null,null,null,null,0,null,null,null,null,null,null,null,null,{"$error":"#NUM!"}]
[1,28,"AW 75*33*75","1.19",10.039999999999999,0.56000000000000005,4,null,null,null,null,null,0,null,null,null,null,null,null,null,null,{"$error":"#NUM!"}]
[1,29,"AW 70*33*75","1.09",9.42,0.49,4,null,null,null,null,null,0,null,null,null,null,null,null,null,null,{"$error":"#NUM!"}]
[1,30,"AW 60*33*75","1",8.8000000000000007,0.42,4,null,null,null,null,null,0,null,null,null,null,null,null,null,null,{"$error":"#NUM!"}]
[1,31,"AW 50*33*75","0.91",8.1999999999999993,0.35,5,null,null,null,null,null,0,null,null,null,null,null,null,null,null,{"$error":"#NUM!"}]
[1,32,"AW 45*33*75","0.86",7.92,0.31,4,null,null,null,null,null,0,null,null,null,null,null,null,null,null,{"$error":"#NUM!"}]
[1,33,"AW 40*33*75","0.82",7.6,0.27,14,null,null,null,null,null,0,null,null,null,null,null,null,null,null,{"$error":"#NUM!"}]
[1,34,"AW 35*33*75","0.77",7.3,0.24,6,null,null,null,null,null,0,null,null,null,null,null,null,null,null,{"$error":"#NUM!"}]
[1,35,"AW 30*33*75","0.72",7,0.2,4,null,null,null,null,null,0,null,null,null,null,null,null,null,null,{"$error":"#NUM!"}]
[1,36,"AW 25*33*75","0.72",7,0.2,4,null,null,null,null,null,0,null,null,null,null,null,null,null,null,{"$error":"#NUM!"}]
[1,37,"AW 20*33*75","0.63",6.4,0.13,4,null,null,null,null,null,0,null,null,null,null,null,null,null,null,{"$error":"#NUM!"}]
[1,38,"ABW 75*33*75","1.14",9.8000000000000007,0.53,4,null,null,null,null,null,0,null,null,null,null,null,null,null,null,{"$error":"#NUM!"}]
[1,39,"AWC 60*60*33*75","1.59",12.28,0.84,5,null,null,null,null,null,0,null,null,null,null,null,null,null,null,{"$error":"#NUM!"}]
{"$rows_left_out":914}
{"sheet":"التفاصيل","index":3,"n_rows":918,"n_cols":15,"rows_kept":918,"cut":false,"hidden":false,"merged":[]}
["نوع الكابينة ","مبلغ التكلفة ","العدد","المساحة","PVC","الظهر","اجمالي التكلفة ","اجمالي البيع ","الربح","رقم الفاتورة ","اسم الزبون ","الجهة ","الكود ","تاريخ","الملاحظات"]
["AW 50*33*90",{"$f":"IFERROR(VLOOKUP($A2,البيانات!$C$2:$M$300,11,FALSE),\"\")","v":0},1,{"$f":"IFERROR(VLOOKUP($A2,البيانات!$C$2:$M$300,2,FALSE)*C:C,\"\")","v":1.1399999999999999},{"$f":"IFERROR(VLOOKUP($A2,البيانات!$C$2:$M$300,3,FALSE)*C:C,\"\")","v":10.48},{"$f":"IFERROR(VLOOKUP($A2,البيانات!$C$2:$M$300,4,FALSE)*C:C,\"\")","v":0.42},{"$f":"IFERROR(C2*B2,\"\")","v":0},25,{"$f":"IFERROR(H2-G2,\"\")","v":25},null,"عبد الرحمن1","معرض","KH49","2018-01-29"]
["AW 45*33*90",{"$f":"IFERROR(VLOOKUP($A3,البيانات!$C$2:$M$300,11,FALSE),\"\")","v":0},1,{"$f":"IFERROR(VLOOKUP($A3,البيانات!$C$2:$M$300,2,FALSE)*C:C,\"\")","v":1.08},{"$f":"IFERROR(VLOOKUP($A3,البيانات!$C$2:$M$300,3,FALSE)*C:C,\"\")","v":10.08},{"$f":"IFERROR(VLOOKUP($A3,البيانات!$C$2:$M$300,4,FALSE)*C:C,\"\")","v":0.37},{"$f":"IFERROR(C3*B3,\"\")","v":0},26,{"$f":"IFERROR(H3-G3,\"\")","v":26},null,"عبد الرحمن2","معرض","KH49","2018-01-29"]
["AW 50*33*75",{"$f":"IFERROR(VLOOKUP($A4,البيانات!$C$2:$M$300,11,FALSE),\"\")","v":0},1,{"$f":"IFERROR(VLOOKUP($A4,البيانات!$C$2:$M$300,2,FALSE)*C:C,\"\")","v":0.91},{"$f":"IFERROR(VLOOKUP($A4,البيانات!$C$2:$M$300,3,FALSE)*C:C,\"\")","v":8.1999999999999993},{"$f":"IFERROR(VLOOKUP($A4,البيانات!$C$2:$M$300,4,FALSE)*C:C,\"\")","v":0.35},0,27,27,null,"عبد الرحمن3","معرض","KH49","2018-01-29"]
["AW 45*33*75",{"$f":"IFERROR(VLOOKUP($A5,البيانات!$C$2:$M$300,11,FALSE),\"\")","v":0},1,{"$f":"IFERROR(VLOOKUP($A5,البيانات!$C$2:$M$300,2,FALSE)*C:C,\"\")","v":0.86},{"$f":"IFERROR(VLOOKUP($A5,البيانات!$C$2:$M$300,3,FALSE)*C:C,\"\")","v":7.92},{"$f":"IFERROR(VLOOKUP($A5,البيانات!$C$2:$M$300,4,FALSE)*C:C,\"\")","v":0.31},0,28,28,null,"عبد الرحمن4","معرض","KH49","2018-01-29"]
["AW 50*33*75",{"$f":"IFERROR(VLOOKUP($A6,البيانات!$C$2:$M$300,11,FALSE),\"\")","v":0},1,{"$f":"IFERROR(VLOOKUP($A6,البيانات!$C$2:$M$300,2,FALSE)*C:C,\"\")","v":0.91},{"$f":"IFERROR(VLOOKUP($A6,البيانات!$C$2:$M$300,3,FALSE)*C:C,\"\")","v":8.1999999999999993},{"$f":"IFERROR(VLOOKUP($A6,البيانات!$C$2:$M$300,4,FALSE)*C:C,\"\")","v":0.35},0,29,29,null,"عبد الرحمن5","معرض","KH49","2018-01-29"]
["ATWC 60*60*33*75",{"$f":"IFERROR(VLOOKUP($A7,البيانات!$C$2:$M$300,11,FALSE),\"\")","v":0},1,{"$f":"IFERROR(VLOOKUP($A7,البيانات!$C$2:$M$300,2,FALSE)*C:C,\"\")","v":1.59},{"$f":"IFERROR(VLOOKUP($A7,البيانات!$C$2:$M$300,3,FALSE)*C:C,\"\")","v":15.6},{"$f":"IFERROR(VLOOKUP($A7,البيانات!$C$2:$M$300,4,FALSE)*C:C,\"\")","v":0.84},0,25,25,null,"عبد الرحمن6","معرض","KH49","2018-01-29"]
["AB 100*56*75",{"$f":"IFERROR(VLOOKUP($A8,البيانات!$C$2:$M$300,11,FALSE),\"\")","v":0},1,{"$f":"IFERROR(VLOOKUP($A8,البيانات!$C$2:$M$300,2,FALSE)*C:C,\"\")","v":2.1},{"$f":"IFERROR(VLOOKUP($A8,البيانات!$C$2:$M$300,3,FALSE)*C:C,\"\")","v":14.8},{"$f":"IFERROR(VLOOKUP($A8,البيانات!$C$2:$M$300,4,FALSE)*C:C,\"\")","v":0.63},0,26,26,null,"عبد الرحمن7","معرض","KH53","2018-01-18"]
["AB 100*56*75",{"$f":"IFERROR(VLOOKUP($A9,البيانات!$C$2:$M$300,11,FALSE),\"\")","v":0},1,{"$f":"IFERROR(VLOOKUP($A9,البيانات!$C$2:$M$300,2,FALSE)*C:C,\"\")","v":2.1},{"$f":"IFERROR(VLOOKUP($A9,البيانات!$C$2:$M$300,3,FALSE)*C:C,\"\")","v":14.8},{"$f":"IFERROR(VLOOKUP($A9,البيانات!$C$2:$M$300,4,FALSE)*C:C,\"\")","v":0.63},0,27,27,null,"عبد الرحمن8","معرض","KH53","2018-01-18"]
["AW 25*33*75",{"$f":"IFERROR(VLOOKUP($A10,البيانات!$C$2:$M$300,11,FALSE),\"\")","v":0},1,{"$f":"IFERROR(VLOOKUP($A10,البيانات!$C$2:$M$300,2,FALSE)*C:C,\"\")","v":0.72},{"$f":"IFERROR(VLOOKUP($A10,البيانات!$C$2:$M$300,3,FALSE)*C:C,\"\")","v":7},{"$f":"IFERROR(VLOOKUP($A10,البيانات!$C$2:$M$300,4,FALSE)*C:C,\"\")","v":0.2},0,28,28,null,"عبد الرحمن9","معرض","KH53","2018-01-18"]
["AW 20*33*75",{"$f":"IFERROR(VLOOKUP($A11,البيانات!$C$2:$M$300,11,FALSE),\"\")","v":0},1,{"$f":"IFERROR(VLOOKUP($A11,البيانات!$C$2:$M$300,2,FALSE)*C:C,\"\")","v":0.63},{"$f":"IFERROR(VLOOKUP($A11,البيانات!$C$2:$M$300,3,FALSE)*C:C,\"\")","v":6.4},{"$f":"IFERROR(VLOOKUP($A11,البيانات!$C$2:$M$300,4,FALSE)*C:C,\"\")","v":0.13},0,29,29,null,"عبد الرحمن10","معرض","KH53","2018-01-18"]
["ASB 100*56*75",{"$f":"IFERROR(VLOOKUP($A12,البيانات!$C$2:$M$300,11,FALSE),\"\")","v":0},1,{"$f":"IFERROR(VLOOKUP($A12,البيانات!$C$2:$M$300,2,FALSE)*C:C,\"\")","v":1.78},{"$f":"IFERROR(VLOOKUP($A12,البيانات!$C$2:$M$300,3,FALSE)*C:C,\"\")","v":14.8},{"$f":"IFERROR(VLOOKUP($A12,البيانات!$C$2:$M$300,4,FALSE)*C:C,\"\")","v":0.63},0,25,25,null,"عبد الرحمن11","معرض","KH54","2018-01-20"]
["AW 90*33*75",{"$f":"IFERROR(VLOOKUP($A13,البيانات!$C$2:$M$300,11,FALSE),\"\")","v":0},1,{"$f":"IFERROR(VLOOKUP($A13,البيانات!$C$2:$M$300,2,FALSE)*C:C,\"\")","v":1.28},{"$f":"IFERROR(VLOOKUP($A13,البيانات!$C$2:$M$300,3,FALSE)*C:C,\"\")","v":10.6},{"$f":"IFERROR(VLOOKUP($A13,البيانات!$C$2:$M$300,4,FALSE)*C:C,\"\")","v":0.64},0,26,26,null,"عبد الرحمن12","معرض","KH54","2018-01-20"]
["AW 40*33*75",{"$f":"IFERROR(VLOOKUP($A14,البيانات!$C$2:$M$300,11,FALSE),\"\")","v":0},3,{"$f":"IFERROR(VLOOKUP($A14,البيانات!$C$2:$M$300,2,FALSE)*C:C,\"\")","v":2.46},{"$f":"IFERROR(VLOOKUP($A14,البيانات!$C$2:$M$300,3,FALSE)*C:C,\"\")","v":22.799999999999997},{"$f":"IFERROR(VLOOKUP($A14,البيانات!$C$2:$M$300,4,FALSE)*C:C,\"\")","v":0.81},0,27,27,null,"عبد الرحمن13","معرض","KH55","2018-01-20"]
[null,{"$f":"IFERROR(VLOOKUP($A15,البيانات!$C$2:$M$300,11,FALSE),\"\")","v":""},null,{"$f":"IFERROR(VLOOKUP($A15,البيانات!$C$2:$M$300,2,FALSE)*C:C,\"\")","v":""},{"$f":"IFERROR(VLOOKUP($A15,البيانات!$C$2:$M$300,3,FALSE)*C:C,\"\")","v":""},{"$f":"IFERROR(VLOOKUP($A15,البيانات!$C$2:$M$300,4,FALSE)*C:C,\"\")","v":""},"",25,"",null,"عبد الرحمن14","معرض"]
["A4D 45*45*15",{"$f":"IFERROR(VLOOKUP($A16,البيانات!$C$2:$M$300,11,FALSE),\"\")","v":0},2,{"$f":"IFERROR(VLOOKUP($A16,البيانات!$C$2:$M$300,2,FALSE)*C:C,\"\")","v":2},{"$f":"IFERROR(VLOOKUP($A16,البيانات!$C$2:$M$300,3,FALSE)*C:C,\"\")","v":30},{"$f":"IFERROR(VLOOKUP($A16,البيانات!$C$2:$M$300,4,FALSE)*C:C,\"\")","v":0.56000000000000005},0,26,26,null,"عبد الرحمن15","معرض","KH55","2018-01-20"]
["AW 35*33*75",{"$f":"IFERROR(VLOOKUP($A17,البيانات!$C$2:$M$300,11,FALSE),\"\")","v":0},1,{"$f":"IFERROR(VLOOKUP($A17,البيانات!$C$2:$M$300,2,FALSE)*C:C,\"\")","v":0.77},{"$f":"IFERROR(VLOOKUP($A17,البيانات!$C$2:$M$300,3,FALSE)*C:C,\"\")","v":7.3},{"$f":"IFERROR(VLOOKUP($A17,البيانات!$C$2:$M$300,4,FALSE)*C:C,\"\")","v":0.24},0,27,27,null,"عبد الرحمن16","معرض","KH60","2018-01-24"]
[null,{"$f":"IFERROR(VLOOKUP($A18,البيانات!$C$2:$M$207,11,FALSE),\"\")","v":""},null,{"$f":"IFERROR(VLOOKUP($A18,البيانات!$C$2:$M$207,2,FALSE)*C:C,\"\")","v":""},{"$f":"IFERROR(VLOOKUP($A18,البيانات!$C$2:$M$207,3,FALSE)*C:C,\"\")","v":""},{"$f":"IFERROR(VLOOKUP($A18,البيانات!$C$2:$M$207,4,FALSE)*C:C,\"\")","v":""},{"$f":"IFERROR(C18*B18,\"\")","v":""},null,{"$f":"IFERROR(H18-G18,\"\")","v":""}]
[null,{"$f":"IFERROR(VLOOKUP($A19,البيانات!$C$2:$M$207,11,FALSE),\"\")","v":""},null,{"$f":"IFERROR(VLOOKUP($A19,البيانات!$C$2:$M$207,2,FALSE)*C:C,\"\")","v":""},{"$f":"IFERROR(VLOOKUP($A19,البيانات!$C$2:$M$207,3,FALSE)*C:C,\"\")","v":""},{"$f":"IFERROR(VLOOKUP($A19,البيانات!$C$2:$M$207,4,FALSE)*C:C,\"\")","v":""},"",null,""]
[null,{"$f":"IFERROR(VLOOKUP($A20,البيانات!$C$2:$M$207,11,FALSE),\"\")","v":""},null,{"$f":"IFERROR(VLOOKUP($A20,البيانات!$C$2:$M$207,2,FALSE)*C:C,\"\")","v":""},{"$f":"IFERROR(VLOOKUP($A20,البيانات!$C$2:$M$207,3,FALSE)*C:C,\"\")","v":""},{"$f":"IFERROR(VLOOKUP($A20,البيانات!$C$2:$M$207,4,FALSE)*C:C,\"\")","v":""},"",null,""]
[null,{"$f":"IFERROR(VLOOKUP($A21,البيانات!$C$2:$M$207,11,FALSE),\"\")","v":""},null,{"$f":"IFERROR(VLOOKUP($A21,البيانات!$C$2:$M$207,2,FALSE)*C:C,\"\")","v":""},{"$f":"IFERROR(VLOOKUP($A21,البيانات!$C$2:$M$207,3,FALSE)*C:C,\"\")","v":""},{"$f":"IFERROR(VLOOKUP($A21,البيانات!$C$2:$M$207,4,FALSE)*C:C,\"\")","v":""},"",null,""]
[null,{"$f":"IFERROR(VLOOKUP($A22,البيانات!$C$2:$M$207,11,FALSE),\"\")","v":""},null,{"$f":"IFERROR(VLOOKUP($A22,البيانات!$C$2:$M$207,2,FALSE)*C:C,\"\")","v":""},{"$f":"IFERROR(VLOOKUP($A22,البيانات!$C$2:$M$207,3,FALSE)*C:C,\"\")","v":""},{"$f":"IFERROR(VLOOKUP($A22,البيانات!$C$2:$M$207,4,FALSE)*C:C,\"\")","v":""},"",null,""]
[null,{"$f":"IFERROR(VLOOKUP($A23,البيانات!$C$2:$M$207,11,FALSE),\"\")","v":""},null,{"$f":"IFERROR(VLOOKUP($A23,البيانات!$C$2:$M$207,2,FALSE)*C:C,\"\")","v":""},{"$f":"IFERROR(VLOOKUP($A23,البيانات!$C$2:$M$207,3,FALSE)*C:C,\"\")","v":""},{"$f":"IFERROR(VLOOKUP($A23,البيانات!$C$2:$M$207,4,FALSE)*C:C,\"\")","v":""},{"$f":"IFERROR(C23*B23,\"\")","v":""},null,""]
[null,{"$f":"IFERROR(VLOOKUP($A24,البيانات!$C$2:$M$207,11,FALSE),\"\")","v":""},null,{"$f":"IFERROR(VLOOKUP($A24,البيانات!$C$2:$M$207,2,FALSE)*C:C,\"\")","v":""},{"$f":"IFERROR(VLOOKUP($A24,البيانات!$C$2:$M$207,3,FALSE)*C:C,\"\")","v":""},{"$f":"IFERROR(VLOOKUP($A24,البيانات!$C$2:$M$207,4,FALSE)*C:C,\"\")","v":""},"",null,""]
[null,{"$f":"IFERROR(VLOOKUP($A25,البيانات!$C$2:$M$207,11,FALSE),\"\")","v":""},null,{"$f":"IFERROR(VLOOKUP($A25,البيانات!$C$2:$M$207,2,FALSE)*C:C,\"\")","v":""},{"$f":"IFERROR(VLOOKUP($A25,البيانات!$C$2:$M$207,3,FALSE)*C:C,\"\")","v":""},{"$f":"IFERROR(VLOOKUP($A25,البيانات!$C$2:$M$207,4,FALSE)*C:C,\"\")","v":""},"",null,""]
[null,{"$f":"IFERROR(VLOOKUP($A26,البيانات!$C$2:$M$207,11,FALSE),\"\")","v":""},null,{"$f":"IFERROR(VLOOKUP($A26,البيانات!$C$2:$M$207,2,FALSE)*C:C,\"\")","v":""},{"$f":"IFERROR(VLOOKUP($A26,البيانات!$C$2:$M$207,3,FALSE)*C:C,\"\")","v":""},{"$f":"IFERROR(VLOOKUP($A26,البيانات!$C$2:$M$207,4,FALSE)*C:C,\"\")","v":""},"",null,""]
[null,{"$f":"IFERROR(VLOOKUP($A27,البيانات!$C$2:$M$207,11,FALSE),\"\")","v":""},null,{"$f":"IFERROR(VLOOKUP($A27,البيانات!$C$2:$M$207,2,FALSE)*C:C,\"\")","v":""},{"$f":"IFERROR(VLOOKUP($A27,البيانات!$C$2:$M$207,3,FALSE)*C:C,\"\")","v":""},{"$f":"IFERROR(VLOOKUP($A27,البيانات!$C$2:$M$207,4,FALSE)*C:C,\"\")","v":""},"",null,""]
[null,{"$f":"IFERROR(VLOOKUP($A28,البيانات!$C$2:$M$207,11,FALSE),\"\")","v":""},null,{"$f":"IFERROR(VLOOKUP($A28,البيانات!$C$2:$M$207,2,FALSE)*C:C,\"\")","v":""},{"$f":"IFERROR(VLOOKUP($A28,البيانات!$C$2:$M$207,3,FALSE)*C:C,\"\")","v":""},{"$f":"IFERROR(VLOOKUP($A28,البيانات!$C$2:$M$207,4,FALSE)*C:C,\"\")","v":""},"",null,""]
[null,{"$f":"IFERROR(VLOOKUP($A29,البيانات!$C$2:$M$207,11,FALSE),\"\")","v":""},null,{"$f":"IFERROR(VLOOKUP($A29,البيانات!$C$2:$M$207,2,FALSE)*C:C,\"\")","v":""},{"$f":"IFERROR(VLOOKUP($A29,البيانات!$C$2:$M$207,3,FALSE)*C:C,\"\")","v":""},{"$f":"IFERROR(VLOOKUP($A29,البيانات!$C$2:$M$207,4,FALSE)*C:C,\"\")","v":""},"",null,""]
[null,{"$f":"IFERROR(VLOOKUP($A30,البيانات!$C$2:$M$207,11,FALSE),\"\")","v":""},null,{"$f":"IFERROR(VLOOKUP($A30,البيانات!$C$2:$M$207,2,FALSE)*C:C,\"\")","v":""},{"$f":"IFERROR(VLOOKUP($A30,البيانات!$C$2:$M$207,3,FALSE)*C:C,\"\")","v":""},{"$f":"IFERROR(VLOOKUP($A30,البيانات!$C$2:$M$207,4,FALSE)*C:C,\"\")","v":""},"",null,""]
[null,{"$f":"IFERROR(VLOOKUP($A31,البيانات!$C$2:$M$207,11,FALSE),\"\")","v":""},null,{"$f":"IFERROR(VLOOKUP($A31,البيانات!$C$2:$M$207,2,FALSE)*C:C,\"\")","v":""},{"$f":"IFERROR(VLOOKUP($A31,البيانات!$C$2:$M$207,3,FALSE)*C:C,\"\")","v":""},{"$f":"IFERROR(VLOOKUP($A31,البيانات!$C$2:$M$207,4,FALSE)*C:C,\"\")","v":""},"",null,""]
[null,{"$f":"IFERROR(VLOOKUP($A32,البيانات!$C$2:$M$207,11,FALSE),\"\")","v":""},null,{"$f":"IFERROR(VLOOKUP($A32,البيانات!$C$2:$M$207,2,FALSE)*C:C,\"\")","v":""},{"$f":"IFERROR(VLOOKUP($A32,البيانات!$C$2:$M$207,3,FALSE)*C:C,\"\")","v":""},{"$f":"IFERROR(VLOOKUP($A32,البيانات!$C$2:$M$207,4,FALSE)*C:C,\"\")","v":""},"",null,""]
[null,{"$f":"IFERROR(VLOOKUP($A33,البيانات!$C$2:$M$207,11,FALSE),\"\")","v":""},null,{"$f":"IFERROR(VLOOKUP($A33,البيانات!$C$2:$M$207,2,FALSE)*C:C,\"\")","v":""},{"$f":"IFERROR(VLOOKUP($A33,البيانات!$C$2:$M$207,3,FALSE)*C:C,\"\")","v":""},{"$f":"IFERROR(VLOOKUP($A33,البيانات!$C$2:$M$207,4,FALSE)*C:C,\"\")","v":""},"",null,""]
[null,{"$f":"IFERROR(VLOOKUP($A34,البيانات!$C$2:$M$207,11,FALSE),\"\")","v":""},null,{"$f":"IFERROR(VLOOKUP($A34,البيانات!$C$2:$M$207,2,FALSE)*C:C,\"\")","v":""},{"$f":"IFERROR(VLOOKUP($A34,البيانات!$C$2:$M$207,3,FALSE)*C:C,\"\")","v":""},{"$f":"IFERROR(VLOOKUP($A34,البيانات!$C$2:$M$207,4,FALSE)*C:C,\"\")","v":""},"",null,""]
[null,{"$f":"IFERROR(VLOOKUP($A35,البيانات!$C$2:$M$207,11,FALSE),\"\")","v":""},null,{"$f":"IFERROR(VLOOKUP($A35,البيانات!$C$2:$M$207,2,FALSE)*C:C,\"\")","v":""},{"$f":"IFERROR(VLOOKUP($A35,البيانات!$C$2:$M$207,3,FALSE)*C:C,\"\")","v":""},{"$f":"IFERROR(VLOOKUP($A35,البيانات!$C$2:$M$207,4,FALSE)*C:C,\"\")","v":""},"",null,""]
[null,{"$f":"IFERROR(VLOOKUP($A36,البيانات!$C$2:$M$207,11,FALSE),\"\")","v":""},null,{"$f":"IFERROR(VLOOKUP($A36,البيانات!$C$2:$M$207,2,FALSE)*C:C,\"\")","v":""},{"$f":"IFERROR(VLOOKUP($A36,البيانات!$C$2:$M$207,3,FALSE)*C:C,\"\")","v":""},{"$f":"IFERROR(VLOOKUP($A36,البيانات!$C$2:$M$207,4,FALSE)*C:C,\"\")","v":""},"",null,""]
[null,{"$f":"IFERROR(VLOOKUP($A37,البيانات!$C$2:$M$207,11,FALSE),\"\")","v":""},null,{"$f":"IFERROR(VLOOKUP($A37,البيانات!$C$2:$M$207,2,FALSE)*C:C,\"\")","v":""},{"$f":"IFERROR(VLOOKUP($A37,البيانات!$C$2:$M$207,3,FALSE)*C:C,\"\")","v":""},{"$f":"IFERROR(VLOOKUP($A37,البيانات!$C$2:$M$207,4,FALSE)*C:C,\"\")","v":""},"",null,""]
[null,{"$f":"IFERROR(VLOOKUP($A38,البيانات!$C$2:$M$207,11,FALSE),\"\")","v":""},null,{"$f":"IFERROR(VLOOKUP($A38,البيانات!$C$2:$M$207,2,FALSE)*C:C,\"\")","v":""},{"$f":"IFERROR(VLOOKUP($A38,البيانات!$C$2:$M$207,3,FALSE)*C:C,\"\")","v":""},{"$f":"IFERROR(VLOOKUP($A38,البيانات!$C$2:$M$207,4,FALSE)*C:C,\"\")","v":""},"",null,""]
[null,{"$f":"IFERROR(VLOOKUP($A39,البيانات!$C$2:$M$207,11,FALSE),\"\")","v":""},null,{"$f":"IFERROR(VLOOKUP($A39,البيانات!$C$2:$M$207,2,FALSE)*C:C,\"\")","v":""},{"$f":"IFERROR(VLOOKUP($A39,البيانات!$C$2:$M$207,3,FALSE)*C:C,\"\")","v":""},{"$f":"IFERROR(VLOOKUP($A39,البيانات!$C$2:$M$207,4,FALSE)*C:C,\"\")","v":""},"",null,""]
[null,{"$f":"IFERROR(VLOOKUP($A40,البيانات!$C$2:$M$207,11,FALSE),\"\")","v":""},null,{"$f":"IFERROR(VLOOKUP($A40,البيانات!$C$2:$M$207,2,FALSE)*C:C,\"\")","v":""},{"$f":"IFERROR(VLOOKUP($A40,البيانات!$C$2:$M$207,3,FALSE)*C:C,\"\")","v":""},{"$f":"IFERROR(VLOOKUP($A40,البيانات!$C$2:$M$207,4,FALSE)*C:C,\"\")","v":""},"",null,""]
{"$rows_left_out":879}
{"sheet":"lists","index":4,"n_rows":219,"n_cols":11,"rows_kept":219,"cut":false,"hidden":false,"merged":[]}
["A2D 45*45*20",null,null,null,null,null,null,null,null,null,{"$f":"lists!$A$1:INDEX(lists!$A:$A,MATCH(\"*\",lists!$A:$A,-1),1)","v":"A2D 45*45*20"}]
["A2D 50*45*20"]
["A2D 60*45*20"]
["A2D 70*45*20"]
["A2D 80*45*20"]
["A2D 90*45*20"]
["A3D 45*45*20*15*15"]
["A3D 50*45*20*15*15"]
["A3D 60*45*20*15*15"]
["A3D 70*45*20*15*15"]
["A3D 80*45*20*15*15"]
["A3D 90*45*20*15*15"]
["A4D 45*45*15"]
["A4D 50*45*15"]
["A4D 60*45*15"]
["A4D 70*45*15"]
["A4D 80*45*15"]
["A4D 90*45*15"]
["AB 100 *70*75"]
["AB 100*56*75"]
["AB 15*56*75"]
["AB 20*56*75"]
["AB 25*56*75"]
["AB 30*56*75"]
["AB 35*56*75"]
["AB 40*56*75"]
["AB 45*56*75"]
["AB 50*56*75"]
["AB 60*56*75"]
["AB 70*56*75"]
["AB 75*56*75"]
["AB 80*56*75"]
["AB 90*56*75"]
["ABB 100*56*75"]
["ABB 105*56*75"]
["ABB 120*56*75"]
["ABB 125*56*75"]
["ABB110*56*75"]
["ABC 90*90*56*75"]
["ABM 40*56*75"]
{"$rows_left_out":179}