{"text_format":"1","workbook":"xlsx","n_sheets":2,"sheets":["التفاصيل","البيانات"],"not_rendered":{"charts":0,"images":0,"macros":1,"external_links":1,"defined_names":3,"comments":0,"pivot_tables":0},"unopened":[],"bounds":{"document_bytes":16777216,"sheet_cells":100000,"rows_first":2000,"rows_last":500,"rows_between":2000,"halvings":0,"cell_chars":16384,"cell_head_chars":4096},"cells_cut":0,"cells_raw":0,"read":"whole","date_system":"1900"}

{"sheet":"التفاصيل","index":0,"n_rows":2311,"n_cols":2,"rows_kept":2311,"cut":false,"hidden":false,"merged":[]}
["نوع الكابينة ","مبلغ التكلفة "]
["AB 1*10*10",{"$f":"IFERROR(VLOOKUP($A2,[1]البيانات!$B$2:$L$350,11,FALSE),\"\")","v":335.03400000000005}]
["AB 1*10*11",{"$f":"IFERROR(VLOOKUP($A3,[1]البيانات!$B$2:$L$350,11,FALSE),\"\")","v":19.759700000000002}]
["AB 1*10*14",{"$f":"IFERROR(VLOOKUP($A4,[1]البيانات!$B$2:$L$350,11,FALSE),\"\")","v":16.6236}]
["AW 45*33*75",{"$f":"IFERROR(VLOOKUP($A5,[1]البيانات!$B$2:$L$350,11,FALSE),\"\")","v":""}]
["AW 50*33*75",{"$f":"IFERROR(VLOOKUP($A6,[1]البيانات!$B$2:$L$350,11,FALSE),\"\")","v":""}]
["AB 1*10*14",{"$f":"IFERROR(VLOOKUP($A7,[1]البيانات!$B$2:$L$350,11,FALSE),\"\")","v":16.6236}]
["AB 100*56*75",{"$f":"IFERROR(VLOOKUP($A8,[1]البيانات!$B$2:$L$350,11,FALSE),\"\")","v":""}]
["AB 100*56*75",{"$f":"IFERROR(VLOOKUP($A9,[1]البيانات!$B$2:$L$350,11,FALSE),\"\")","v":""}]
["AW 25*33*75",{"$f":"IFERROR(VLOOKUP($A10,[1]البيانات!$B$2:$L$350,11,FALSE),\"\")","v":""}]
["AW 20*33*75",{"$f":"IFERROR(VLOOKUP($A11,[1]البيانات!$B$2:$L$350,11,FALSE),\"\")","v":""}]
["ASB 100*56*75",{"$f":"IFERROR(VLOOKUP($A12,[1]البيانات!$B$2:$L$350,11,FALSE),\"\")","v":""}]
["AW 90*33*75",{"$f":"IFERROR(VLOOKUP($A13,[1]البيانات!$B$2:$L$350,11,FALSE),\"\")","v":""}]
["AW 40*33*75",{"$f":"IFERROR(VLOOKUP($A14,[1]البيانات!$B$2:$L$350,11,FALSE),\"\")","v":""}]
["AB 1*10*16",{"$f":"IFERROR(VLOOKUP($A15,[1]البيانات!$B$2:$L$350,11,FALSE),\"\")","v":13.9375}]
[null,{"$f":"IFERROR(VLOOKUP($A16,[1]البيانات!$B$2:$L$350,11,FALSE),\"\")","v":""}]
[null,{"$f":"IFERROR(VLOOKUP($A17,[1]البيانات!$B$2:$L$350,11,FALSE),\"\")","v":""}]
[null,{"$f":"IFERROR(VLOOKUP($A18,[1]البيانات!$B$2:$L$350,11,FALSE),\"\")","v":""}]
[null,{"$f":"IFERROR(VLOOKUP($A19,[1]البيانات!$B$2:$L$350,11,FALSE),\"\")","v":""}]
[null,{"$f":"IFERROR(VLOOKUP($A20,[1]البيانات!$B$2:$L$350,11,FALSE),\"\")","v":""}]
[null,{"$f":"IFERROR(VLOOKUP($A21,[1]البيانات!$B$2:$L$350,11,FALSE),\"\")","v":""}]
[null,{"$f":"IFERROR(VLOOKUP($A22,[1]البيانات!$B$2:$L$350,11,FALSE),\"\")","v":""}]
[null,{"$f":"IFERROR(VLOOKUP($A23,[1]البيانات!$B$2:$L$350,11,FALSE),\"\")","v":""}]
[null,{"$f":"IFERROR(VLOOKUP($A24,[1]البيانات!$B$2:$L$350,11,FALSE),\"\")","v":""}]
[null,{"$f":"IFERROR(VLOOKUP($A25,[1]البيانات!$B$2:$L$350,11,FALSE),\"\")","v":""}]
[null,{"$f":"IFERROR(VLOOKUP($A26,[1]البيانات!$B$2:$L$350,11,FALSE),\"\")","v":""}]
[null,{"$f":"IFERROR(VLOOKUP($A27,[1]البيانات!$B$2:$L$350,11,FALSE),\"\")","v":""}]
[null,{"$f":"IFERROR(VLOOKUP($A28,[1]البيانات!$B$2:$L$350,11,FALSE),\"\")","v":""}]
[null,{"$f":"IFERROR(VLOOKUP($A29,[1]البيانات!$B$2:$L$350,11,FALSE),\"\")","v":""}]
[null,{"$f":"IFERROR(VLOOKUP($A30,[1]البيانات!$B$2:$L$350,11,FALSE),\"\")","v":""}]
[null,{"$f":"IFERROR(VLOOKUP($A31,[1]البيانات!$B$2:$L$350,11,FALSE),\"\")","v":""}]
[null,{"$f":"IFERROR(VLOOKUP($A32,[1]البيانات!$B$2:$L$350,11,FALSE),\"\")","v":""}]
[null,{"$f":"IFERROR(VLOOKUP($A33,[1]البيانات!$B$2:$L$350,11,FALSE),\"\")","v":""}]
[null,{"$f":"IFERROR(VLOOKUP($A34,[1]البيانات!$B$2:$L$350,11,FALSE),\"\")","v":""}]
[null,{"$f":"IFERROR(VLOOKUP($A35,[1]البيانات!$B$2:$L$350,11,FALSE),\"\")","v":""}]
[null,{"$f":"IFERROR(VLOOKUP($A36,[1]البيانات!$B$2:$L$350,11,FALSE),\"\")","v":""}]
[null,{"$f":"IFERROR(VLOOKUP($A37,[1]البيانات!$B$2:$L$350,11,FALSE),\"\")","v":""}]
[null,{"$f":"IFERROR(VLOOKUP($A38,[1]البيانات!$B$2:$L$350,11,FALSE),\"\")","v":""}]
[null,{"$f":"IFERROR(VLOOKUP($A39,[1]البيانات!$B$2:$L$350,11,FALSE),\"\")","v":""}]
[null,{"$f":"IFERROR(VLOOKUP($A40,[1]البيانات!$B$2:$L$350,11,FALSE),\"\")","v":""}]
[null,{"$f":"IFERROR(VLOOKUP($A41,[1]البيانات!$B$2:$L$350,11,FALSE),\"\")","v":""}]
[null,{"$f":"IFERROR(VLOOKUP($A42,[1]البيانات!$B$2:$L$350,11,FALSE),\"\")","v":""}]
[null,{"$f":"IFERROR(VLOOKUP($A43,[1]البيانات!$B$2:$L$350,11,FALSE),\"\")","v":""}]
[null,{"$f":"IFERROR(VLOOKUP($A44,[1]البيانات!$B$2:$L$350,11,FALSE),\"\")","v":""}]
[null,{"$f":"IFERROR(VLOOKUP($A45,[1]البيانات!$B$2:$L$350,11,FALSE),\"\")","v":""}]
[null,{"$f":"IFERROR(VLOOKUP($A46,[1]البيانات!$B$2:$L$350,11,FALSE),\"\")","v":""}]
[null,{"$f":"IFERROR(VLOOKUP($A47,[1]البيانات!$B$2:$L$350,11,FALSE),\"\")","v":""}]
[null,{"$f":"IFERROR(VLOOKUP($A48,[1]البيانات!$B$2:$L$350,11,FALSE),\"\")","v":""}]
[null,{"$f":"IFERROR(VLOOKUP($A49,[1]البيانات!$B$2:$L$350,11,FALSE),\"\")","v":""}]
[null,{"$f":"IFERROR(VLOOKUP($A50,[1]البيانات!$B$2:$L$350,11,FALSE),\"\")","v":""}]
[null,{"$f":"IFERROR(VLOOKUP($A51,[1]البيانات!$B$2:$L$350,11,FALSE),\"\")","v":""}]
[null,{"$f":"IFERROR(VLOOKUP($A52,[1]البيانات!$B$2:$L$350,11,FALSE),\"\")","v":""}]
[null,{"$f":"IFERROR(VLOOKUP($A53,[1]البيانات!$B$2:$L$350,11,FALSE),\"\")","v":""}]
[null,{"$f":"IFERROR(VLOOKUP($A54,[1]البيانات!$B$2:$L$350,11,FALSE),\"\")","v":""}]
[null,{"$f":"IFERROR(VLOOKUP($A55,[1]البيانات!$B$2:$L$350,11,FALSE),\"\")","v":""}]
[null,{"$f":"IFERROR(VLOOKUP($A56,[1]البيانات!$B$2:$L$350,11,FALSE),\"\")","v":""}]
[null,{"$f":"IFERROR(VLOOKUP($A57,[1]البيانات!$B$2:$L$350,11,FALSE),\"\")","v":""}]
[null,{"$f":"IFERROR(VLOOKUP($A58,[1]البيانات!$B$2:$L$350,11,FALSE),\"\")","v":""}]
[null,{"$f":"IFERROR(VLOOKUP($A59,[1]البيانات!$B$2:$L$350,11,FALSE),\"\")","v":""}]
[null,{"$f":"IFERROR(VLOOKUP($A60,[1]البيانات!$B$2:$L$350,11,FALSE),\"\")","v":""}]
[null,{"$f":"IFERROR(VLOOKUP($A61,[1]البيانات!$B$2:$L$350,11,FALSE),\"\")","v":""}]
[null,{"$f":"IFERROR(VLOOKUP($A62,[1]البيانات!$B$2:$L$350,11,FALSE),\"\")","v":""}]
[null,{"$f":"IFERROR(VLOOKUP($A63,[1]البيانات!$B$2:$L$350,11,FALSE),\"\")","v":""}]
[null,{"$f":"IFERROR(VLOOKUP($A64,[1]البيانات!$B$2:$L$350,11,FALSE),\"\")","v":""}]
[null,{"$f":"IFERROR(VLOOKUP($A65,[1]البيانات!$B$2:$L$350,11,FALSE),\"\")","v":""}]
[null,{"$f":"IFERROR(VLOOKUP($A66,[1]البيانات!$B$2:$L$350,11,FALSE),\"\")","v":""}]
[null,{"$f":"IFERROR(VLOOKUP($A67,[1]البيانات!$B$2:$L$350,11,FALSE),\"\")","v":""}]
[null,{"$f":"IFERROR(VLOOKUP($A68,[1]البيانات!$B$2:$L$350,11,FALSE),\"\")","v":""}]
[null,{"$f":"IFERROR(VLOOKUP($A69,[1]البيانات!$B$2:$L$350,11,FALSE),\"\")","v":""}]
[null,{"$f":"IFERROR(VLOOKUP($A70,[1]البيانات!$B$2:$L$350,11,FALSE),\"\")","v":""}]
[null,{"$f":"IFERROR(VLOOKUP($A71,[1]البيانات!$B$2:$L$350,11,FALSE),\"\")","v":""}]
[null,{"$f":"IFERROR(VLOOKUP($A72,[1]البيانات!$B$2:$L$350,11,FALSE),\"\")","v":""}]
[null,{"$f":"IFERROR(VLOOKUP($A73,[1]البيانات!$B$2:$L$350,11,FALSE),\"\")","v":""}]
[null,{"$f":"IFERROR(VLOOKUP($A74,[1]البيانات!$B$2:$L$350,11,FALSE),\"\")","v":""}]
[null,{"$f":"IFERROR(VLOOKUP($A75,[1]البيانات!$B$2:$L$350,11,FALSE),\"\")","v":""}]
[null,{"$f":"IFERROR(VLOOKUP($A76,[1]البيانات!$B$2:$L$350,11,FALSE),\"\")","v":""}]
[null,{"$f":"IFERROR(VLOOKUP($A77,[1]البيانات!$B$2:$L$350,11,FALSE),\"\")","v":""}]
[null,{"$f":"IFERROR(VLOOKUP($A78,[1]البيانات!$B$2:$L$350,11,FALSE),\"\")","v":""}]
[null,{"$f":"IFERROR(VLOOKUP($A79,[1]البيانات!$B$2:$L$350,11,FALSE),\"\")","v":""}]
[null,{"$f":"IFERROR(VLOOKUP($A80,[1]البيانات!$B$2:$L$350,11,FALSE),\"\")","v":""}]
{"$rows_left_out":2232}
{"sheet":"البيانات","index":1,"n_rows":443,"n_cols":21,"rows_kept":443,"cut":false,"hidden":false,"merged":[]}
["ت","قياس الكابينة","MDFنوع الخشب"," شريط PVC","ظهر( طبقة الفايبر)","مسند بلاستك","سعر MDF","سعر PVC","سعر الظهر","سعر المسند","مواد تشغيل ","الأجمالي",null,null,"السعر ","المبلغ ",null,null,null,null,{"$f":"INDEX(MyFindData,SMALL(IF(ISNUMBER(SEARCH(FindText,MyFindData)),ROW(MyFindData),\"\"),ROW())-ROW(INDEX(MyFindData,1,1))+1)","v":"AB 1*10*10"}]
[1,"AB 1*10*10",23,25.6,45,4,{"$f":"IF(C2=\"\",\"\",VLOOKUP($G$1,$O$1:$P$6,2,0)*C2)","v":170.20000000000002},{"$f":"IF(D2=\"\",\"\",VLOOKUP($H$1,$O$1:$P$6,2,0)*D2)","v":3.5840000000000005},{"$f":"IF(E2=\"\",\"\",VLOOKUP($I$1,$O$1:$P$6,2,0)*E2)","v":160.65},{"$f":"IF(F2=\"\",\"\",VLOOKUP($J$1,$O$1:$P$6,2,0)*F2)","v":0.6},null,{"$f":"SUM(G2:K2)","v":335.03400000000005},null,null,"سعر MDF",7.4,null,null,null,null,"AB 1*10*11"]
[2,"AB 1*10*11","1.99",13.92,0.56999999999999995,7,{"$f":"IF(C3=\"\",\"\",VLOOKUP($G$1,$O$1:$P$6,2,0)*C3)","v":14.726000000000001},{"$f":"IF(D3=\"\",\"\",VLOOKUP($H$1,$O$1:$P$6,2,0)*D3)","v":1.9488000000000001},{"$f":"IF(E3=\"\",\"\",VLOOKUP($I$1,$O$1:$P$6,2,0)*E3)","v":2.0348999999999999},{"$f":"IF(F3=\"\",\"\",VLOOKUP($J$1,$O$1:$P$6,2,0)*F3)","v":1.05},null,{"$f":"SUM(G3:K3)","v":19.759700000000002},null,null,"سعر PVC",0.14000000000000001,null,null,null,null,"AB 1*10*12"]
[3,"AB 1*10*12","1.85",13.12,0.5,6,13.690000000000001,1.8368,1.7849999999999999,0.89999999999999991,null,18.2118,null,null,"سعر الظهر",3.57,null,null,null,null,"AB 1*10*13"]
[4,"AB 1*10*13","1.85",13.12,0.5,4,13.690000000000001,1.8368,1.7849999999999999,0.6,null,17.911800000000003,null,null,"سعر المسند",0.15,null,null,null,null,"AB 1*10*14"]
[5,"AB 1*10*14","1.72",12.32,0.44,4,12.728,1.7248000000000001,1.5708,0.6,null,16.6236,null,null,"مواد تشغيل ",0,null,null,null,null,"AB 1*10*15"]
[6,"AB 1*10*15","1.59",11.52,0.37,7,{"$f":"IF(C7=\"\",\"\",VLOOKUP($G$1,$O$1:$P$6,2,0)*C7)","v":11.766000000000002},1.6128,1.3209,1.05,null,15.749700000000002,null,null,null,null,null,null,null,null,"AB 1*10*16"]
[7,"AB 1*10*16","1.45",10.72,0.31,4,{"$f":"IF(C8=\"\",\"\",VLOOKUP($G$1,$O$1:$P$6,2,0)*C8)","v":10.73},1.5008000000000001,1.1067,0.6,null,13.9375,null,null,null,null,null,null,null,null,{"$error":"#NUM!"}]
[null,null,null,null,null,null,null,null,null,null,null,null,null,null,null,null,null,null,null,null,{"$error":"#NUM!"}]
[null,null,null,null,null,null,null,null,null,null,null,null,null,null,null,null,null,null,null,null,{"$error":"#NUM!"}]
[null,null,null,null,null,null,null,null,null,null,null,null,null,null,null,null,null,null,null,null,{"$error":"#NUM!"}]
[null,null,null,null,null,null,null,null,null,null,null,null,null,null,null,null,null,null,null,null,{"$error":"#NUM!"}]
[null,null,null,null,null,null,null,null,null,null,null,null,null,null,null,null,null,null,null,null,{"$error":"#NUM!"}]
[null,null,null,null,null,null,null,null,null,null,null,null,null,null,null,null,null,null,null,null,{"$error":"#NUM!"}]
[null,null,null,null,null,null,null,null,null,null,null,null,null,null,null,null,null,null,null,null,{"$error":"#NUM!"}]
[null,null,null,null,null,null,null,null,null,null,null,null,null,null,null,null,null,null,null,null,{"$error":"#NUM!"}]
[null,null,null,null,null,null,null,null,null,null,null,null,null,null,null,null,null,null,null,null,{"$error":"#NUM!"}]
[null,null,null,null,null,null,null,null,null,null,null,null,null,null,null,null,null,null,null,null,{"$error":"#NUM!"}]
[null,null,null,null,null,null,null,null,null,null,null,null,null,null,null,null,null,null,null,null,{"$error":"#NUM!"}]
[null,null,null,null,null,null,null,null,null,null,null,null,null,null,null,null,null,null,null,null,{"$error":"#NUM!"}]
[null,null,null,null,null,null,null,null,null,null,null,null,null,null,null,null,null,null,null,null,{"$error":"#NUM!"}]
[null,null,null,null,null,null,null,null,null,null,null,null,null,null,null,null,null,null,null,null,{"$error":"#NUM!"}]
[null,null,null,null,null,null,null,null,null,null,null,null,null,null,null,null,null,null,null,null,{"$error":"#NUM!"}]
[null,null,null,null,null,null,null,null,null,null,null,null,null,null,null,null,null,null,null,null,{"$error":"#NUM!"}]
[null,null,null,null,null,null,null,null,null,null,null,null,null,null,null,null,null,null,null,null,{"$error":"#NUM!"}]
[null,null,null,null,null,null,null,null,null,null,null,null,null,null,null,null,null,null,null,null,{"$error":"#NUM!"}]
[null,null,null,null,null,null,null,null,null,null,null,null,null,null,null,null,null,null,null,null,{"$error":"#NUM!"}]
[null,null,null,null,null,null,null,null,null,null,null,null,null,null,null,null,null,null,null,null,{"$error":"#NUM!"}]
[null,null,null,null,null,null,null,null,null,null,null,null,null,null,null,null,null,null,null,null,{"$error":"#NUM!"}]
[null,null,null,null,null,null,null,null,null,null,null,null,null,null,null,null,null,null,null,null,{"$error":"#NUM!"}]
[null,null,null,null,null,null,null,null,null,null,null,null,null,null,null,null,null,null,null,null,{"$error":"#NUM!"}]
[null,null,null,null,null,null,null,null,null,null,null,null,null,null,null,null,null,null,null,null,{"$error":"#NUM!"}]
[null,null,null,null,null,null,null,null,null,null,null,null,null,null,null,null,null,null,null,null,{"$error":"#NUM!"}]
[null,null,null,null,null,null,null,null,null,null,null,null,null,null,null,null,null,null,null,null,{"$error":"#NUM!"}]
[null,null,null,null,null,null,null,null,null,null,null,null,null,null,null,null,null,null,null,null,{"$error":"#NUM!"}]
[null,null,null,null,null,null,null,null,null,null,null,null,null,null,null,null,null,null,null,null,{"$error":"#NUM!"}]
[null,null,null,null,null,null,null,null,null,null,null,null,null,null,null,null,null,null,null,null,{"$error":"#NUM!"}]
[null,null,null,null,null,null,null,null,null,null,null,null,null,null,null,null,null,null,null,null,{"$error":"#NUM!"}]
[null,null,null,null,null,null,null,null,null,null,null,null,null,null,null,null,null,null,null,null,{"$error":"#NUM!"}]
[null,null,null,null,null,null,null,null,null,null,null,null,null,null,null,null,null,null,null,null,{"$error":"#NUM!"}]
[null,null,null,null,null,null,null,null,null,null,null,null,null,null,null,null,null,null,null,null,{"$error":"#NUM!"}]
[null,null,null,null,null,null,null,null,null,null,null,null,null,null,null,null,null,null,null,null,{"$error":"#NUM!"}]
[null,null,null,null,null,null,null,null,null,null,null,null,null,null,null,null,null,null,null,null,{"$error":"#NUM!"}]
[null,null,null,null,null,null,null,null,null,null,null,null,null,null,null,null,null,null,null,null,{"$error":"#NUM!"}]
[null,null,null,null,null,null,null,null,null,null,null,null,null,null,null,null,null,null,null,null,{"$error":"#NUM!"}]
[null,null,null,null,null,null,null,null,null,null,null,null,null,null,null,null,null,null,null,null,{"$error":"#NUM!"}]
[null,null,null,null,null,null,null,null,null,null,null,null,null,null,null,null,null,null,null,null,{"$error":"#NUM!"}]
[null,null,null,null,null,null,null,null,null,null,null,null,null,null,null,null,null,null,null,null,{"$error":"#NUM!"}]
[null,null,null,null,null,null,null,null,null,null,null,null,null,null,null,null,null,null,null,null,{"$error":"#NUM!"}]
[null,null,null,null,null,null,null,null,null,null,null,null,null,null,null,null,null,null,null,null,{"$error":"#NUM!"}]
[null,null,null,null,null,null,null,null,null,null,null,null,null,null,null,null,null,null,null,null,{"$error":"#NUM!"}]
[null,null,null,null,null,null,null,null,null,null,null,null,null,null,null,null,null,null,null,null,{"$error":"#NUM!"}]
[null,null,null,null,null,null,null,null,null,null,null,null,null,null,null,null,null,null,null,null,{"$error":"#NUM!"}]
[null,null,null,null,null,null,null,null,null,null,null,null,null,null,null,null,null,null,null,null,{"$error":"#NUM!"}]
[null,null,null,null,null,null,null,null,null,null,null,null,null,null,null,null,null,null,null,null,{"$error":"#NUM!"}]
[null,null,null,null,null,null,null,null,null,null,null,null,null,null,null,null,null,null,null,null,{"$error":"#NUM!"}]
[null,null,null,null,null,null,null,null,null,null,null,null,null,null,null,null,null,null,null,null,{"$error":"#NUM!"}]
[null,null,null,null,null,null,null,null,null,null,null,null,null,null,null,null,null,null,null,null,{"$error":"#NUM!"}]
[null,null,null,null,null,null,null,null,null,null,null,null,null,null,null,null,null,null,null,null,{"$error":"#NUM!"}]
[null,null,null,null,null,null,null,null,null,null,null,null,null,null,null,null,null,null,null,null,{"$error":"#NUM!"}]
[null,null,null,null,null,null,null,null,null,null,null,null,null,null,null,null,null,null,null,null,{"$error":"#NUM!"}]
[null,null,null,null,null,null,null,null,null,null,null,null,null,null,null,null,null,null,null,null,{"$error":"#NUM!"}]
[null,null,null,null,null,null,null,null,null,null,null,null,null,null,null,null,null,null,null,null,{"$error":"#NUM!"}]
[null,null,null,null,null,null,null,null,null,null,null,null,null,null,null,null,null,null,null,null,{"$error":"#NUM!"}]
[null,null,null,null,null,null,null,null,null,null,null,null,null,null,null,null,null,null,null,null,{"$error":"#NUM!"}]
[null,null,null,null,null,null,null,null,null,null,null,null,null,null,null,null,null,null,null,null,{"$error":"#NUM!"}]
[null,null,null,null,null,null,null,null,null,null,null,null,null,null,null,null,null,null,null,null,{"$error":"#NUM!"}]
[null,null,null,null,null,null,null,null,null,null,null,null,null,null,null,null,null,null,null,null,{"$error":"#NUM!"}]
[null,null,null,null,null,null,null,null,null,null,null,null,null,null,null,null,null,null,null,null,{"$error":"#NUM!"}]
[null,null,null,null,null,null,null,null,null,null,null,null,null,null,null,null,null,null,null,null,{"$error":"#NUM!"}]
[null,null,null,null,null,null,null,null,null,null,null,null,null,null,null,null,null,null,null,null,{"$error":"#NUM!"}]
[null,null,null,null,null,null,null,null,null,null,null,null,null,null,null,null,null,null,null,null,{"$error":"#NUM!"}]
[null,null,null,null,null,null,null,null,null,null,null,null,null,null,null,null,null,null,null,null,{"$error":"#NUM!"}]
[null,null,null,null,null,null,null,null,null,null,null,null,null,null,null,null,null,null,null,null,{"$error":"#NUM!"}]
[null,null,null,null,null,null,null,null,null,null,null,null,null,null,null,null,null,null,null,null,{"$error":"#NUM!"}]
[null,null,null,null,null,null,null,null,null,null,null,null,null,null,null,null,null,null,null,null,{"$error":"#NUM!"}]
[null,null,null,null,null,null,null,null,null,null,null,null,null,null,null,null,null,null,null,null,{"$error":"#NUM!"}]
[null,null,null,null,null,null,null,null,null,null,null,null,null,null,null,null,null,null,null,null,{"$error":"#NUM!"}]
[null,null,null,null,null,null,null,null,null,null,null,null,null,null,null,null,null,null,null,null,{"$error":"#NUM!"}]
[null,null,null,null,null,null,null,null,null,null,null,null,null,null,null,null,null,null,null,null,{"$error":"#NUM!"}]
{"$rows_left_out":363}