{"text_format":"1","workbook":"xlsx","n_sheets":2,"sheets":["شيت الرابع","شهادات الأوائل"],"not_rendered":{"charts":0,"images":3,"macros":1,"external_links":1,"defined_names":4,"comments":0,"pivot_tables":0},"unopened":[],"bounds":{"document_bytes":16777216,"sheet_cells":100000,"rows_first":2000,"rows_last":500,"rows_between":2000,"halvings":0,"cell_chars":16384,"cell_head_chars":4096},"cells_cut":0,"cells_raw":0,"read":"whole","date_system":"1900"}

{"sheet":"شيت الرابع","index":0,"n_rows":628,"n_cols":49,"rows_kept":628,"cut":false,"hidden":false,"merged":[[0,4,1,6],[8,29,8,30],[4,4,5,6],[2,4,3,6],[7,36,7,41],[7,42,10,42],[8,47,9,47],[7,43,7,48],[8,33,9,33],[7,2,10,2],[7,3,10,3],[7,8,10,8],[7,7,10,7],[7,6,10,6],[10,12,10,14],[7,12,9,14],[7,35,10,35],[8,45,8,46],[8,43,8,44],[8,31,8,32],[7,28,10,28],[7,0,10,0],[7,1,10,1],[8,27,9,27],[8,24,8,25],[8,22,8,23],[7,22,7,27],[7,5,10,5],[8,19,9,19],[8,26,9,26],[7,4,10,4],[7,21,10,21],[3,8,5,8],[0,13,0,14],[1,10,6,11],[0,22,0,26],[1,14,6,14],[0,15,0,19],[1,15,1,16],[0,8,2,8],[1,25,1,26],[1,22,1,23],[119,43,119,48],[1,18,1,19],[7,15,7,20],[8,17,8,18],[8,15,8,16],[8,20,9,20],[1,46,1,47],[1,29,1,30],[1,32,1,33],[1,43,1,44],[8,38,8,39],[8,40,9,40],[8,36,8,37],[8,41,9,41],[8,48,9,48],[8,34,9,34],[7,29,7,34],[119,15,119,20],[119,22,119,27],[119,29,119,34],[119,36,119,41],[0,29,0,33],[1,36,1,37],[1,39,1,40],[0,36,0,40],[0,43,0,47]]}
["غ",null,null,null,{"$f":"TEXT(E3,\"dddd\")","v":"Sunday"},null,null,null,null,"عدد التلاميذ",null,null,null,"منقطعين",null,"لغة عربية",null,null,null,null,null,null,"رياضيات",null,null,null,null,null,null,"لغة إنجليزية",null,null,null,null,null,null,"دراسات",null,null,null,null,null,null,"علوم"]
[null,null,null,null,null,null,null,null,null,null,{"$f":"COUNT(G12:G118)","v":107},null,null,null,{"$f":"COUNTIF(#REF!,\"غ\")","v":{"$error":"#REF!"}},"نصف العام",null,null,"آخر العام",null,null,null,"نصف العام",null,null,"آخر العام",null,null,null,"نصف العام",null,null,"آخر العام",null,null,null,"نصف العام",null,null,"آخر العام",null,null,null,"نصف العام",null,null,"آخر العام"]
[null,null,null,1,{"$f":"TODAY()","v":"2018-04-08"},null,null,"دمج ( 2 )",null,null,null,null,null,null,null,"ناجح",{"$f":"Q5-Q4","v":95},null,"ناجح",{"$f":"T5-T4","v":95},"دون المستوى",null,"ناجح",{"$f":"X5-X4","v":88},null,"ناجح",{"$f":"AA5-AA4","v":101},"دون المستوى",null,"ناجح",{"$f":"AE5-AE4","v":97},null,"ناجح",{"$f":"AH5-AH4","v":103},"دون المستوى",null,"ناجح",{"$f":"AL5-AL4","v":98},null,"ناجح",{"$f":"AO5-AO4","v":102},"دون المستوى",null,"ناجح",{"$f":"AS5-AS4","v":105},null,"ناجح",{"$f":"AV5-AV4","v":106},"دون المستوى"]
[null,null,null,null,null,null,null,null,"بداية رقم الجلوس",null,null,null,null,null,null,"راسب",{"$f":"SUMPRODUCT(--(Q12:Q118<20)+(Q12:Q118=\"غ\"))","v":12},null,"راسب",{"$f":"SUMPRODUCT(--(S12:S118<20)+(S12:S118=\"غ\"))","v":12},{"$f":"COUNTIF(V12:V118,\"دون المستوى\")","v":7},null,"راسب",{"$f":"SUMPRODUCT(--(X12:X118<20)+(X12:X118=\"غ\"))","v":19},null,"راسب",{"$f":"SUMPRODUCT(--(Z12:Z118<20)+(Z12:Z118=\"غ\"))","v":6},{"$f":"COUNTIF(AC12:AC118,\"دون المستوى\")","v":2},null,"راسب",{"$f":"SUMPRODUCT(--(AE12:AE118<20)+(AE12:AE118=\"غ\"))","v":10},null,"راسب",{"$f":"SUMPRODUCT(--(AG12:AG118<20)+(AG12:AG118=\"غ\"))","v":4},{"$f":"COUNTIF(AJ12:AJ118,\"دون المستوى\")","v":4},null,"راسب",{"$f":"SUMPRODUCT(--(AL12:AL118<20)+(AL12:AL118=\"غ\"))","v":9},null,"راسب",{"$f":"SUMPRODUCT(--(AN12:AN118<20)+(AN12:AN118=\"غ\"))","v":5},{"$f":"COUNTIF(AQ12:AQ118,\"دون المستوى\")","v":4},null,"راسب",{"$f":"SUMPRODUCT(--(AS12:AS118<20)+(AS12:AS118=\"غ\"))","v":2},null,"راسب",{"$f":"SUMPRODUCT(--(AU12:AU118<20)+(AU12:AU118=\"غ\"))","v":1},{"$f":"COUNTIF(#REF!,\"دون المستوى\")","v":{"$error":"#REF!"}}]
[null,null,null,null,{"$f":"TODAY()","v":"2018-04-08"},null,null,null,null,null,null,null,null,null,null,"حاضر",{"$f":"$K$2-Q6","v":107},null,"حاضر",{"$f":"$K$2-T6","v":107},null,null,"حاضر",{"$f":"$K$2-X6","v":107},null,"حاضر",{"$f":"$K$2-AA6","v":107},null,null,"حاضر",{"$f":"$K$2-AE6","v":107},null,"حاضر",{"$f":"$K$2-AH6","v":107},null,null,"حاضر",{"$f":"$K$2-AL6","v":107},null,"حاضر",{"$f":"$K$2-AO6","v":107},null,null,"حاضر",{"$f":"$K$2-AS6","v":107},null,"حاضر",{"$f":"$K$2-AV6","v":107}]
[null,null,null,null,null,null,null,null,null,null,null,null,null,null,null,"غياب",{"$f":"COUNTIF(Q12:Q118,\"غ\")","v":0},null,"غياب",{"$f":"COUNTIF(S12:S118,\"غ\")","v":0},null,null,"غياب",{"$f":"COUNTIF(X12:X118,\"غ\")","v":0},null,"غياب",{"$f":"COUNTIF(Z12:Z118,\"غ\")","v":0},null,null,"غياب",{"$f":"COUNTIF(AE12:AE118,\"غ\")","v":0},null,"غياب",{"$f":"COUNTIF(AG12:AG118,\"غ\")","v":0},null,null,"غياب",{"$f":"COUNTIF(AL12:AL118,\"غ\")","v":0},null,"غياب",{"$f":"COUNTIF(AN12:AN118,\"غ\")","v":0},null,null,"غياب",{"$f":"COUNTIF(AS12:AS118,\"غ\")","v":0},null,"غياب",{"$f":"COUNTIF(AU12:AU118,\"غ\")","v":0}]
[null,null,null,null,null,null,null,null,1,null,null,null,null,null,null,"النسبة ",{"$f":"Q3/Q5","v":0.88785046728971961},null,"النسبة ",{"$f":"T3/T5","v":0.88785046728971961},null,null,"النسبة ",{"$f":"X3/X5","v":0.82242990654205606},null,"النسبة ",{"$f":"AA3/AA5","v":0.94392523364485981},null,null,"النسبة ",{"$f":"AE3/AE5","v":0.90654205607476634},null,"النسبة ",{"$f":"AH3/AH5","v":0.96261682242990654},null,null,"النسبة ",{"$f":"AL3/AL5","v":0.91588785046728971},null,"النسبة ",{"$f":"AO3/AO5","v":0.95327102803738317},null,null,"النسبة ",{"$f":"AS3/AS5","v":0.98130841121495327},null,"النسبة ",{"$f":"AV3/AV5","v":0.99065420560747663}]
["الرقم القومى","تاريخ الميلاد","سرى ترم أول","سرى ترم ثان","الرقم السرى ترم ثان","الرقم السرى ترم  أول","م","إســــــــم التلميذ","رقم الجلوس","تاريخ الميلاد",null,null,"السن فى أول أكتوبر   ",null,null,"لغة عربية",null,null,null,null,null,"المستوى","رياضيات",null,null,null,null,null,"المستوى","لغة إنجليزية",null,null,null,null,null,"المستوى","دراسات",null,null,null,null,null,"المستوى","علوم"]
[null,null,null,null,null,null,null,null,null,null,null,null,null,null,null,"نصف العام",null,"آخر العام",null,"مجموع","الدرجة",null,"نصف العام",null,"آخر العام",null,"مجموع","الدرجة",null,"نصف العام",null,"آخر العام",null,"مجموع","الدرجة",null,"نصف العام",null,"آخر العام",null,"مجموع","الدرجة",null,"نصف العام",null,"آخر العام",null,"مجموع","الدرجة"]
[null,null,null,null,null,null,null,null,null,null,null,null,null,null,null,"تقويم شامل","إختبار","تقويم شامل","إختبار",null,null,null,"تقويم شامل","إختبار","تقويم شامل","إختبار",null,null,null,"تقويم شامل","إختبار","تقويم شامل","إختبار",null,null,null,"تقويم شامل","إختبار","تقويم شامل","إختبار",null,null,null,"تقويم شامل","إختبار","تقويم شامل","إختبار"]
[null,null,null,null,null,null,null,null,null,"يوم","شهر","سنة","2016-10-01",null,null,60,40,60,40,{"$f":"P11+Q11+R11+S11","v":200},100,null,60,40,60,40,{"$f":"W11+X11+Y11+Z11","v":200},80,null,60,40,60,40,{"$f":"AD11+AE11+AF11+AG11","v":200},40,null,60,40,60,40,{"$f":"AK11+AL11+AM11+AN11","v":200},40,null,60,40,60,"32+8",200,40]
[30701231701276,{"$f":"TEXT(LEFT(A12,7)+17000000,\"####-##-##\")+0","v":"2007-01-23"},null,null,201,70,{"$f":"IF(H12=\"\",\"\",SUBTOTAL(3,$H$12:H12))","v":1},"ابراهيم موسى ابراهيم موسي المرادى",{"$f":"IF(OR($I$7=0,$H12=\"\"),\"\",$I$7)","v":1},{"$f":"DAY(B12)","v":23},{"$f":"MONTH(B12)","v":1},{"$f":"YEAR(B12)","v":2007},{"$f":"DATEDIF(DATE(L12,K12,J12),$M$11,\"md\")","v":8},{"$f":"DATEDIF(DATE(L12,K12,J12),$M$11,\"ym\")","v":8},{"$f":"DATEDIF(DATE(L12,K12,J12),$M$11,\"y\")","v":9},52,33,52,29,{"$f":"IF(AND(P12=\"غ\",Q12=\"غ\",R12=\"غ\",S12=\"غ\"),\"غ\",SUM(P12:S12))","v":166},{"$f":"IF(T12=\"غ\",\"غ\",T12*100/200)","v":83},{"$f":"IF(OR(U12=\"\",S12=\"\"),\"\",IF(OR(S12<12,S12=\"غ\",U12=\"غ\"),\"دون المستوى\",IF(U12>=85,\"ممتاز\",IF(U12>=75,\"جيد جداً\",IF(U12>=65,\"جيد\",IF(U12>=50,\"مقبول\",IF(OR(U12<50,U12=\"غ\"),\"دون المستوى\")))))))","v":"جيد جداً"},53,22,53,34,{"$f":"IF(AND(W12=\"غ\",X12=\"غ\",Y12=\"غ\",Z12=\"غ\"),\"غ\",SUM(W12:Z12))","v":162},{"$f":"IF(AA12=\"غ\",\"غ\",AA12*80/200)","v":64.8},{"$f":"IF(OR(AB12=\"\",Z12=\"\"),\"\",IF(OR(Z12<12,Z12=\"غ\",AB12=\"غ\"),\"دون المستوى\",IF(AB12>=68,\"ممتاز\",IF(AB12>=60,\"جيد جداً\",IF(AB12>=52,\"جيد\",IF(AB12>=40,\"مقبول\",IF(OR(AB12<40,AB12=\"غ\"),\"دون المستوى\")))))))","v":"جيد جداً"},59,36,58,38,{"$f":"IF(AND(AD12=\"غ\",AE12=\"غ\",AF12=\"غ\",AG12=\"غ\"),\"غ\",SUM(AD12:AG12))","v":191},{"$f":"IF(AH12=\"غ\",\"غ\",AH12*40/200)","v":38.200000000000003},{"$f":"IF(OR(AI12=\"\",AG12=\"\"),\"\",IF(OR(AG12<12,AG12=\"غ\",AI12=\"غ\"),\"دون المستوى\",IF(AI12>=34,\"ممتاز\",IF(AI12>=30,\"جيد جداً\",IF(AI12>=26,\"جيد\",IF(AI12>=20,\"مقبول\",IF(OR(AI12<20,AI12=\"غ\"),\"دون المستوى\")))))))","v":"ممتاز"},55,40,55,38,{"$f":"IF(AND(AK12=\"غ\",AL12=\"غ\",AM12=\"غ\",AN12=\"غ\"),\"غ\",SUM(AK12:AN12))","v":188},{"$f":"IF(AO12=\"غ\",\"غ\",AO12*40/200)","v":37.6},{"$f":"IF(OR(AP12=\"\",AN12=\"\"),\"\",IF(OR(AN12<12,AN12=\"غ\",AP12=\"غ\"),\"دون المستوى\",IF(AP12>=34,\"ممتاز\",IF(AP12>=30,\"جيد جداً\",IF(AP12>=26,\"جيد\",IF(AP12>=20,\"مقبول\",IF(OR(AP12<20,AP12=\"غ\"),\"دون المستوى\")))))))","v":"ممتاز"},56,35,55,40,{"$f":"IF(AND(AR12=\"غ\",AS12=\"غ\",AT12=\"غ\",AU12=\"غ\"),\"غ\",SUM(AR12:AU12))","v":186},{"$f":"IF(AV12=\"غ\",\"غ\",AV12*40/200)","v":37.200000000000003}]
[30707071704255,{"$f":"TEXT(LEFT(A13,7)+17000000,\"####-##-##\")+0","v":"2007-07-07"},null,null,202,71,{"$f":"IF(H13=\"\",\"\",SUBTOTAL(3,$H$12:H13))","v":2},"أحمد السيد عبد الوهاب محمد عرفه",{"$f":"IF(OR($I$7=0,$H13=\"\"),\"\",$I12+1)","v":2},7,7,2007,{"$f":"DATEDIF(DATE(L13,K13,J13),$M$11,\"md\")","v":24},{"$f":"DATEDIF(DATE(L13,K13,J13),$M$11,\"ym\")","v":2},{"$f":"DATEDIF(DATE(L13,K13,J13),$M$11,\"y\")","v":9},58,39,57,39,{"$f":"IF(AND(P13=\"غ\",Q13=\"غ\",R13=\"غ\",S13=\"غ\"),\"غ\",SUM(P13:S13))","v":193},{"$f":"IF(T13=\"غ\",\"غ\",T13*100/200)","v":96.5},{"$f":"IF(OR(U13=\"\",S13=\"\"),\"\",IF(OR(S13<12,S13=\"غ\",U13=\"غ\"),\"دون المستوى\",IF(U13>=85,\"ممتاز\",IF(U13>=75,\"جيد جداً\",IF(U13>=65,\"جيد\",IF(U13>=50,\"مقبول\",IF(OR(U13<50,U13=\"غ\"),\"دون المستوى\")))))))","v":"ممتاز"},56,32,57,37,{"$f":"IF(AND(W13=\"غ\",X13=\"غ\",Y13=\"غ\",Z13=\"غ\"),\"غ\",SUM(W13:Z13))","v":182},{"$f":"IF(AA13=\"غ\",\"غ\",AA13*80/200)","v":72.8},{"$f":"IF(OR(AB13=\"\",Z13=\"\"),\"\",IF(OR(Z13<12,Z13=\"غ\",AB13=\"غ\"),\"دون المستوى\",IF(AB13>=68,\"ممتاز\",IF(AB13>=60,\"جيد جداً\",IF(AB13>=52,\"جيد\",IF(AB13>=40,\"مقبول\",IF(OR(AB13<40,AB13=\"غ\"),\"دون المستوى\")))))))","v":"ممتاز"},57,37,60,38,{"$f":"IF(AND(AD13=\"غ\",AE13=\"غ\",AF13=\"غ\",AG13=\"غ\"),\"غ\",SUM(AD13:AG13))","v":192},{"$f":"IF(AH13=\"غ\",\"غ\",AH13*40/200)","v":38.4},{"$f":"IF(OR(AI13=\"\",AG13=\"\"),\"\",IF(OR(AG13<12,AG13=\"غ\",AI13=\"غ\"),\"دون المستوى\",IF(AI13>=34,\"ممتاز\",IF(AI13>=30,\"جيد جداً\",IF(AI13>=26,\"جيد\",IF(AI13>=20,\"مقبول\",IF(OR(AI13<20,AI13=\"غ\"),\"دون المستوى\")))))))","v":"ممتاز"},59,40,59,40,{"$f":"IF(AND(AK13=\"غ\",AL13=\"غ\",AM13=\"غ\",AN13=\"غ\"),\"غ\",SUM(AK13:AN13))","v":198},{"$f":"IF(AO13=\"غ\",\"غ\",AO13*40/200)","v":39.6},{"$f":"IF(OR(AP13=\"\",AN13=\"\"),\"\",IF(OR(AN13<12,AN13=\"غ\",AP13=\"غ\"),\"دون المستوى\",IF(AP13>=34,\"ممتاز\",IF(AP13>=30,\"جيد جداً\",IF(AP13>=26,\"جيد\",IF(AP13>=20,\"مقبول\",IF(OR(AP13<20,AP13=\"غ\"),\"دون المستوى\")))))))","v":"ممتاز"},56,35,57,40,{"$f":"IF(AND(AR13=\"غ\",AS13=\"غ\",AT13=\"غ\",AU13=\"غ\"),\"غ\",SUM(AR13:AU13))","v":188},{"$f":"IF(AV13=\"غ\",\"غ\",AV13*40/200)","v":37.6}]
[30710041700892,"2007-10-04",null,null,203,72,{"$f":"IF(H14=\"\",\"\",SUBTOTAL(3,$H$12:H14))","v":3},"أحمد ايهاب مسعد محمد سلطان",3,4,10,2007,27,11,8,48,11,51,29,{"$f":"IF(AND(P14=\"غ\",Q14=\"غ\",R14=\"غ\",S14=\"غ\"),\"غ\",SUM(P14:S14))","v":139},69.5,{"$f":"IF(OR(U14=\"\",S14=\"\"),\"\",IF(OR(S14<12,S14=\"غ\",U14=\"غ\"),\"دون المستوى\",IF(U14>=85,\"ممتاز\",IF(U14>=75,\"جيد جداً\",IF(U14>=65,\"جيد\",IF(U14>=50,\"مقبول\",IF(OR(U14<50,U14=\"غ\"),\"دون المستوى\")))))))","v":"جيد"},50,17,51,35,153,61.2,"جيد جداً",54,31,56,31,172,34.4,"ممتاز",50,16,53,34,153,{"$f":"IF(AO14=\"غ\",\"غ\",AO14*40/200)","v":30.6},"جيد جداً",53,29,53,38,173,34.6]
[30709131702934,"2007-09-13",null,null,204,73,{"$f":"IF(H15=\"\",\"\",SUBTOTAL(3,$H$12:H15))","v":4},"أحمد سامح إبراهيم مصيلحى",4,13,9,2007,18,0,9,44,1,50,14,{"$f":"IF(AND(P15=\"غ\",Q15=\"غ\",R15=\"غ\",S15=\"غ\"),\"غ\",SUM(P15:S15))","v":109},54.5,"مقبول",45,12,44,24,125,50,"مقبول",41,21,45,23,130,26,"جيد",38,26,42,30,136,27.2,"جيد",41,28,42,28,139,27.8]
[30704011705016,"2007-04-01",null,null,205,74,{"$f":"IF(H16=\"\",\"\",SUBTOTAL(3,$H$12:H16))","v":5},"أحمد عصام صبحي محمد المرادي",5,1,4,2007,0,6,9,49,26,48,18,{"$f":"IF(AND(P16=\"غ\",Q16=\"غ\",R16=\"غ\",S16=\"غ\"),\"غ\",SUM(P16:S16))","v":141},70.5,"جيد",44,17,48,24,133,53.2,"جيد",47,18,48,32,145,29,"جيد",37,25,47,38,147,29.4,"جيد",40,28,45,23,136,27.2]
[30606141702475,"2006-06-14",null,null,206,75,{"$f":"IF(H17=\"\",\"\",SUBTOTAL(3,$H$12:H17))","v":6},"أحمد محمد سعيد سيد المرادي",6,14,6,2006,17,3,10,33,20,32,2,{"$f":"IF(AND(P17=\"غ\",Q17=\"غ\",R17=\"غ\",S17=\"غ\"),\"غ\",SUM(P17:S17))","v":87},43.5,"دون المستوى",43,30,42,17,132,52.8,"جيد",36,20,37,23,116,23.2,"مقبول",30,11,48,2,91,18.2,"دون المستوى",39,24,44,20,127,25.4]
[30803171702054,"2008-03-17",null,null,207,76,{"$f":"IF(H18=\"\",\"\",SUBTOTAL(3,$H$12:H18))","v":7},"أحمد محمد منصور باز الشريف",7,17,3,2008,14,6,8,59,34,57,37,187,93.5,"ممتاز",53,34,53,37,177,70.8,"ممتاز",60,37,60,37,194,38.799999999999997,"ممتاز",59,38,55,40,192,38.4,"ممتاز",59,34,56,40,189,37.799999999999997]
[30704231400798,"2007-04-23",null,null,208,77,{"$f":"IF(H19=\"\",\"\",SUBTOTAL(3,$H$12:H19))","v":8},"أحمد هاني عبدالوهاب علي ابراهيم",8,23,4,2007,8,5,9,49,19,51,20,139,69.5,"جيد",47,11,56,35,149,59.6,"جيد",53,23,51,36,163,32.6,"جيد جداً",48,9,45,26,128,25.6,"مقبول",53,32,44,32,161,32.200000000000003]
[30708061703052,"2007-08-06",null,null,209,78,{"$f":"IF(H20=\"\",\"\",SUBTOTAL(3,$H$12:H20))","v":9},"احمد وجيه محمد الخضرى سيد احمد",9,6,8,2007,25,1,9,47,5,42,19,113,56.5,"مقبول",43,10,42,27,122,48.8,"مقبول",44,16,41,30,131,26.2,"جيد",46,5,44,12,107,21.4,"مقبول",38,27,44,22,131,26.2]
[30701111702392,"2007-01-11",null,null,210,79,{"$f":"IF(H21=\"\",\"\",SUBTOTAL(3,$H$12:H21))","v":10},"أحمد وليد رمضان عبد العال متولي",10,11,1,2007,20,8,9,55,33,57,33,178,89,"ممتاز",49,32,51,39,171,68.400000000000006,"ممتاز",59,38,60,40,197,39.4,"ممتاز",54,34,57,40,185,37,"ممتاز",54,32,55,40,181,36.200000000000003]
[30710281701977,"2007-10-28",null,null,211,80,{"$f":"IF(H22=\"\",\"\",SUBTOTAL(3,$H$12:H22))","v":11},"أكرم محمد محمود حسنين",11,28,10,2007,3,11,8,60,40,60,40,200,100,"ممتاز",53,36,55,39,183,73.2,"ممتاز",60,40,60,40,200,40,"ممتاز",58,40,56,40,194,38.799999999999997,"ممتاز",58,38,60,40,196,39.200000000000003]
[30712251701037,"2007-12-25",null,null,212,81,{"$f":"IF(H23=\"\",\"\",SUBTOTAL(3,$H$12:H23))","v":12},"السيد طارق سليمان شادي",12,25,12,2007,6,9,8,59,38,59,36,192,96,"ممتاز",55,31,53,40,179,71.599999999999994,"ممتاز",59,40,60,40,199,39.799999999999997,"ممتاز",59,40,59,40,198,39.6,"ممتاز",54,38,60,38,190,38]
[30708211701797,"2007-08-21",null,null,213,82,{"$f":"IF(H24=\"\",\"\",SUBTOTAL(3,$H$12:H24))","v":13},"امير مجدى ابراهيم الجزار",13,21,8,2007,10,1,9,57,40,60,40,197,98.5,"ممتاز",57,33,58,35,183,73.2,"ممتاز",58,40,59,39,196,39.200000000000003,"ممتاز",57,38,58,40,193,38.6,"ممتاز",59,40,58,40,197,39.4]
[30803211703555,"2008-03-21",null,null,214,83,{"$f":"IF(H25=\"\",\"\",SUBTOTAL(3,$H$12:H25))","v":14},"أنس إبراهيم محمد الحاج موسى",14,21,3,2008,10,6,8,59,38,59,40,196,98,"ممتاز",51,29,56,39,175,70,"ممتاز",58,40,60,40,198,39.6,"ممتاز",54,38,57,40,189,37.799999999999997,"ممتاز",55,37,59,40,191,38.200000000000003]
[30708211701754,"2007-08-21",null,null,215,84,{"$f":"IF(H26=\"\",\"\",SUBTOTAL(3,$H$12:H26))","v":15},"انس مجدى ابراهيم الجزار",15,21,8,2007,10,1,9,58,38,59,39,194,97,"ممتاز",58,30,58,40,186,74.400000000000006,"ممتاز",58,39,58,40,195,39,"ممتاز",58,40,56,40,194,38.799999999999997,"ممتاز",59,39,58,40,196,39.200000000000003]
[30610211702351,"2006-10-21",null,null,216,85,{"$f":"IF(H27=\"\",\"\",SUBTOTAL(3,$H$12:H27))","v":16},"جمال محمد جمال عبد الحليم المرادي",16,21,10,2006,10,11,9,48,34,51,25,158,79,"جيد جداً",54,15,52,30,151,60.4,"جيد جداً",56,35,56,37,184,36.799999999999997,"ممتاز",52,36,55,38,181,36.200000000000003,"ممتاز",55,37,59,35,186,37.200000000000003]
[30707021701034,"2007-07-02",null,null,217,86,{"$f":"IF(H28=\"\",\"\",SUBTOTAL(3,$H$12:H28))","v":17},"حسن أيمن حسن باز الشريف",17,2,7,2007,29,2,9,49,27,53,28,157,78.5,"جيد جداً",57,20,48,38,163,65.2,"جيد جداً",56,34,56,40,186,37.200000000000003,"ممتاز",54,34,52,34,174,34.799999999999997,"ممتاز",55,39,56,39,189,37.799999999999997]
[30710011715194,"2007-10-01",null,null,218,87,{"$f":"IF(H29=\"\",\"\",SUBTOTAL(3,$H$12:H29))","v":18},"زياد محمد زايد عبد الرازق عبد العال",18,1,10,2007,0,0,9,52,25,52,18,147,73.5,"جيد",46,24,51,35,156,62.4,"جيد جداً",53,30,50,36,169,33.799999999999997,"جيد جداً",55,32,48,14,149,29.8,"جيد",50,32,44,21,147,29.4]
[30708161702339,"2007-08-16",null,null,219,88,{"$f":"IF(H30=\"\",\"\",SUBTOTAL(3,$H$12:H30))","v":19},"سعد محمد سعد محمد سويلم",19,16,8,2007,15,1,9,50,7,52,31,140,70,"جيد",48,19,55,32,154,61.6,"جيد جداً",49,27,51,36,163,32.6,"جيد جداً",50,36,54,32,172,34.4,"ممتاز",46,28,56,32,162,32.4]
{"$rows_left_out":599}
{"sheet":"شهادات الأوائل","index":1,"n_rows":39,"n_cols":28,"rows_kept":39,"cut":false,"hidden":true,"merged":[[1,15,2,17],[18,9,19,9],[30,4,30,5],[2,4,2,5],[10,2,10,4],[3,1,3,3],[9,14,10,14],[31,9,32,9],[25,2,25,4],[38,2,38,4],[17,4,17,5],[18,1,18,3],[31,1,31,3]]}
[]
["إدارة قويسنا التعليمية",null,null,null,null,null,null,null,null,null,null,null,null,null,null,"الــرابـــــــــــــع"]
["  مدرسة /  منشاة دملو الإبتدائية0",null,null,null,"رقم الجلوس",null,{"$f":"LOOKUP(F4,AB7:AB23,'شيت الرابع'!#REF!)","v":{"$error":"#REF!"}},null,null,null,{"$f":"IF(L5>=90%,\"بارك الله لك\",\"\")","v":{"$error":"#REF!"}}]
["الاســـم/ ",{"$f":"LOOKUP(F4,AB7:AB22,'شيت الرابع'!#REF!)","v":{"$error":"#REF!"}},null,null,null,1,null,null,null,{"$f":"LOOKUP(F4,AB7:AB23,'شيت الرابع'!#REF!)","v":{"$error":"#REF!"}},"الترتيب","النسبة "]
["الصف الرابع",null,null,"نتيجة امتحان اخرالعام 2013/2012",null,null,null,null,null,null,{"$f":"LOOKUP(F4,AB7:AB23,'شيت الرابع'!#REF!)","v":{"$error":"#REF!"}},{"$f":"K9/K7","v":{"$error":"#REF!"}}]
["النهاية","عربي","حساب","انجليزي","علوم ","دراسات","فنى","رياضى","نشاط1","نشاط2","المجموع","دين"]
["الكبرى",100,80,40,40,40,20,20,20,20,380,40,null,null,null,null,"الرئيسية",null,null,null,null,null,null,null,null,null,null,1]
["الصغرى",50,40,20,20,20,10,10,10,10,190,20,null,null,null,null,null,null,null,null,null,null,null,null,null,null,null,2]
["الدرجة",{"$f":"LOOKUP(F4,AB7:AB23,'شيت الرابع'!#REF!)","v":{"$error":"#REF!"}},{"$f":"LOOKUP(F4,AB7:AB23,'شيت الرابع'!#REF!)","v":{"$error":"#REF!"}},{"$f":"LOOKUP(F4,AB7:AB23,'شيت الرابع'!#REF!)","v":{"$error":"#REF!"}},{"$f":"LOOKUP(F4,AB7:AB23,'شيت الرابع'!#REF!)","v":{"$error":"#REF!"}},{"$f":"LOOKUP(F4,AB7:AB23,'شيت الرابع'!#REF!)","v":{"$error":"#REF!"}},{"$f":"LOOKUP(F4,AB7:AB23,'شيت الرابع'!#REF!)","v":{"$error":"#REF!"}},{"$f":"LOOKUP(F4,AB7:AB23,'شيت الرابع'!#REF!)","v":{"$error":"#REF!"}},{"$f":"LOOKUP(F4,AB7:AB23,'شيت الرابع'!#REF!)","v":{"$error":"#REF!"}},{"$f":"LOOKUP(F4,AB7:AB23,'شيت الرابع'!#REF!)","v":{"$error":"#REF!"}},{"$f":"LOOKUP(F4,AB7:AB23,'شيت الرابع'!#REF!)","v":{"$error":"#REF!"}},{"$f":"LOOKUP(F4,AB7:AB23,'شيت الرابع'!#REF!)","v":{"$error":"#REF!"}},null,null,null,null,null,null,null,null,null,null,null,null,null,null,null,3]
["ش / ط ",null,null,"وكيل المدرسة",null,null,null,null,null,null,"مديرة المدرسة",null,null,null,"الإســـــــــــم",null,null,null,null,null,null,null,null,null,null,null,null,4]
["عايده",null,null,null,null,null,null,null,null,null,null,null,null,null,null,null,null,null,null,null,null,null,null,null,null,null,null,5]
[null,null,null,null,null,null,null,null,null,null,null,null,null,null,null,null,null,null,null,null,null,null,null,null,null,null,null,6]
[null,null,null,null,null,null,null,null,null,null,null,null,null,null,null,null,null,null,null,null,null,null,null,null,null,null,null,7]
[null,null,null,null,null,null,null,null,null,null,null,null,null,null,null,null,null,null,null,null,null,null,null,null,null,null,null,8]
[null,null,null,null,null,null,null,null,null,null,null,null,null,null,null,null,null,null,null,null,null,null,null,null,null,null,null,9]
[null,null,null,null,null,null,null,null,null,null,null,null,null,null,"رقم الجلوس",null,null,null,null,null,null,null,null,null,null,null,null,10]
["إدارة قويسنا التعليمية",null,null,null,null,{"$f":"F4+1","v":2},null,null,null,null,null,null,null,null,null,null,null,null,null,null,null,null,null,null,null,null,null,11]
["  مدرسة /  منشاة دملو الإبتدائية0",null,null,null,"رقم الجلوس",null,{"$f":"LOOKUP(F17,AB7:AB23,'شيت الرابع'!#REF!)","v":{"$error":"#REF!"}},null,null,null,{"$f":"IF(L20>=90%,\"بارك الله لك\",\"\")","v":{"$error":"#REF!"}},null,null,null,null,null,null,null,null,null,null,null,null,null,null,null,null,12]
["الاســـم/ ",{"$f":"LOOKUP(F17,AB7:AB22,'شيت الرابع'!#REF!)","v":{"$error":"#REF!"}},null,null,null,null,null,null,null,{"$f":"LOOKUP(F17,AB7:AB23,'شيت الرابع'!#REF!)","v":{"$error":"#REF!"}},"الترتيب","النسبة المئوية",null,null,null,null,null,null,null,null,null,null,null,null,null,null,null,13]
["الصف الرابع",null,null,"نتيجة امتحان اخرالعام 2013/2012",null,null,null,null,null,null,{"$f":"LOOKUP(F17,AB7:AB23,'شيت الرابع'!#REF!)","v":{"$error":"#REF!"}},{"$f":"K24/K22","v":{"$error":"#REF!"}},null,null,null,null,null,null,null,null,null,null,null,null,null,null,null,14]
["النهاية","عربي","حساب","انجليزي","علوم ","دراسات","فنى","رياضى","نشاط1","نشاط2","المجموع","دين",null,null,null,null,null,null,null,null,null,null,null,null,null,null,null,15]
["الكبرى",100,80,40,40,40,20,20,20,20,380,40,null,null,null,null,null,null,null,null,null,null,null,null,null,null,null,16]
["الصغرى",50,40,20,20,20,10,10,10,10,190,20,null,null,null,null,null,null,null,null,null,null,null,null,null,null,null,17]
["الدرجة",{"$f":"LOOKUP(F17,AB7:AB23,'شيت الرابع'!#REF!)","v":{"$error":"#REF!"}},{"$f":"LOOKUP(F17,AB7:AB23,'شيت الرابع'!#REF!)","v":{"$error":"#REF!"}},{"$f":"LOOKUP(F17,AB7:AB23,'شيت الرابع'!#REF!)","v":{"$error":"#REF!"}},{"$f":"LOOKUP(F17,AB7:AB23,'شيت الرابع'!#REF!)","v":{"$error":"#REF!"}},{"$f":"LOOKUP(F17,AB7:AB23,'شيت الرابع'!#REF!)","v":{"$error":"#REF!"}},{"$f":"LOOKUP(F17,AB7:AB23,'شيت الرابع'!#REF!)","v":{"$error":"#REF!"}},{"$f":"LOOKUP(F17,AB7:AB23,'شيت الرابع'!#REF!)","v":{"$error":"#REF!"}},{"$f":"LOOKUP(F17,AB7:AB23,'شيت الرابع'!#REF!)","v":{"$error":"#REF!"}},{"$f":"LOOKUP(F17,AB7:AB23,'شيت الرابع'!#REF!)","v":{"$error":"#REF!"}},{"$f":"LOOKUP(F17,AB7:AB23,'شيت الرابع'!#REF!)","v":{"$error":"#REF!"}},{"$f":"LOOKUP(F17,AB7:AB23,'شيت الرابع'!#REF!)","v":{"$error":"#REF!"}}]
["ش / ط ",null,null,"وكيل المدرسة",null,null,null,null,null,null,"مديرة المدرسة"]
["عايده"]
[]
[]
[]
["إدارة قويسنا التعليمية",null,null,null,null,{"$f":"F17+1","v":3}]
{"$rows_left_out":9}