{"text_format":"1","workbook":"xlsx","n_sheets":2,"sheets":["شيت الرابع","شهادات الأوائل"],"not_rendered":{"charts":0,"images":3,"macros":1,"external_links":1,"defined_names":2,"comments":0,"pivot_tables":0},"unopened":[],"bounds":{"document_bytes":16777216,"sheet_cells":100000,"rows_first":2000,"rows_last":500,"rows_between":2000,"halvings":0,"cell_chars":16384,"cell_head_chars":4096},"cells_cut":0,"cells_raw":0,"read":"whole","date_system":"1900"}

{"sheet":"شيت الرابع","index":0,"n_rows":474,"n_cols":142,"rows_kept":474,"cut":false,"hidden":false,"merged":[[4,5,5,6],[0,22,0,26],[1,22,1,23],[1,25,1,26],[1,29,1,30],[3,8,6,8],[1,13,6,14],[0,5,1,6],[0,8,2,8],[2,5,3,6],[0,36,0,40],[1,36,1,37],[1,39,1,40],[1,43,1,44],[1,46,1,47],[0,78,0,82],[9,120,9,130],[7,65,7,68],[9,102,9,111],[8,45,8,46],[7,54,10,54],[8,80,8,81],[7,60,7,63],[7,64,10,64],[8,62,9,62],[8,63,9,63],[1,78,1,79],[1,81,1,82],[0,50,0,53],[0,55,0,58],[0,65,0,68],[0,70,0,73],[0,60,0,63],[0,43,0,47],[7,21,10,21],[7,15,7,20],[7,42,10,42],[9,113,9,117],[7,55,7,58],[8,41,9,41],[8,58,9,58],[8,57,9,57],[8,38,8,39],[8,83,9,83],[7,78,7,83],[7,70,7,73],[8,82,9,82],[8,33,9,33],[8,29,8,30],[8,36,8,37],[8,34,9,34],[7,59,10,59],[8,40,9,40],[8,47,9,47],[7,49,10,49],[8,48,9,48],[7,43,7,48],[0,13,0,14],[1,10,6,11],[0,15,0,19],[1,15,1,16],[1,18,1,19],[7,12,9,14],[8,15,8,16],[7,9,9,11],[1,32,1,33],[0,29,0,33],[8,17,8,18],[7,29,7,34],[8,27,9,27],[8,31,8,32],[8,26,9,26],[8,20,9,20],[8,19,9,19],[7,132,8,141],[7,69,10,69],[7,74,10,74],[7,86,10,86],[7,76,10,76],[7,50,7,53],[7,85,9,85],[8,72,9,72],[8,113,8,117],[7,77,9,77],[8,53,9,53],[8,67,9,67],[7,75,9,75],[8,73,9,73],[8,78,8,79],[8,68,9,68],[8,102,8,111],[10,88,10,93],[7,84,10,84],[8,52,9,52],[7,0,10,0],[7,1,10,1],[8,43,8,44],[8,24,8,25],[7,36,7,41],[7,4,10,4],[7,28,10,28],[8,22,8,23],[7,5,10,5],[7,22,7,27],[7,2,10,2],[7,3,10,3],[7,8,10,8],[7,7,10,7],[7,6,10,6],[10,12,10,14],[7,35,10,35]]}
["غ",null,"                          إدارة قويسنا التعليمية0 ",null,null,{"$f":"TEXT(F3,\"dddd\")","v":"الأحد"},null,null,"بداية رقم الجلوس","عدد التلاميذ",null,null,null,"منقطعين",null,"لغة عربية",null,null,null,null,null,null,"رياضيات",null,null,null,null,null,null,"لغة إنجليزية",null,null,null,null,null,null,"دراسات",null,null,null,null,null,null,"علــــــوم",null,null,null,null,null,null,"نشاط (فنى)",null,null,null,null,"نشاط (رياضى)",null,null,null,null,"نشاط (حاسب آلى)",null,null,null,null,"نشاط (1)",null,null,null,null,"نشاط (2)",null,null,null,null,null,null,null,"التربية الدينية"]
[null,null,"                                  مدرسة عرب الرمال الإبتدائية سكة حديد0",null,null,null,null,null,null,null,{"$f":"COUNT(G12:G156)","v":6},null,null,{"$f":"COUNTIF(BX12:BX17,\"غ\")","v":1},null,"نصف العام",null,null,"آخر العام",null,null,null,"نصف العام",null,null,"آخر العام",null,null,null,"نصف العام",null,null,"آخر العام",null,null,null,"نصف العام",null,null,"آخر العام",null,null,null,"نصف العام",null,null,"آخر العام",null,null,null,null,"ناجح",null,{"$f":"BB4-BB3","v":2},null,null,"ناجح",null,{"$f":"BG4-BG3","v":2},null,null,"ناجح",null,{"$f":"BL4-BL3","v":2},null,null,"ناجح",null,{"$f":"BQ4-BQ3","v":2},null,null,"ناجح",null,{"$f":"BV4-BV3","v":2},null,null,null,null,"نصف العام",null,null,"آخر العام"]
[null,null,null,null,null,{"$f":"TODAY()","v":"2018-04-15"},null,null,null,null,null,null,null,null,null,"ناجح",{"$f":"Q5-Q4","v":4},null,"ناجح",{"$f":"T5-T4","v":3},"دون المستوى",null,"ناجح",{"$f":"X5-X4","v":2},null,"ناجح",{"$f":"AA5-AA4","v":2},"دون المستوى",null,"ناجح",{"$f":"AE5-AE4","v":2},null,"ناجح",{"$f":"AH5-AH4","v":2},"دون المستوى",null,"ناجح",{"$f":"AL5-AL4","v":2},null,"ناجح",{"$f":"AO5-AO4","v":2},"دون المستوى",null,"ناجح",{"$f":"AS5-AS4","v":2},null,"ناجح",{"$f":"AV5-AV4","v":2},"دون المستوى",null,null,"راسب",null,{"$f":"COUNTIF(BC12:BC17,\"دون المستوى\")","v":2},null,null,"راسب",null,{"$f":"COUNTIF(BH12:BH17,\"دون المستوى\")","v":2},null,null,"راسب",null,{"$f":"COUNTIF(BM12:BM17,\"دون المستوى\")","v":2},null,null,"راسب",null,{"$f":"COUNTIF(BR12:BR17,\"دون المستوى\")","v":2},null,null,"راسب",null,{"$f":"COUNTIF(BW12:BW17,\"دون المستوى\")","v":2},null,null,null,null,"ناجح",{"$f":"CB5-CB4","v":2},null,"ناجح",{"$f":"CE5-CE4","v":2},"دون المستوى"]
[null,null,null,null,null,null,null,"دمج ( 3 )",1,null,null,null,null,null,null,"راسب",{"$f":"SUMPRODUCT(--(Q12:Q17<20)+(Q12:Q17=\"غ\"))","v":1},null,"راسب",{"$f":"COUNTIF(V12:V17,\"دون المستوى\")","v":2},{"$f":"COUNTIF(V12:V17,\"دون المستوى\")","v":2},null,"راسب",{"$f":"SUMPRODUCT(--(X12:X17<20)+(X12:X17=\"غ\"))","v":2},null,"راسب",{"$f":"COUNTIF(AC12:AC17,\"دون المستوى\")","v":2},{"$f":"COUNTIF(AC12:AC17,\"دون المستوى\")","v":2},null,"راسب",{"$f":"SUMPRODUCT(--(AE12:AE17<20)+(AE12:AE17=\"غ\"))","v":2},null,"راسب",{"$f":"COUNTIF(AJ12:AJ17,\"دون المستوى\")","v":2},{"$f":"COUNTIF(AJ12:AJ17,\"دون المستوى\")","v":2},null,"راسب",{"$f":"SUMPRODUCT(--(AL12:AL17<20)+(AL12:AL17=\"غ\"))","v":2},null,"راسب",{"$f":"COUNTIF(AQ12:AQ17,\"دون المستوى\")","v":2},{"$f":"COUNTIF(AQ12:AQ17,\"دون المستوى\")","v":2},null,"راسب",{"$f":"SUMPRODUCT(--(AS12:AS17<20)+(AS12:AS17=\"غ\"))","v":2},null,"راسب",{"$f":"COUNTIF(AX12:AX17,\"دون المستوى\")","v":2},{"$f":"COUNTIF(AX12:AX17,\"دون المستوى\")","v":2},null,null,"حاضر",null,{"$f":"$K$2-BB5","v":4},null,null,"حاضر",null,{"$f":"$K$2-BG5","v":4},null,null,"حاضر",null,{"$f":"$K$2-BL5","v":4},null,null,"حاضر",null,{"$f":"$K$2-BQ5","v":4},null,null,"حاضر",null,{"$f":"$K$2-BV5","v":4},null,null,null,null,"راسب",{"$f":"SUMPRODUCT(--(CB12:CB17<20)+(CB12:CB17=\"غ\"))","v":2},null,"راسب",{"$f":"COUNTIF(CG12:CG17,\"دون المستوى\")","v":2},{"$f":"COUNTIF(CG12:CG17,\"دون المستوى\")","v":2}]
[null,null,null,null,null,{"$f":"TODAY()","v":"2018-04-15"},null,"باقى للإعاده ( عاطف محمد السيد يوسف )",null,null,null,null,null,null,null,"حاضر",{"$f":"K2-Q6","v":5},null,"حاضر",{"$f":"$K$2-T6","v":5},null,null,"حاضر",{"$f":"$K$2-X6","v":4},null,"حاضر",{"$f":"$K$2-AA6","v":4},null,null,"حاضر",{"$f":"$K$2-AE6","v":4},null,"حاضر",{"$f":"$K$2-AH6","v":4},null,null,"حاضر",{"$f":"$K$2-AL6","v":4},null,"حاضر",{"$f":"$K$2-AO6","v":4},null,null,"حاضر",{"$f":"$K$2-AS6","v":4},null,"حاضر",{"$f":"$K$2-AV6","v":4},null,null,"غياب",{"$f":"COUNTIF(AZ12:AZ17,\"غ\")","v":2},null,{"$f":"COUNTIF(BB12:BB17,\"غ\")","v":2},null,"غياب",{"$f":"COUNTIF(BE12:BE17,\"غ\")","v":2},null,{"$f":"COUNTIF(BG12:BG17,\"غ\")","v":2},null,"غياب",{"$f":"COUNTIF(BJ12:BJ17,\"غ\")","v":2},null,{"$f":"COUNTIF(BL12:BL17,\"غ\")","v":2},null,"غياب",{"$f":"COUNTIF(BO12:BO17,\"غ\")","v":2},null,{"$f":"COUNTIF(BQ12:BQ17,\"غ\")","v":2},null,"غياب",{"$f":"COUNTIF(BT12:BT17,\"غ\")","v":2},null,{"$f":"COUNTIF(BV12:BV17,\"غ\")","v":2},null,null,null,null,"حاضر",{"$f":"$K$2-CB6","v":4},null,"حاضر",{"$f":"$K$2-CE6","v":4}]
[null,null,null,null,null,null,null,null,null,null,null,null,null,null,null,"غياب",{"$f":"COUNTIF(Q12:Q17,\"غ\")","v":1},null,"غياب",{"$f":"COUNTIF(S12:S17,\"غ\")","v":1},null,null,"غياب",{"$f":"COUNTIF(X12:X17,\"غ\")","v":2},null,"غياب",{"$f":"COUNTIF(Z12:Z17,\"غ\")","v":2},null,null,"غياب",{"$f":"COUNTIF(AE12:AE17,\"غ\")","v":2},null,"غياب",{"$f":"COUNTIF(AG12:AG17,\"غ\")","v":2},null,null,"غياب",{"$f":"COUNTIF(AL12:AL17,\"غ\")","v":2},null,"غياب",{"$f":"COUNTIF(AN12:AN17,\"غ\")","v":2},null,null,"غياب",{"$f":"COUNTIF(AS12:AS17,\"غ\")","v":2},null,"غياب",{"$f":"COUNTIF(AU12:AU17,\"غ\")","v":2},null,null,"النسبة المئوية",null,null,{"$f":"BB2/BB4","v":0.5},null,"النسبة المئوية",null,null,{"$f":"BG2/BG4","v":0.5},null,"النسبة المئوية",null,null,{"$f":"BL2/BL4","v":0.5},null,"النسبة المئوية",null,null,{"$f":"BQ2/BQ4","v":0.5},null,"النسبة المئوية",null,null,{"$f":"BV2/BV4","v":0.5},null,null,null,null,"غياب",{"$f":"COUNTIF(CB12:CB17,\"غ\")","v":2},null,"غياب",{"$f":"COUNTIF(CD12:CD17,\"غ\")","v":2}]
[null,null,null,null,null,null,null,null,null,null,null,null,null,null,null,"النسبة ",null,null,"النسبة ",{"$f":"T3/T5","v":0.6},null,null,"النسبة ",{"$f":"X3/X5","v":0.5},null,"النسبة ",{"$f":"AA3/AA5","v":0.5},null,null,"النسبة ",{"$f":"AE3/AE5","v":0.5},null,"النسبة ",{"$f":"AH3/AH5","v":0.5},null,null,"النسبة ",{"$f":"AL3/AL5","v":0.5},null,"النسبة ",{"$f":"AO3/AO5","v":0.5},null,null,"النسبة ",{"$f":"AS3/AS5","v":0.5},null,"النسبة ",{"$f":"AV3/AV5","v":0.5},null,null,null,null,null,null,null,null,null,null,null,null,null,null,null,null,null,null,null,null,null,null,null,null,null,null,null,null,null,null,"النسبة ",{"$f":"CB3/CB5","v":0.5},null,"النسبة ",{"$f":"CE3/CE5","v":0.5}]
["الرقم القومى","تاريخ الميلاد","سرى ترم أول","سرى ترم ثان","الرقم السرى ترم أول","الرقم السرى ترم ثان","م","إســــــــم التلميذ","رقم الجلوس","تاريخ الميلاد",null,null,"السن فى أول أكتوبر   ",null,null,"لغة عربية",null,null,null,null,null,"المستوى","رياضيات",null,null,null,null,null,"المستوى","لغة إنجليزية",null,null,null,null,null,"المستوى","دراسات",null,null,null,null,null,"المستوى","علوم",null,null,null,null,null,"المستوى","نشاط (فنى)",null,null,null,"المستوى","نشاط (رياضى)",null,null,null,"المستوى","نشاط (حاسب آلى)",null,null,null,"المستوى","نشاط (1)",null,null,null,"المستوى","نشاط (2)",null,null,null,"المستوى","    المجموع الكلى","المستوى","المجموع بدون أنشطة     ","التربية الدينية",null,null,null,null,null,"المستوى","المجموع الإعتبارى","الترتيب",null,null,null,null,null,null,null,null,null,null,null,null,null,null,null,null,null,null,null,null,null,null,null,null,null,null,null,null,null,null,null,null,null,null,null,null,null,null,null,null,null,null,null,null,null,"نسبة 65 "]
[null,null,null,null,null,null,null,null,null,null,null,null,null,null,null,"نصف العام",null,"آخر العام",null,"مجموع","الدرجة",null,"نصف العام",null,"آخر العام",null,"مجموع","الدرجة",null,"نصف العام",null,"آخر العام",null,"مجموع","الدرجة",null,"نصف العام",null,"آخر العام",null,"مجموع","الدرجة",null,"نصف العام",null,"آخر العام",null,"مجموع","الدرجة",null,"نصف العام","آخر العام","مجموع","الدرجة",null,"نصف العام","آخر العام","مجموع","الدرجة",null,"نصف العام","آخر العام","مجموع","الدرجة",null,"نصف العام","آخر العام","مجموع","الدرجة",null,"نصف العام","آخر العام","مجموع","الدرجة",null,null,null,null,"نصف العام",null,"آخر العام",null,"مجموع","الدرجة",null,null,null,null,null,null,null,null,null,null,null,null,null,null,null,null,null,null,"الصف الخامس  2017/2016",null,null,null,null,null,null,null,null,null,null,"الصف الرابع 2018/2017"]
[null,null,null,null,null,null,null,null,null,null,null,null,null,null,null,"تقويم شامل","إختبار","ملف","إختبار",null,null,null,"تقويم شامل","إختبار","تقويم شامل","إختبار",null,null,null,"تقويم شامل","إختبار","تقويم شامل","إختبار",null,null,null,"تقويم شامل","إختبار","تقويم شامل","إختبار",null,null,null,"تقويم شامل","إختبار","تقويم شامل","إختبار",null,null,null,"تقويم شامل","تقويم شامل",null,null,null,"تقويم شامل","تقويم شامل",null,null,null,"تقويم شامل","تقويم شامل",null,null,null,"تقويم شامل","تقويم شامل",null,null,null,"تقويم شامل","تقويم شامل",null,null,null,null,null,null,"تقويم شامل","إختبار","ملف","إختبار",null,null,null,null,null,null,null,null,null,null,null,null,null,null,null,null,null,"ناجح",{"$f":"COUNTIF(CV12:CV73,\"ناجح\")","v":0},null,"إحصاء الناجحون",null,null,null,null,null,null,null,null,null,null,"الأوائــــــــــــــل بدون الأنشطه آخر العام",null,null,null,null,null,null,"درجـــــــــــــات الأوائــــــــــــــل",null,null,null,null,null,null,null,null,null,null,null,"عربى","رياضيات","إنجليزى","دراسات","علوم","فنى","رياضى","نشاط1","نشاط2","دين"]
{"$rows_left_out":465}
{"sheet":"شهادات الأوائل","index":1,"n_rows":39,"n_cols":28,"rows_kept":39,"cut":false,"hidden":true,"merged":[[1,15,2,17],[18,9,19,9],[30,4,30,5],[2,4,2,5],[10,2,10,4],[3,1,3,3],[9,14,10,14],[31,9,32,9],[25,2,25,4],[38,2,38,4],[17,4,17,5],[18,1,18,3],[31,1,31,3]]}
[]
["إدارة قويسنا التعليمية",null,null,null,null,null,null,null,null,null,null,null,null,null,null,"الــرابـــــــــــــع"]
["  مدرسة /  منشاة دملو الإبتدائية0",null,null,null,"رقم الجلوس",null,{"$f":"LOOKUP(F4,AB7:AB23,'شيت الرابع'!#REF!)","v":{"$error":"#REF!"}},null,null,null,{"$f":"IF(L5>=90%,\"بارك الله لك\",\"\")","v":{"$error":"#REF!"}}]
["الاســـم/ ",{"$f":"LOOKUP(F4,AB7:AB22,'شيت الرابع'!#REF!)","v":{"$error":"#REF!"}},null,null,null,1,null,null,null,{"$f":"LOOKUP(F4,AB7:AB23,'شيت الرابع'!#REF!)","v":{"$error":"#REF!"}},"الترتيب","النسبة "]
["الصف الرابع",null,null,"نتيجة امتحان اخرالعام 2013/2012",null,null,null,null,null,null,{"$f":"LOOKUP(F4,AB7:AB23,'شيت الرابع'!#REF!)","v":{"$error":"#REF!"}},{"$f":"K9/K7","v":{"$error":"#REF!"}}]
["النهاية","عربي","حساب","انجليزي","علوم ","دراسات","فنى","رياضى","نشاط1","نشاط2","المجموع","دين"]
["الكبرى",100,80,40,40,40,20,20,20,20,380,40,null,null,null,null,"الرئيسية",null,null,null,null,null,null,null,null,null,null,1]
["الصغرى",50,40,20,20,20,10,10,10,10,190,20,null,null,null,null,null,null,null,null,null,null,null,null,null,null,null,2]
["الدرجة",{"$f":"LOOKUP(F4,AB7:AB23,'شيت الرابع'!#REF!)","v":{"$error":"#REF!"}},{"$f":"LOOKUP(F4,AB7:AB23,'شيت الرابع'!#REF!)","v":{"$error":"#REF!"}},{"$f":"LOOKUP(F4,AB7:AB23,'شيت الرابع'!#REF!)","v":{"$error":"#REF!"}},{"$f":"LOOKUP(F4,AB7:AB23,'شيت الرابع'!#REF!)","v":{"$error":"#REF!"}},{"$f":"LOOKUP(F4,AB7:AB23,'شيت الرابع'!#REF!)","v":{"$error":"#REF!"}},{"$f":"LOOKUP(F4,AB7:AB23,'شيت الرابع'!#REF!)","v":{"$error":"#REF!"}},{"$f":"LOOKUP(F4,AB7:AB23,'شيت الرابع'!#REF!)","v":{"$error":"#REF!"}},{"$f":"LOOKUP(F4,AB7:AB23,'شيت الرابع'!#REF!)","v":{"$error":"#REF!"}},{"$f":"LOOKUP(F4,AB7:AB23,'شيت الرابع'!#REF!)","v":{"$error":"#REF!"}},{"$f":"LOOKUP(F4,AB7:AB23,'شيت الرابع'!#REF!)","v":{"$error":"#REF!"}},{"$f":"LOOKUP(F4,AB7:AB23,'شيت الرابع'!#REF!)","v":{"$error":"#REF!"}},null,null,null,null,null,null,null,null,null,null,null,null,null,null,null,3]
["ش / ط ",null,null,"وكيل المدرسة",null,null,null,null,null,null,"مديرة المدرسة",null,null,null,"الإســـــــــــم",null,null,null,null,null,null,null,null,null,null,null,null,4]
{"$rows_left_out":29}