{"text_format":"1","workbook":"xlsx","n_sheets":10,"sheets":["Main","Mohamed","Ahmed","Ahraf","Mohsen","63008","ALI","123","110","120"],"not_rendered":{"charts":0,"images":0,"macros":1,"external_links":0,"defined_names":0,"comments":0,"pivot_tables":0},"unopened":[],"bounds":{"document_bytes":16777216,"sheet_cells":100000,"rows_first":2000,"rows_last":500,"rows_between":2000,"halvings":0,"cell_chars":16384,"cell_head_chars":4096},"cells_cut":0,"cells_raw":0,"read":"whole","date_system":"1900"}

{"sheet":"Main","index":0,"n_rows":31,"n_cols":5,"rows_kept":31,"cut":false,"hidden":false,"merged":[]}
["م","الكود","الإسم","العنوان","ملاحظات"]
[1,101,"Mohamed","Cairo","Very Good"]
[2,{"$f":"B2+1","v":102},"Ahmed","Alex","Tamam"]
[3,{"$f":"B3+1","v":103},"Ahraf","Banha","Thanks"]
[4,104,"Mohsen","Tanta","First Class"]
[5,105,63008,"Suez","Second Stars"]
[6,106,"ALI"]
[7,107,123]
[8,108,110]
[9,109,120]
[10,110]
[11,111]
[12,112]
[13,113]
[14,114]
[15,115]
[16,116]
[17,117]
[18,118]
[19,119]
[20,120]
[21,121]
[22,122]
[23,123]
[24,124]
[25,125]
[26,126]
[27,127]
[28,128]
[29,129]
[30,130]

{"sheet":"Mohamed","index":1,"n_rows":12,"n_cols":5,"rows_kept":12,"cut":false,"hidden":false,"merged":[]}
[null,"Mohamed"]
["الكود",{"$f":"SUMIF(Main!$C$2:$C$18,B1,Main!$B$2:$B$13)","v":101}]
["م","الدرجة","العنوان","المؤهل","ملاحظات"]
[1,null,{"$f":"INDEX(Main!$D$2:$D$11,MATCH($B$1,Main!$C$2:$C$11,0))","v":"Cairo"},null,{"$f":"INDEX(Main!$E$2:$E$11,MATCH($B$1,Main!$C$2:$C$11,0))","v":"Very Good"}]
[2]
[3]
[4]
[5]
[6]
[7]
[8]
[9]

{"sheet":"Ahmed","index":2,"n_rows":12,"n_cols":5,"rows_kept":12,"cut":false,"hidden":false,"merged":[]}
[null,"Ahmed"]
["الكود",{"$f":"SUMIF(Main!$C$2:$C$18,B1,Main!$B$2:$B$13)","v":102}]
["م","الدرجة","العنوان","المؤهل","ملاحظات"]
[1,null,{"$f":"INDEX(Main!$D$2:$D$11,MATCH($B$1,Main!$C$2:$C$11,0))","v":"Alex"},null,{"$f":"INDEX(Main!$E$2:$E$11,MATCH($B$1,Main!$C$2:$C$11,0))","v":"Tamam"}]
[2]
[3]
[4]
[5]
[6]
[7]
[8]
[9]

{"sheet":"Ahraf","index":3,"n_rows":12,"n_cols":5,"rows_kept":12,"cut":false,"hidden":false,"merged":[]}
[null,"Ahraf"]
["الكود",{"$f":"SUMIF(Main!$C$2:$C$18,B1,Main!$B$2:$B$13)","v":103}]
["م","الدرجة","العنوان","المؤهل","ملاحظات"]
[1,null,{"$f":"INDEX(Main!$D$2:$D$11,MATCH($B$1,Main!$C$2:$C$11,0))","v":"Banha"},null,{"$f":"INDEX(Main!$E$2:$E$11,MATCH($B$1,Main!$C$2:$C$11,0))","v":"Thanks"}]
[2]
[3]
[4]
[5]
[6]
[7]
[8]
[9]

{"sheet":"Mohsen","index":4,"n_rows":12,"n_cols":5,"rows_kept":12,"cut":false,"hidden":false,"merged":[]}
[null,"Mohsen"]
["الكود",{"$f":"SUMIF(Main!$C$2:$C$18,B1,Main!$B$2:$B$13)","v":104}]
["م","الدرجة","العنوان","المؤهل","ملاحظات"]
[1,null,{"$f":"INDEX(Main!$D$2:$D$11,MATCH($B$1,Main!$C$2:$C$11,0))","v":"Tanta"},null,{"$f":"INDEX(Main!$E$2:$E$11,MATCH($B$1,Main!$C$2:$C$11,0))","v":"First Class"}]
[2]
[3]
[4]
[5]
[6]
[7]
[8]
[9]

{"sheet":"63008","index":5,"n_rows":12,"n_cols":5,"rows_kept":12,"cut":false,"hidden":false,"merged":[]}
[null,63008]
["الكود",{"$f":"SUMIF(Main!$C$2:$C$18,B1,Main!$B$2:$B$13)","v":105}]
["م","الدرجة","العنوان","المؤهل","ملاحظات"]
[1,null,{"$f":"INDEX(Main!$D$2:$D$11,MATCH($B$1,Main!$C$2:$C$11,0))","v":"Suez"},null,{"$f":"INDEX(Main!$E$2:$E$11,MATCH($B$1,Main!$C$2:$C$11,0))","v":"Second Stars"}]
[2]
[3]
[4]
[5]
[6]
[7]
[8]
[9]

{"sheet":"ALI","index":6,"n_rows":12,"n_cols":5,"rows_kept":12,"cut":false,"hidden":false,"merged":[]}
[null,"ALI"]
["الكود",{"$f":"SUMIF(Main!$C$2:$C$18,B1,Main!$B$2:$B$13)","v":106}]
["م","الدرجة","العنوان","المؤهل","ملاحظات"]
[1,null,{"$f":"INDEX(Main!$D$2:$D$11,MATCH($B$1,Main!$C$2:$C$11,0))","v":0},null,{"$f":"INDEX(Main!$E$2:$E$11,MATCH($B$1,Main!$C$2:$C$11,0))","v":0}]
[2]
[3]
[4]
[5]
[6]
[7]
[8]
[9]

{"sheet":"123","index":7,"n_rows":12,"n_cols":5,"rows_kept":12,"cut":false,"hidden":false,"merged":[]}
[null,123]
["الكود",{"$f":"SUMIF(Main!$C$2:$C$18,B1,Main!$B$2:$B$13)","v":107}]
["م","الدرجة","العنوان","المؤهل","ملاحظات"]
[1,null,{"$f":"INDEX(Main!$D$2:$D$11,MATCH($B$1,Main!$C$2:$C$11,0))","v":0},null,{"$f":"INDEX(Main!$E$2:$E$11,MATCH($B$1,Main!$C$2:$C$11,0))","v":0}]
[2]
[3]
[4]
[5]
[6]
[7]
[8]
[9]

{"sheet":"110","index":8,"n_rows":12,"n_cols":5,"rows_kept":12,"cut":false,"hidden":false,"merged":[]}
[null,110]
["الكود",{"$f":"SUMIF(Main!$C$2:$C$18,B1,Main!$B$2:$B$13)","v":108}]
["م","الدرجة","العنوان","المؤهل","ملاحظات"]
[1,null,{"$f":"INDEX(Main!$D$2:$D$11,MATCH($B$1,Main!$C$2:$C$11,0))","v":0},null,{"$f":"INDEX(Main!$E$2:$E$11,MATCH($B$1,Main!$C$2:$C$11,0))","v":0}]
[2]
[3]
[4]
[5]
[6]
[7]
[8]
[9]

{"sheet":"120","index":9,"n_rows":12,"n_cols":5,"rows_kept":12,"cut":false,"hidden":false,"merged":[]}
[null,120]
["الكود",{"$f":"SUMIF(Main!$C$2:$C$18,B1,Main!$B$2:$B$13)","v":109}]
["م","الدرجة","العنوان","المؤهل","ملاحظات"]
[1,null,{"$f":"INDEX(Main!$D$2:$D$11,MATCH($B$1,Main!$C$2:$C$11,0))","v":0},null,{"$f":"INDEX(Main!$E$2:$E$11,MATCH($B$1,Main!$C$2:$C$11,0))","v":0}]
[2]
[3]
[4]
[5]
[6]
[7]
[8]
[9]