{"text_format":"1","workbook":"xlsx","n_sheets":3,"sheets":["1","salim","Auto_filt"],"not_rendered":{"charts":0,"images":0,"macros":1,"external_links":0,"defined_names":4,"comments":0,"pivot_tables":0},"unopened":[],"bounds":{"document_bytes":16777216,"sheet_cells":100000,"rows_first":2000,"rows_last":500,"rows_between":2000,"halvings":0,"cell_chars":16384,"cell_head_chars":4096},"cells_cut":0,"cells_raw":0,"read":"whole","date_system":"1900"}

{"sheet":"1","index":0,"n_rows":2262,"n_cols":4,"rows_kept":2262,"cut":false,"hidden":false,"merged":[]}
["يوم","شهر","بحث","بيان"]
[1,1,"ح","1259 - سيف الدين قطز يخلع نور الدين علي بن أيبك ويتسلم الحكم سلطانًا على مصر."]
[1,1,"ح","1531 - تأسيس مدينة ريو دي جانيرو على المحيط الأطلسي."]
[1,1,"ح","1651 - شارل الثاني يتولى الحكم في اسكتلندا."]
[1,1,"ح","1673 - بداية التوزيع النظامي للبريد بين نيويورك وبوسطن."]
[5,1,"ح","1801 - عقد الوحدة بين بريطانيا العظمى وأيرلندا."]
[5,1,"ح","1801 -  اكتشاف أول نيزك على سطح الأرض."]
[5,1,"ح","1804 - نهاية الحكم الفرنسي على جزيرة هايتي."]
[5,1,"ح","1808 - الولايات المتحدة تمنع استيراد العبيد."]
[5,1,"ح","1823 - بريطانيا تعلن سيادتها على جزر فوكلاند."]
[6,1,"ح","1861 - بورفيريو دياز يغزو المكسيك."]
[6,1,"ح","1863 - الرئيس الأمريكي أبراهام لينكون يحرر الزنوج من العبودية."]
[6,1,"ح","1880 - فرديناند دي لسبس يشرع في إنجاز قناة بنما."]
[8,1,"ح","1885 - تحديد خط الطول المرجعي الدولي في غرينيتش البريطانية وهو خط طول 0 درجة."]
[8,1,"ح","1893 - اليابان تبدأ في استعمال التقويم الغريغوري."]
[8,1,"ح","1899 - نهاية الحكم الإسباني في كوبا على يد القوات الأمريكية التي تدخلت تحت غطاء مساعدة الثوار الكوبيين."]
[9,1,"ح","1901 - تشكيل الكومنولث الأسترالي من قبل خمس مستعمرات بريطانية."]
[9,1,"ح","1912 - بدء ثورة صن يات سين في الصين والإعلان الأول لجمهورية الصين الشعبية."]
[9,1,"ح","1916 - القوات الألمانية تنسحب من ياوندي وتتخلى عن مستعمرتها في الكاميرون لصالح القوات البريطانية وتتجهة نحو غينيا الإسبانية."]
[9,1,"ح","1925 - حلب ودمشق تتحدان في بلد واحد باسم سوريا."]
[9,1,"ح","1930 - مصطفى النحاس يؤلف وزارته الثانية في مصر."]
[10,1,"ح","1934 -  جزيرة ألكتراز الشهيرة المتواجدة بخليج سان فرانسيسكو تتحول إلى سجن فيدرالي أمريكي."]
[10,1,"ح","1934 -  ليبيا تصبح مستعمرة إيطالية."]
[10,1,"ح","1935 - الزعيم التركي مصطفى كمال يتسمى باسم كمال أتاتورك والذي يعني أبو الأتراك."]
[11,1,"ح","1943 - بداية انسحاب القوات الألمانية من ستالينجراد بعد حصار دام عامين."]
[11,1,"ح","1947 - تأميم صناعة الفحم في المملكة المتحدة."]
[11,1,"ح","1948 -  الإعلان عن تشكيل جيش الإنقاذ بقيادة فوزي القاوقجي لمساعدة الفلسطينيون."]
[12,1,"ح","1948 -  بدء العمل بالاتفاقية العامة للتعرفة الجمركية والتجارية / جات."]
[13,1,"ح","1952 - إعلان الدستور الأردني."]
[1,1,"ح","1956 - استقلال السودان عن مصر والمملكة المتحدة وإعلان الجمهورية."]
[1,1,"ح","1958 - قيام السوق الأوروبية المشتركة."]
[1,1,"ح","1959 - القوات الموالية لفيدل كاسترو تزيح فولجينسيو باتيستا من منصب رئاسة كوبا إثر انقلاب عسكري."]
[1,1,"ح","1960 -  استقلال الكاميرون."]
[1,1,"ح","1960 -  رئيس الوزراء العراق عبد الكريم قاسم يسمح بعودة الأحزاب السياسية ماعدا الحزب الشيوعي."]
[1,1,"ح","1962 -  رئيس الوزراء السوري معروف الدواليبي يعلن عن توسط سوريا لحل النزاع الكويتي العراقي."]
[1,1,"ح","1962 - استقلال ساموا الغربية عن نيوزيلندا."]
[1,1,"ح","1964 - انقسام \"فيدرالية روديسيا ونيازالاند\" إلى جمهورية زامبيا المستقلة والتي كانت تحمل اسم \"روديسيا الشمالية\"، وجمهورية ملاوي المستقلة والتي كانت تحمل اسم \"نيازالاند\"، وبقاء روديسيا الجنوبية كمستعمرة بريطانية."]
[1,1,"ح","1965 - صدور البيان الأول لحركة فتح الفلسطينية وبداية الثورة المسلحة."]
[1,1,"ح","1966 - جان بيدل بوكاسا يقوم بانقاب عسكري في جمهورية أفريقيا الوسطى."]
[1,1,"ح","1971 - منع بث اللوحات الدعائية في التلفزيون الأمريكي التي تروج للسجائر."]
[1,1,"ح","1972 - بداية الوحدة الرسمية بين مصر وليبيا."]
[1,1,"ح","1976 - تفجير طائرة تابعة لطيران الشرق الأوسط كانت مقلعة من بيروت باتجاه إمارة دبي، وقد سقطت بالقرب من القيصومة في السعودية."]
[1,1,"ح","1978 - انفجار طائرة هندية من نوع بوينغ 747 وسقوطها قبالة سواحل مدينة مومباي مما أدى إلى مقتل 213 شخص."]
[1,1,"ح","1980 - أمين عام الأمم المتحدة كورت فالدهايم يزور إيران لبحث الإفراج عن الرهائن الأمريكيين المحتجزين داخل السفارة الأمريكية بطهران."]
[1,1,"ح","1982 - إقالة مستشار الأمن القومي الأمريكي ريتشارد ألن لتورطه في قضية الرشوة اليابانية."]
[1,1,"ح","1984 - استقلال سلطنة بروناي عن المملكة المتحدة."]
[1,1,"ح","1985 - إجراء أول مكالمة بهاتف نقال في المملكة المتحدة."]
[1,1,"ح","1993 -  تفكك جمهورية تشيكوسلوفاكيا وتأسيس دولتان مستقلتان هما التشيك وسلوفاكيا."]
[1,1,"ح","1993 -  الرئيسان جورج بوش وبوريس يلتسن يوقعان اتفاقية ستارت الثانية لتخفيض الأسلحة النووية."]
[1,1,"ح","1993 - بدء بث قناة يورونيوز التلفزيونية الإخبارية الأوروبية متعددة اللغات."]
[1,1,"ح","1994 - دخول اتفاق التبادل الحر لأمريكا الشمالية / نافتا حيز التنفيذ بين المكسيك والولايات المتحدة وكندا."]
[1,1,"ح","1995 - دخول اتفاقية منظمة التجارة العالمية حيز التنفيذ."]
[1,1,"ح","1995 - السويد والنمسا وفنلندا ينضمون إلى الاتحاد الأوروبي."]
[1,1,"ح","1998 - منع التدخين بالمطاعم والحانات بكاليفورنيا."]
[1,1,"ح","1999 - بداية التعامل بالعملة الأوروبية المشتركة / يورو."]
[1,1,"ح","2001 - انضمام اليونان إلى منطقة التداول باليورو."]
[1,1,"ح","2004 - مؤسسة الأقصى لإعمار المقدسات تكشف عن مخطط لبلدية القدس بحفر نفق جديد يمر تحت ساحة حائط البراق وتحت باب المغاربة ومنه إلى الحائط الجنوبي للمسجد الاقصى، وسيشكل هذا النفق امتدادًا للنفق الأول الذي تم شقه عام 1996 أسفل الحائط الغربي للمسجد الأقصى ليربط بين ساحة البراق وطريق الآلام في المدينة المقدسة."]
[1,1,"ح","2004 - الرئيس الباكستاني برفيز مشرف يحصل على ثقة البرلمان واللجان المحلية للاستمرار في منصب الرئاسة."]
[1,1,"ح","2007 - بلغاريا ورومانيا تنضمان إلى الاتحاد الأوروبي."]
[1,1,"ح","2009 - الحكومة العراقية تتسلم السيطرة على المنطقة الخضراء في بغداد من القوات متعددة الجنسيات وذلك بموجب الاتفاقية الأمنية بين العراق والولايات المتحدة، ورئيس الوزراء العراقي نوري المالكي يعتبر هذا اليوم يوم عيد."]
{"$rows_left_out":2203}
{"sheet":"salim","index":1,"n_rows":1000,"n_cols":5,"rows_kept":1000,"cut":false,"hidden":false,"merged":[[1,1,1,4]]}
[]
[null,"المطلوب عملة"]
[null,"يوم","شهر","بحث","بيان"]
["مثلا",2,1,"ح",{"$f":"IFERROR(INDEX('1'!$D$2:$D$2262,SMALL(IF('1'!$A$2:$A$2262=$B$4,IF('1'!$B$2:$B$2262=$C$4,IF('1'!$C$2:$C$2262=$D$4,ROW($A$2:$A$2262)-ROW($A$2)+1))),ROWS($E$4:E4))),\"\")","v":"1492 - نهاية الحكم الإسلامي لأيبيريا بسقوط غرناطة واستسلام ملكها أبو عبد الله محمد الثاني عشر."}]
[null,null,null,null,{"$f":"IFERROR(INDEX('1'!$D$2:$D$2262,SMALL(IF('1'!$A$2:$A$2262=$B$4,IF('1'!$B$2:$B$2262=$C$4,IF('1'!$C$2:$C$2262=$D$4,ROW($A$2:$A$2262)-ROW($A$2)+1))),ROWS($E$4:E5))),\"\")","v":"1757 - البريطانيون يستولون على مدينة كلكتا الهندية."}]
[null,null,null,null,{"$f":"IFERROR(INDEX('1'!$D$2:$D$2262,SMALL(IF('1'!$A$2:$A$2262=$B$4,IF('1'!$B$2:$B$2262=$C$4,IF('1'!$C$2:$C$2262=$D$4,ROW($A$2:$A$2262)-ROW($A$2)+1))),ROWS($E$4:E6))),\"\")","v":"1788 - جورجيا تصبح الولاية الرابعة التي تقر وتوافق على الانضمام إلى الكونفدرالية الأمريكية."}]
[null,null,null,null,{"$f":"IFERROR(INDEX('1'!$D$2:$D$2262,SMALL(IF('1'!$A$2:$A$2262=$B$4,IF('1'!$B$2:$B$2262=$C$4,IF('1'!$C$2:$C$2262=$D$4,ROW($A$2:$A$2262)-ROW($A$2)+1))),ROWS($E$4:E7))),\"\")","v":"1793 - بروسيا وروسيا تقتسمان بولندا."}]
[null,null,null,null,{"$f":"IFERROR(INDEX('1'!$D$2:$D$2262,SMALL(IF('1'!$A$2:$A$2262=$B$4,IF('1'!$B$2:$B$2262=$C$4,IF('1'!$C$2:$C$2262=$D$4,ROW($A$2:$A$2262)-ROW($A$2)+1))),ROWS($E$4:E8))),\"\")","v":"1865 - قيام الخديو إسماعيل بتأسيس الهيئة القومية للبريد المصري"}]
[null,null,null,null,{"$f":"IFERROR(INDEX('1'!$D$2:$D$2262,SMALL(IF('1'!$A$2:$A$2262=$B$4,IF('1'!$B$2:$B$2262=$C$4,IF('1'!$C$2:$C$2262=$D$4,ROW($A$2:$A$2262)-ROW($A$2)+1))),ROWS($E$4:E9))),\"\")","v":"1890 - إدارة الرئيس الأمريكي بنجامين هاريسون تعين \"أليس سانجر\" كأول امرأة تنضم إلى هيئة موظفي البيت الأبيض."}]
[null,null,null,null,{"$f":"IFERROR(INDEX('1'!$D$2:$D$2262,SMALL(IF('1'!$A$2:$A$2262=$B$4,IF('1'!$B$2:$B$2262=$C$4,IF('1'!$C$2:$C$2262=$D$4,ROW($A$2:$A$2262)-ROW($A$2)+1))),ROWS($E$4:E10))),\"\")","v":"1900 - جون هاي يعلن عن سياسة الباب المفتوح لتشجيع التجارة مع الصين."}]
[null,null,null,null,{"$f":"IFERROR(INDEX('1'!$D$2:$D$2262,SMALL(IF('1'!$A$2:$A$2262=$B$4,IF('1'!$B$2:$B$2262=$C$4,IF('1'!$C$2:$C$2262=$D$4,ROW($A$2:$A$2262)-ROW($A$2)+1))),ROWS($E$4:E11))),\"\")","v":"1929 – كندا والولايات المتحدة تتفقان على حماية شلالات نياجارا."}]
[null,null,null,null,{"$f":"IFERROR(INDEX('1'!$D$2:$D$2262,SMALL(IF('1'!$A$2:$A$2262=$B$4,IF('1'!$B$2:$B$2262=$C$4,IF('1'!$C$2:$C$2262=$D$4,ROW($A$2:$A$2262)-ROW($A$2)+1))),ROWS($E$4:E12))),\"\")","v":"1937 - إنجلترا وإيطاليا توقعان على \"اتفاق البحر المتوسط\" وصيانة استقلال إسبانيا."}]
[null,null,null,null,{"$f":"IFERROR(INDEX('1'!$D$2:$D$2262,SMALL(IF('1'!$A$2:$A$2262=$B$4,IF('1'!$B$2:$B$2262=$C$4,IF('1'!$C$2:$C$2262=$D$4,ROW($A$2:$A$2262)-ROW($A$2)+1))),ROWS($E$4:E13))),\"\")","v":"1942 - مانيلا تسقط بيد القوات اليابانبة في الحرب العالمية الثانية."}]
[null,null,null,null,{"$f":"IFERROR(INDEX('1'!$D$2:$D$2262,SMALL(IF('1'!$A$2:$A$2262=$B$4,IF('1'!$B$2:$B$2262=$C$4,IF('1'!$C$2:$C$2262=$D$4,ROW($A$2:$A$2262)-ROW($A$2)+1))),ROWS($E$4:E14))),\"\")","v":"1943 - القوات الألمانية تبدأ انسحابها من القوقاز بعد أن حاصرتهم الثلوج خلال الحرب العالمية الثانية."}]
[null,null,null,null,{"$f":"IFERROR(INDEX('1'!$D$2:$D$2262,SMALL(IF('1'!$A$2:$A$2262=$B$4,IF('1'!$B$2:$B$2262=$C$4,IF('1'!$C$2:$C$2262=$D$4,ROW($A$2:$A$2262)-ROW($A$2)+1))),ROWS($E$4:E15))),\"\")","v":"1946 - ملك ألبانيا زوغو الأول يتنازل عن العرش مع احتفاظه بحقه فيه ويبقى في الإسكندرية وذلك لعدم قدرته على العودة لبلاده التي سيطر عليها الشيوعيون."}]
[null,null,null,null,{"$f":"IFERROR(INDEX('1'!$D$2:$D$2262,SMALL(IF('1'!$A$2:$A$2262=$B$4,IF('1'!$B$2:$B$2262=$C$4,IF('1'!$C$2:$C$2262=$D$4,ROW($A$2:$A$2262)-ROW($A$2)+1))),ROWS($E$4:E16))),\"\")","v":"1947 - الزعيم الهندي مهاتما غاندي يبدأ مسيرة من أجل السلام في الهند بعد أن ظهرت بوادر الحرب الأهلية بين الهندوس والمسلمين في شبه القارة الهندية مع اقتراب الاستقلال من الاحتلال البريطاني."}]
[null,null,null,null,{"$f":"IFERROR(INDEX('1'!$D$2:$D$2262,SMALL(IF('1'!$A$2:$A$2262=$B$4,IF('1'!$B$2:$B$2262=$C$4,IF('1'!$C$2:$C$2262=$D$4,ROW($A$2:$A$2262)-ROW($A$2)+1))),ROWS($E$4:E17))),\"\")","v":"1905 - توقيع اتفاقية بورتسمث بين اليابان وروسيا لإنهاء الحرب بينهما بوساطة الرئيس الأمريكي ثيودور روزفلت."}]
[null,null,null,null,{"$f":"IFERROR(INDEX('1'!$D$2:$D$2262,SMALL(IF('1'!$A$2:$A$2262=$B$4,IF('1'!$B$2:$B$2262=$C$4,IF('1'!$C$2:$C$2262=$D$4,ROW($A$2:$A$2262)-ROW($A$2)+1))),ROWS($E$4:E18))),\"\")","v":"1964 - الفريق أيوب خان يتولى رئاسة باكستان."}]
[null,null,null,null,{"$f":"IFERROR(INDEX('1'!$D$2:$D$2262,SMALL(IF('1'!$A$2:$A$2262=$B$4,IF('1'!$B$2:$B$2262=$C$4,IF('1'!$C$2:$C$2262=$D$4,ROW($A$2:$A$2262)-ROW($A$2)+1))),ROWS($E$4:E19))),\"\")","v":"1984 - الجنرال محمدو بوهاري يعلن نفسه رئيسًا لنيجيريا."}]
[null,null,null,null,{"$f":"IFERROR(INDEX('1'!$D$2:$D$2262,SMALL(IF('1'!$A$2:$A$2262=$B$4,IF('1'!$B$2:$B$2262=$C$4,IF('1'!$C$2:$C$2262=$D$4,ROW($A$2:$A$2262)-ROW($A$2)+1))),ROWS($E$4:E20))),\"\")","v":"1986 - افتتاح المسرح القومي في مصر بعد إعادة تجديده."}]
[null,null,null,null,{"$f":"IFERROR(INDEX('1'!$D$2:$D$2262,SMALL(IF('1'!$A$2:$A$2262=$B$4,IF('1'!$B$2:$B$2262=$C$4,IF('1'!$C$2:$C$2262=$D$4,ROW($A$2:$A$2262)-ROW($A$2)+1))),ROWS($E$4:E21))),\"\")","v":"2006 - عناصر من أمناء جبل الهيكل يؤدون طقوسًا دينية تدعو لهدم المسجد الأقصى وعدم تقسيم القدس، ويعتدون على عدد من الشبان الفلسطينيين في باب الخليل والواد بالبلدة القديمة ويحاولون اقتحام المسجد الأقصى."}]
[null,null,null,null,{"$f":"IFERROR(INDEX('1'!$D$2:$D$2262,SMALL(IF('1'!$A$2:$A$2262=$B$4,IF('1'!$B$2:$B$2262=$C$4,IF('1'!$C$2:$C$2262=$D$4,ROW($A$2:$A$2262)-ROW($A$2)+1))),ROWS($E$4:E22))),\"\")","v":"2007 - بان كي مون يستلم مهامه كأمين عام للأمم المتحدة من سلفه كوفي عنان."}]
[null,null,null,null,{"$f":"IFERROR(INDEX('1'!$D$2:$D$2262,SMALL(IF('1'!$A$2:$A$2262=$B$4,IF('1'!$B$2:$B$2262=$C$4,IF('1'!$C$2:$C$2262=$D$4,ROW($A$2:$A$2262)-ROW($A$2)+1))),ROWS($E$4:E23))),\"\")","v":"2009 - الشيخ سعود بن راشد المعلا يتولى حكم إمارة أم القيوين خلفًا لوالده الشيخ راشد بن أحمد المعلا."}]
[null,null,null,null,{"$f":"IFERROR(INDEX('1'!$D$2:$D$2262,SMALL(IF('1'!$A$2:$A$2262=$B$4,IF('1'!$B$2:$B$2262=$C$4,IF('1'!$C$2:$C$2262=$D$4,ROW($A$2:$A$2262)-ROW($A$2)+1))),ROWS($E$4:E24))),\"\")","v":"2014 - حزب رابطة عوامي البنغلاديشي يفوز في الانتخابات العامة وسط أعمال عنف."}]
[null,null,null,null,{"$f":"IFERROR(INDEX('1'!$D$2:$D$2262,SMALL(IF('1'!$A$2:$A$2262=$B$4,IF('1'!$B$2:$B$2262=$C$4,IF('1'!$C$2:$C$2262=$D$4,ROW($A$2:$A$2262)-ROW($A$2)+1))),ROWS($E$4:E25))),\"\")","v":"2016 - إحراق السفارة السعودية في طهران، بعد إعدام السلطات السعودية 47 متهماً بالإرهاب من بينهم عالم الدين المعارض نمر النمر."}]
[null,null,null,null,{"$f":"IFERROR(INDEX('1'!$D$2:$D$2262,SMALL(IF('1'!$A$2:$A$2262=$B$4,IF('1'!$B$2:$B$2262=$C$4,IF('1'!$C$2:$C$2262=$D$4,ROW($A$2:$A$2262)-ROW($A$2)+1))),ROWS($E$4:E26))),\"\")","v":""}]
[null,null,null,null,{"$f":"IFERROR(INDEX('1'!$D$2:$D$2262,SMALL(IF('1'!$A$2:$A$2262=$B$4,IF('1'!$B$2:$B$2262=$C$4,IF('1'!$C$2:$C$2262=$D$4,ROW($A$2:$A$2262)-ROW($A$2)+1))),ROWS($E$4:E27))),\"\")","v":""}]
[null,null,null,null,{"$f":"IFERROR(INDEX('1'!$D$2:$D$2262,SMALL(IF('1'!$A$2:$A$2262=$B$4,IF('1'!$B$2:$B$2262=$C$4,IF('1'!$C$2:$C$2262=$D$4,ROW($A$2:$A$2262)-ROW($A$2)+1))),ROWS($E$4:E28))),\"\")","v":""}]
[null,null,null,null,{"$f":"IFERROR(INDEX('1'!$D$2:$D$2262,SMALL(IF('1'!$A$2:$A$2262=$B$4,IF('1'!$B$2:$B$2262=$C$4,IF('1'!$C$2:$C$2262=$D$4,ROW($A$2:$A$2262)-ROW($A$2)+1))),ROWS($E$4:E29))),\"\")","v":""}]
[null,null,null,null,{"$f":"IFERROR(INDEX('1'!$D$2:$D$2262,SMALL(IF('1'!$A$2:$A$2262=$B$4,IF('1'!$B$2:$B$2262=$C$4,IF('1'!$C$2:$C$2262=$D$4,ROW($A$2:$A$2262)-ROW($A$2)+1))),ROWS($E$4:E30))),\"\")","v":""}]
[null,null,null,null,{"$f":"IFERROR(INDEX('1'!$D$2:$D$2262,SMALL(IF('1'!$A$2:$A$2262=$B$4,IF('1'!$B$2:$B$2262=$C$4,IF('1'!$C$2:$C$2262=$D$4,ROW($A$2:$A$2262)-ROW($A$2)+1))),ROWS($E$4:E31))),\"\")","v":""}]
[null,null,null,null,{"$f":"IFERROR(INDEX('1'!$D$2:$D$2262,SMALL(IF('1'!$A$2:$A$2262=$B$4,IF('1'!$B$2:$B$2262=$C$4,IF('1'!$C$2:$C$2262=$D$4,ROW($A$2:$A$2262)-ROW($A$2)+1))),ROWS($E$4:E32))),\"\")","v":""}]
[null,null,null,null,{"$f":"IFERROR(INDEX('1'!$D$2:$D$2262,SMALL(IF('1'!$A$2:$A$2262=$B$4,IF('1'!$B$2:$B$2262=$C$4,IF('1'!$C$2:$C$2262=$D$4,ROW($A$2:$A$2262)-ROW($A$2)+1))),ROWS($E$4:E33))),\"\")","v":""}]
[null,null,null,null,{"$f":"IFERROR(INDEX('1'!$D$2:$D$2262,SMALL(IF('1'!$A$2:$A$2262=$B$4,IF('1'!$B$2:$B$2262=$C$4,IF('1'!$C$2:$C$2262=$D$4,ROW($A$2:$A$2262)-ROW($A$2)+1))),ROWS($E$4:E34))),\"\")","v":""}]
[null,null,null,null,{"$f":"IFERROR(INDEX('1'!$D$2:$D$2262,SMALL(IF('1'!$A$2:$A$2262=$B$4,IF('1'!$B$2:$B$2262=$C$4,IF('1'!$C$2:$C$2262=$D$4,ROW($A$2:$A$2262)-ROW($A$2)+1))),ROWS($E$4:E35))),\"\")","v":""}]
[null,null,null,null,{"$f":"IFERROR(INDEX('1'!$D$2:$D$2262,SMALL(IF('1'!$A$2:$A$2262=$B$4,IF('1'!$B$2:$B$2262=$C$4,IF('1'!$C$2:$C$2262=$D$4,ROW($A$2:$A$2262)-ROW($A$2)+1))),ROWS($E$4:E36))),\"\")","v":""}]
[null,null,null,null,{"$f":"IFERROR(INDEX('1'!$D$2:$D$2262,SMALL(IF('1'!$A$2:$A$2262=$B$4,IF('1'!$B$2:$B$2262=$C$4,IF('1'!$C$2:$C$2262=$D$4,ROW($A$2:$A$2262)-ROW($A$2)+1))),ROWS($E$4:E37))),\"\")","v":""}]
[null,null,null,null,{"$f":"IFERROR(INDEX('1'!$D$2:$D$2262,SMALL(IF('1'!$A$2:$A$2262=$B$4,IF('1'!$B$2:$B$2262=$C$4,IF('1'!$C$2:$C$2262=$D$4,ROW($A$2:$A$2262)-ROW($A$2)+1))),ROWS($E$4:E38))),\"\")","v":""}]
[null,null,null,null,{"$f":"IFERROR(INDEX('1'!$D$2:$D$2262,SMALL(IF('1'!$A$2:$A$2262=$B$4,IF('1'!$B$2:$B$2262=$C$4,IF('1'!$C$2:$C$2262=$D$4,ROW($A$2:$A$2262)-ROW($A$2)+1))),ROWS($E$4:E39))),\"\")","v":""}]
[null,null,null,null,{"$f":"IFERROR(INDEX('1'!$D$2:$D$2262,SMALL(IF('1'!$A$2:$A$2262=$B$4,IF('1'!$B$2:$B$2262=$C$4,IF('1'!$C$2:$C$2262=$D$4,ROW($A$2:$A$2262)-ROW($A$2)+1))),ROWS($E$4:E40))),\"\")","v":""}]
[null,null,null,null,{"$f":"IFERROR(INDEX('1'!$D$2:$D$2262,SMALL(IF('1'!$A$2:$A$2262=$B$4,IF('1'!$B$2:$B$2262=$C$4,IF('1'!$C$2:$C$2262=$D$4,ROW($A$2:$A$2262)-ROW($A$2)+1))),ROWS($E$4:E41))),\"\")","v":""}]
[null,null,null,null,{"$f":"IFERROR(INDEX('1'!$D$2:$D$2262,SMALL(IF('1'!$A$2:$A$2262=$B$4,IF('1'!$B$2:$B$2262=$C$4,IF('1'!$C$2:$C$2262=$D$4,ROW($A$2:$A$2262)-ROW($A$2)+1))),ROWS($E$4:E42))),\"\")","v":""}]
[null,null,null,null,{"$f":"IFERROR(INDEX('1'!$D$2:$D$2262,SMALL(IF('1'!$A$2:$A$2262=$B$4,IF('1'!$B$2:$B$2262=$C$4,IF('1'!$C$2:$C$2262=$D$4,ROW($A$2:$A$2262)-ROW($A$2)+1))),ROWS($E$4:E43))),\"\")","v":""}]
[null,null,null,null,{"$f":"IFERROR(INDEX('1'!$D$2:$D$2262,SMALL(IF('1'!$A$2:$A$2262=$B$4,IF('1'!$B$2:$B$2262=$C$4,IF('1'!$C$2:$C$2262=$D$4,ROW($A$2:$A$2262)-ROW($A$2)+1))),ROWS($E$4:E44))),\"\")","v":""}]
[null,null,null,null,{"$f":"IFERROR(INDEX('1'!$D$2:$D$2262,SMALL(IF('1'!$A$2:$A$2262=$B$4,IF('1'!$B$2:$B$2262=$C$4,IF('1'!$C$2:$C$2262=$D$4,ROW($A$2:$A$2262)-ROW($A$2)+1))),ROWS($E$4:E45))),\"\")","v":""}]
[null,null,null,null,{"$f":"IFERROR(INDEX('1'!$D$2:$D$2262,SMALL(IF('1'!$A$2:$A$2262=$B$4,IF('1'!$B$2:$B$2262=$C$4,IF('1'!$C$2:$C$2262=$D$4,ROW($A$2:$A$2262)-ROW($A$2)+1))),ROWS($E$4:E46))),\"\")","v":""}]
[null,null,null,null,{"$f":"IFERROR(INDEX('1'!$D$2:$D$2262,SMALL(IF('1'!$A$2:$A$2262=$B$4,IF('1'!$B$2:$B$2262=$C$4,IF('1'!$C$2:$C$2262=$D$4,ROW($A$2:$A$2262)-ROW($A$2)+1))),ROWS($E$4:E47))),\"\")","v":""}]
[null,null,null,null,{"$f":"IFERROR(INDEX('1'!$D$2:$D$2262,SMALL(IF('1'!$A$2:$A$2262=$B$4,IF('1'!$B$2:$B$2262=$C$4,IF('1'!$C$2:$C$2262=$D$4,ROW($A$2:$A$2262)-ROW($A$2)+1))),ROWS($E$4:E48))),\"\")","v":""}]
[null,null,null,null,{"$f":"IFERROR(INDEX('1'!$D$2:$D$2262,SMALL(IF('1'!$A$2:$A$2262=$B$4,IF('1'!$B$2:$B$2262=$C$4,IF('1'!$C$2:$C$2262=$D$4,ROW($A$2:$A$2262)-ROW($A$2)+1))),ROWS($E$4:E49))),\"\")","v":""}]
[null,null,null,null,{"$f":"IFERROR(INDEX('1'!$D$2:$D$2262,SMALL(IF('1'!$A$2:$A$2262=$B$4,IF('1'!$B$2:$B$2262=$C$4,IF('1'!$C$2:$C$2262=$D$4,ROW($A$2:$A$2262)-ROW($A$2)+1))),ROWS($E$4:E50))),\"\")","v":""}]
[null,null,null,null,{"$f":"IFERROR(INDEX('1'!$D$2:$D$2262,SMALL(IF('1'!$A$2:$A$2262=$B$4,IF('1'!$B$2:$B$2262=$C$4,IF('1'!$C$2:$C$2262=$D$4,ROW($A$2:$A$2262)-ROW($A$2)+1))),ROWS($E$4:E51))),\"\")","v":""}]
[null,null,null,null,{"$f":"IFERROR(INDEX('1'!$D$2:$D$2262,SMALL(IF('1'!$A$2:$A$2262=$B$4,IF('1'!$B$2:$B$2262=$C$4,IF('1'!$C$2:$C$2262=$D$4,ROW($A$2:$A$2262)-ROW($A$2)+1))),ROWS($E$4:E52))),\"\")","v":""}]
[null,null,null,null,{"$f":"IFERROR(INDEX('1'!$D$2:$D$2262,SMALL(IF('1'!$A$2:$A$2262=$B$4,IF('1'!$B$2:$B$2262=$C$4,IF('1'!$C$2:$C$2262=$D$4,ROW($A$2:$A$2262)-ROW($A$2)+1))),ROWS($E$4:E53))),\"\")","v":""}]
[null,null,null,null,{"$f":"IFERROR(INDEX('1'!$D$2:$D$2262,SMALL(IF('1'!$A$2:$A$2262=$B$4,IF('1'!$B$2:$B$2262=$C$4,IF('1'!$C$2:$C$2262=$D$4,ROW($A$2:$A$2262)-ROW($A$2)+1))),ROWS($E$4:E54))),\"\")","v":""}]
[null,null,null,null,{"$f":"IFERROR(INDEX('1'!$D$2:$D$2262,SMALL(IF('1'!$A$2:$A$2262=$B$4,IF('1'!$B$2:$B$2262=$C$4,IF('1'!$C$2:$C$2262=$D$4,ROW($A$2:$A$2262)-ROW($A$2)+1))),ROWS($E$4:E55))),\"\")","v":""}]
[null,null,null,null,{"$f":"IFERROR(INDEX('1'!$D$2:$D$2262,SMALL(IF('1'!$A$2:$A$2262=$B$4,IF('1'!$B$2:$B$2262=$C$4,IF('1'!$C$2:$C$2262=$D$4,ROW($A$2:$A$2262)-ROW($A$2)+1))),ROWS($E$4:E56))),\"\")","v":""}]
[null,null,null,null,{"$f":"IFERROR(INDEX('1'!$D$2:$D$2262,SMALL(IF('1'!$A$2:$A$2262=$B$4,IF('1'!$B$2:$B$2262=$C$4,IF('1'!$C$2:$C$2262=$D$4,ROW($A$2:$A$2262)-ROW($A$2)+1))),ROWS($E$4:E57))),\"\")","v":""}]
[null,null,null,null,{"$f":"IFERROR(INDEX('1'!$D$2:$D$2262,SMALL(IF('1'!$A$2:$A$2262=$B$4,IF('1'!$B$2:$B$2262=$C$4,IF('1'!$C$2:$C$2262=$D$4,ROW($A$2:$A$2262)-ROW($A$2)+1))),ROWS($E$4:E58))),\"\")","v":""}]
[null,null,null,null,{"$f":"IFERROR(INDEX('1'!$D$2:$D$2262,SMALL(IF('1'!$A$2:$A$2262=$B$4,IF('1'!$B$2:$B$2262=$C$4,IF('1'!$C$2:$C$2262=$D$4,ROW($A$2:$A$2262)-ROW($A$2)+1))),ROWS($E$4:E59))),\"\")","v":""}]
[null,null,null,null,{"$f":"IFERROR(INDEX('1'!$D$2:$D$2262,SMALL(IF('1'!$A$2:$A$2262=$B$4,IF('1'!$B$2:$B$2262=$C$4,IF('1'!$C$2:$C$2262=$D$4,ROW($A$2:$A$2262)-ROW($A$2)+1))),ROWS($E$4:E60))),\"\")","v":""}]
{"$rows_left_out":941}
{"sheet":"Auto_filt","index":2,"n_rows":46,"n_cols":12,"rows_kept":46,"cut":false,"hidden":false,"merged":[]}
[]
["يوم","شهر","بحث","بيان",null,null,null,null,null,"يوم","شهر","بحث"]
[1,1,"ح","1259 - سيف الدين قطز يخلع نور الدين علي بن أيبك ويتسلم الحكم سلطانًا على مصر.",null,null,null,null,null,1,1,"ح"]
[1,1,"ح","1531 - تأسيس مدينة ريو دي جانيرو على المحيط الأطلسي."]
[1,1,"ح","1651 - شارل الثاني يتولى الحكم في اسكتلندا."]
[1,1,"ح","1673 - بداية التوزيع النظامي للبريد بين نيويورك وبوسطن."]
[1,1,"ح","1956 - استقلال السودان عن مصر والمملكة المتحدة وإعلان الجمهورية."]
[1,1,"ح","1958 - قيام السوق الأوروبية المشتركة."]
[1,1,"ح","1959 - القوات الموالية لفيدل كاسترو تزيح فولجينسيو باتيستا من منصب رئاسة كوبا إثر انقلاب عسكري."]
[1,1,"ح","1960 -  استقلال الكاميرون."]
[1,1,"ح","1960 -  رئيس الوزراء العراق عبد الكريم قاسم يسمح بعودة الأحزاب السياسية ماعدا الحزب الشيوعي."]
[1,1,"ح","1962 -  رئيس الوزراء السوري معروف الدواليبي يعلن عن توسط سوريا لحل النزاع الكويتي العراقي."]
[1,1,"ح","1962 - استقلال ساموا الغربية عن نيوزيلندا."]
[1,1,"ح","1964 - انقسام \"فيدرالية روديسيا ونيازالاند\" إلى جمهورية زامبيا المستقلة والتي كانت تحمل اسم \"روديسيا الشمالية\"، وجمهورية ملاوي المستقلة والتي كانت تحمل اسم \"نيازالاند\"، وبقاء روديسيا الجنوبية كمستعمرة بريطانية."]
[1,1,"ح","1965 - صدور البيان الأول لحركة فتح الفلسطينية وبداية الثورة المسلحة."]
[1,1,"ح","1966 - جان بيدل بوكاسا يقوم بانقاب عسكري في جمهورية أفريقيا الوسطى."]
[1,1,"ح","1971 - منع بث اللوحات الدعائية في التلفزيون الأمريكي التي تروج للسجائر."]
[1,1,"ح","1972 - بداية الوحدة الرسمية بين مصر وليبيا."]
[1,1,"ح","1976 - تفجير طائرة تابعة لطيران الشرق الأوسط كانت مقلعة من بيروت باتجاه إمارة دبي، وقد سقطت بالقرب من القيصومة في السعودية."]
[1,1,"ح","1978 - انفجار طائرة هندية من نوع بوينغ 747 وسقوطها قبالة سواحل مدينة مومباي مما أدى إلى مقتل 213 شخص."]
[1,1,"ح","1980 - أمين عام الأمم المتحدة كورت فالدهايم يزور إيران لبحث الإفراج عن الرهائن الأمريكيين المحتجزين داخل السفارة الأمريكية بطهران."]
[1,1,"ح","1982 - إقالة مستشار الأمن القومي الأمريكي ريتشارد ألن لتورطه في قضية الرشوة اليابانية."]
[1,1,"ح","1984 - استقلال سلطنة بروناي عن المملكة المتحدة."]
[1,1,"ح","1985 - إجراء أول مكالمة بهاتف نقال في المملكة المتحدة."]
[1,1,"ح","1993 -  تفكك جمهورية تشيكوسلوفاكيا وتأسيس دولتان مستقلتان هما التشيك وسلوفاكيا."]
[1,1,"ح","1993 -  الرئيسان جورج بوش وبوريس يلتسن يوقعان اتفاقية ستارت الثانية لتخفيض الأسلحة النووية."]
[1,1,"ح","1993 - بدء بث قناة يورونيوز التلفزيونية الإخبارية الأوروبية متعددة اللغات."]
[1,1,"ح","1994 - دخول اتفاق التبادل الحر لأمريكا الشمالية / نافتا حيز التنفيذ بين المكسيك والولايات المتحدة وكندا."]
[1,1,"ح","1995 - دخول اتفاقية منظمة التجارة العالمية حيز التنفيذ."]
[1,1,"ح","1995 - السويد والنمسا وفنلندا ينضمون إلى الاتحاد الأوروبي."]
[1,1,"ح","1998 - منع التدخين بالمطاعم والحانات بكاليفورنيا."]
[1,1,"ح","1999 - بداية التعامل بالعملة الأوروبية المشتركة / يورو."]
[1,1,"ح","2001 - انضمام اليونان إلى منطقة التداول باليورو."]
[1,1,"ح","2004 - مؤسسة الأقصى لإعمار المقدسات تكشف عن مخطط لبلدية القدس بحفر نفق جديد يمر تحت ساحة حائط البراق وتحت باب المغاربة ومنه إلى الحائط الجنوبي للمسجد الاقصى، وسيشكل هذا النفق امتدادًا للنفق الأول الذي تم شقه عام 1996 أسفل الحائط الغربي للمسجد الأقصى ليربط بين ساحة البراق وطريق الآلام في المدينة المقدسة."]
[1,1,"ح","2004 - الرئيس الباكستاني برفيز مشرف يحصل على ثقة البرلمان واللجان المحلية للاستمرار في منصب الرئاسة."]
[1,1,"ح","2007 - بلغاريا ورومانيا تنضمان إلى الاتحاد الأوروبي."]
[1,1,"ح","2009 - الحكومة العراقية تتسلم السيطرة على المنطقة الخضراء في بغداد من القوات متعددة الجنسيات وذلك بموجب الاتفاقية الأمنية بين العراق والولايات المتحدة، ورئيس الوزراء العراقي نوري المالكي يعتبر هذا اليوم يوم عيد."]
[1,1,"ح","2009 - اغتيال القيادي في حركة حماس نزار ريان مع زوجاته الأربع و9 من أبنائه في هجوم جوي إسرائيلي على منزله في جباليا وذلك ضمن أحداث عملية الرصاص المسكوب."]
[1,1,"ح","2011 - تفجير بواسطة سيارة مفخخة يستهدف كنيسة في منطقة سيدي بشر بالإسكندرية مع أول دقائق العام الجديد، وأدى الحادث إلى سقوط عدد من القتلى والجرحى."]
[1,1,"ح","2011 - ديلما روسيف تؤدي اليمين الدستورية لتصبح أول امرأة تتولى الرئاسة في البرازيل."]
[1,1,"ح","2014 - لاتفيا تصبح الدولة الثامنة عشرة التي تعتمد اليورو."]
[1,1,"ح","2015 - ليتوانيا تصبح العضو التاسع عشر (19) في منطقة اليورو."]
[1,1,"ح","2015 - تعيين ميكائيل جان في منصب أمين عام المنظمة الدولية للفرنكوفونية."]
[1,1,"ح","2017 - تفجير انتحاري في مدينة طرطوس السورية، يتسبب بمقتل شخصين."]
[1,1,"ح","2017 - هجوم مسلح على ملهى ليلي بمدينة إسطنبول يخلف أكثر من 35 قتيل وحوالي 40 جريحا."]
[1,1,"ح","2018 - الرئيس السوري بشار الأسد يصدر مرسوماً يقضي بإجراء تعديل حكومي يشمل وزراء الدفاع والصناعة والإعلام."]