{"text_format":"1","workbook":"xlsx","n_sheets":4,"sheets":["المعلومات ","التفاصيل","البيانات","اسماء الزبائن والجهات "],"not_rendered":{"charts":0,"images":0,"macros":1,"external_links":3,"defined_names":14,"comments":0,"pivot_tables":0},"unopened":[],"bounds":{"document_bytes":16777216,"sheet_cells":100000,"rows_first":2000,"rows_last":500,"rows_between":2000,"halvings":0,"cell_chars":16384,"cell_head_chars":4096},"cells_cut":0,"cells_raw":0,"read":"whole","date_system":"1900"}

{"sheet":"المعلومات ","index":0,"n_rows":11,"n_cols":7,"rows_kept":11,"cut":false,"hidden":false,"merged":[]}
["التاريخ","رقم الأمر","الجهة ","اسم الزبون","النوع","الملاحظات ","كود المصنع"]
["2018-01-01",1,"الزبون 1","خالد ","ابواب",null,"AB35-AB14"]
["2018-01-01",1,"الزبون 2","محمد ","كابينات",null,"KH03"]
["2018-01-01",1,"الزبون 3","حسن ","كورين ",null,"F01"]
["2018-01-01",2,"الزبون 4","عبد الله ","كابينات",null,"KH01"]
["2018-01-01",3,"الزبون 5","سعيد ","ابواب",null,"AB01"]
["2018-01-01",3,"الزبون 6","محمد ","كابينات",null,"KH02"]
["2018-01-01",3,"الزبون 7","حسن ","كوارتز",null,"CD03 "]
["2018-01-03",4,"الزبون 8","عبد الله ","ابواب",null,"AB15"]
["2018-01-03",4,"الزبون 9","سعيد ","كابينات",null,"KH04"]
["2018-01-03",4,null,"مهند علاء Z66","كوارتز",null,"CD04"]

{"sheet":"التفاصيل","index":1,"n_rows":843,"n_cols":10,"rows_kept":843,"cut":false,"hidden":false,"merged":[]}
["نوع الكابينة ","مبلغ التكلفة ","العدد","المساحة","PVC","الظهر","اجمالي التكلفة ","اجمالي البيع ","الربح","رقم الفاتورة "]
["AW 50*33*90",{"$f":"IFERROR(VLOOKUP($A2,البيانات!$B$2:$L$7,11,FALSE),\"\")","v":""},1,{"$f":"IFERROR(VLOOKUP($A2,البيانات!$B$2:$L$7,2,FALSE)*C:C,\"\")","v":""},{"$f":"IFERROR(VLOOKUP($A2,البيانات!$B$2:$L$7,3,FALSE)*C:C,\"\")","v":""},{"$f":"IFERROR(VLOOKUP($A2,البيانات!$B$2:$L$7,4,FALSE)*C:C,\"\")","v":""},{"$f":"IFERROR(C2*B2,\"\")","v":""},27.5,{"$f":"IFERROR(H2-G2,\"\")","v":""}]
["AW 45*33*90",{"$f":"IFERROR(VLOOKUP($A3,البيانات!$B$2:$L$7,11,FALSE),\"\")","v":""},1,{"$f":"IFERROR(VLOOKUP($A3,البيانات!$B$2:$L$7,2,FALSE)*C:C,\"\")","v":""},{"$f":"IFERROR(VLOOKUP($A3,البيانات!$B$2:$L$7,3,FALSE)*C:C,\"\")","v":""},{"$f":"IFERROR(VLOOKUP($A3,البيانات!$B$2:$L$7,4,FALSE)*C:C,\"\")","v":""},{"$f":"IFERROR(C3*B3,\"\")","v":""},26.35,{"$f":"IFERROR(H3-G3,\"\")","v":""}]
["AW 50*33*75",{"$f":"IFERROR(VLOOKUP($A4,البيانات!$B$2:$L$7,11,FALSE),\"\")","v":""},1,{"$f":"IFERROR(VLOOKUP($A4,البيانات!$B$2:$L$7,2,FALSE)*C:C,\"\")","v":""},{"$f":"IFERROR(VLOOKUP($A4,البيانات!$B$2:$L$7,3,FALSE)*C:C,\"\")","v":""},{"$f":"IFERROR(VLOOKUP($A4,البيانات!$B$2:$L$7,4,FALSE)*C:C,\"\")","v":""},"",23.12,""]
["AW 45*33*75",{"$f":"IFERROR(VLOOKUP($A5,البيانات!$B$2:$L$7,11,FALSE),\"\")","v":""},1,{"$f":"IFERROR(VLOOKUP($A5,البيانات!$B$2:$L$7,2,FALSE)*C:C,\"\")","v":""},{"$f":"IFERROR(VLOOKUP($A5,البيانات!$B$2:$L$7,3,FALSE)*C:C,\"\")","v":""},{"$f":"IFERROR(VLOOKUP($A5,البيانات!$B$2:$L$7,4,FALSE)*C:C,\"\")","v":""},"",22.38,""]
["AW 50*33*75",{"$f":"IFERROR(VLOOKUP($A6,البيانات!$B$2:$L$7,11,FALSE),\"\")","v":""},1,{"$f":"IFERROR(VLOOKUP($A6,البيانات!$B$2:$L$7,2,FALSE)*C:C,\"\")","v":""},{"$f":"IFERROR(VLOOKUP($A6,البيانات!$B$2:$L$7,3,FALSE)*C:C,\"\")","v":""},{"$f":"IFERROR(VLOOKUP($A6,البيانات!$B$2:$L$7,4,FALSE)*C:C,\"\")","v":""},"",23.12,""]
["ATWC 60*60*33*75",{"$f":"IFERROR(VLOOKUP($A7,البيانات!$B$2:$L$7,11,FALSE),\"\")","v":""},1,{"$f":"IFERROR(VLOOKUP($A7,البيانات!$B$2:$L$7,2,FALSE)*C:C,\"\")","v":""},{"$f":"IFERROR(VLOOKUP($A7,البيانات!$B$2:$L$7,3,FALSE)*C:C,\"\")","v":""},{"$f":"IFERROR(VLOOKUP($A7,البيانات!$B$2:$L$7,4,FALSE)*C:C,\"\")","v":""},"",37.6,""]
["AB 100*56*75",{"$f":"IFERROR(VLOOKUP($A8,البيانات!$B$2:$L$7,11,FALSE),\"\")","v":20.286000000000001},1,{"$f":"IFERROR(VLOOKUP($A8,البيانات!$B$2:$L$7,2,FALSE)*C:C,\"\")","v":2.1},{"$f":"IFERROR(VLOOKUP($A8,البيانات!$B$2:$L$7,3,FALSE)*C:C,\"\")","v":14.7},{"$f":"IFERROR(VLOOKUP($A8,البيانات!$B$2:$L$7,4,FALSE)*C:C,\"\")","v":0.63},20.286000000000001,21.69,1.4039999999999999]
[null,{"$f":"IFERROR(VLOOKUP($A9,البيانات!$B$2:$L$7,11,FALSE),\"\")","v":""},null,{"$f":"IFERROR(VLOOKUP($A9,البيانات!$B$2:$L$7,2,FALSE)*C:C,\"\")","v":""},{"$f":"IFERROR(VLOOKUP($A9,البيانات!$B$2:$L$7,3,FALSE)*C:C,\"\")","v":""},{"$f":"IFERROR(VLOOKUP($A9,البيانات!$B$2:$L$7,4,FALSE)*C:C,\"\")","v":""},{"$f":"IFERROR(C9*B9,\"\")","v":""},null,{"$f":"IFERROR(H9-G9,\"\")","v":""}]
[null,{"$f":"IFERROR(VLOOKUP($A10,البيانات!$B$2:$L$7,11,FALSE),\"\")","v":""},null,{"$f":"IFERROR(VLOOKUP($A10,البيانات!$B$2:$L$7,2,FALSE)*C:C,\"\")","v":""},{"$f":"IFERROR(VLOOKUP($A10,البيانات!$B$2:$L$7,3,FALSE)*C:C,\"\")","v":""},{"$f":"IFERROR(VLOOKUP($A10,البيانات!$B$2:$L$7,4,FALSE)*C:C,\"\")","v":""},"",null,""]
[null,{"$f":"IFERROR(VLOOKUP($A11,البيانات!$B$2:$L$7,11,FALSE),\"\")","v":""},null,{"$f":"IFERROR(VLOOKUP($A11,البيانات!$B$2:$L$7,2,FALSE)*C:C,\"\")","v":""},{"$f":"IFERROR(VLOOKUP($A11,البيانات!$B$2:$L$7,3,FALSE)*C:C,\"\")","v":""},{"$f":"IFERROR(VLOOKUP($A11,البيانات!$B$2:$L$7,4,FALSE)*C:C,\"\")","v":""},"",null,""]
[null,{"$f":"IFERROR(VLOOKUP($A12,البيانات!$B$2:$L$7,11,FALSE),\"\")","v":""},null,{"$f":"IFERROR(VLOOKUP($A12,البيانات!$B$2:$L$7,2,FALSE)*C:C,\"\")","v":""},{"$f":"IFERROR(VLOOKUP($A12,البيانات!$B$2:$L$7,3,FALSE)*C:C,\"\")","v":""},{"$f":"IFERROR(VLOOKUP($A12,البيانات!$B$2:$L$7,4,FALSE)*C:C,\"\")","v":""},"",null,""]
[null,{"$f":"IFERROR(VLOOKUP($A13,البيانات!$B$2:$L$7,11,FALSE),\"\")","v":""},null,{"$f":"IFERROR(VLOOKUP($A13,البيانات!$B$2:$L$7,2,FALSE)*C:C,\"\")","v":""},{"$f":"IFERROR(VLOOKUP($A13,البيانات!$B$2:$L$7,3,FALSE)*C:C,\"\")","v":""},{"$f":"IFERROR(VLOOKUP($A13,البيانات!$B$2:$L$7,4,FALSE)*C:C,\"\")","v":""},"",null,""]
[null,{"$f":"IFERROR(VLOOKUP($A14,البيانات!$B$2:$L$7,11,FALSE),\"\")","v":""},null,{"$f":"IFERROR(VLOOKUP($A14,البيانات!$B$2:$L$7,2,FALSE)*C:C,\"\")","v":""},{"$f":"IFERROR(VLOOKUP($A14,البيانات!$B$2:$L$7,3,FALSE)*C:C,\"\")","v":""},{"$f":"IFERROR(VLOOKUP($A14,البيانات!$B$2:$L$7,4,FALSE)*C:C,\"\")","v":""},"",null,""]
[null,{"$f":"IFERROR(VLOOKUP($A15,البيانات!$B$2:$L$7,11,FALSE),\"\")","v":""},null,{"$f":"IFERROR(VLOOKUP($A15,البيانات!$B$2:$L$7,2,FALSE)*C:C,\"\")","v":""},{"$f":"IFERROR(VLOOKUP($A15,البيانات!$B$2:$L$7,3,FALSE)*C:C,\"\")","v":""},{"$f":"IFERROR(VLOOKUP($A15,البيانات!$B$2:$L$7,4,FALSE)*C:C,\"\")","v":""},"",null,""]
[null,{"$f":"IFERROR(VLOOKUP($A16,البيانات!$B$2:$L$7,11,FALSE),\"\")","v":""},null,{"$f":"IFERROR(VLOOKUP($A16,البيانات!$B$2:$L$7,2,FALSE)*C:C,\"\")","v":""},{"$f":"IFERROR(VLOOKUP($A16,البيانات!$B$2:$L$7,3,FALSE)*C:C,\"\")","v":""},{"$f":"IFERROR(VLOOKUP($A16,البيانات!$B$2:$L$7,4,FALSE)*C:C,\"\")","v":""},"",null,""]
[null,{"$f":"IFERROR(VLOOKUP($A17,البيانات!$B$2:$L$7,11,FALSE),\"\")","v":""},null,{"$f":"IFERROR(VLOOKUP($A17,البيانات!$B$2:$L$7,2,FALSE)*C:C,\"\")","v":""},{"$f":"IFERROR(VLOOKUP($A17,البيانات!$B$2:$L$7,3,FALSE)*C:C,\"\")","v":""},{"$f":"IFERROR(VLOOKUP($A17,البيانات!$B$2:$L$7,4,FALSE)*C:C,\"\")","v":""},"",null,""]
[null,{"$f":"IFERROR(VLOOKUP($A18,البيانات!$B$2:$L$7,11,FALSE),\"\")","v":""},null,{"$f":"IFERROR(VLOOKUP($A18,البيانات!$B$2:$L$7,2,FALSE)*C:C,\"\")","v":""},{"$f":"IFERROR(VLOOKUP($A18,البيانات!$B$2:$L$7,3,FALSE)*C:C,\"\")","v":""},{"$f":"IFERROR(VLOOKUP($A18,البيانات!$B$2:$L$7,4,FALSE)*C:C,\"\")","v":""},"",null,""]
[null,{"$f":"IFERROR(VLOOKUP($A19,البيانات!$B$2:$L$7,11,FALSE),\"\")","v":""},null,{"$f":"IFERROR(VLOOKUP($A19,البيانات!$B$2:$L$7,2,FALSE)*C:C,\"\")","v":""},{"$f":"IFERROR(VLOOKUP($A19,البيانات!$B$2:$L$7,3,FALSE)*C:C,\"\")","v":""},{"$f":"IFERROR(VLOOKUP($A19,البيانات!$B$2:$L$7,4,FALSE)*C:C,\"\")","v":""},"",null,""]
[null,{"$f":"IFERROR(VLOOKUP($A20,البيانات!$B$2:$L$7,11,FALSE),\"\")","v":""},null,{"$f":"IFERROR(VLOOKUP($A20,البيانات!$B$2:$L$7,2,FALSE)*C:C,\"\")","v":""},{"$f":"IFERROR(VLOOKUP($A20,البيانات!$B$2:$L$7,3,FALSE)*C:C,\"\")","v":""},{"$f":"IFERROR(VLOOKUP($A20,البيانات!$B$2:$L$7,4,FALSE)*C:C,\"\")","v":""},"",null,""]
[null,{"$f":"IFERROR(VLOOKUP($A21,البيانات!$B$2:$L$7,11,FALSE),\"\")","v":""},null,{"$f":"IFERROR(VLOOKUP($A21,البيانات!$B$2:$L$7,2,FALSE)*C:C,\"\")","v":""},{"$f":"IFERROR(VLOOKUP($A21,البيانات!$B$2:$L$7,3,FALSE)*C:C,\"\")","v":""},{"$f":"IFERROR(VLOOKUP($A21,البيانات!$B$2:$L$7,4,FALSE)*C:C,\"\")","v":""},"",null,""]
[null,{"$f":"IFERROR(VLOOKUP($A22,البيانات!$B$2:$L$7,11,FALSE),\"\")","v":""},null,{"$f":"IFERROR(VLOOKUP($A22,البيانات!$B$2:$L$7,2,FALSE)*C:C,\"\")","v":""},{"$f":"IFERROR(VLOOKUP($A22,البيانات!$B$2:$L$7,3,FALSE)*C:C,\"\")","v":""},{"$f":"IFERROR(VLOOKUP($A22,البيانات!$B$2:$L$7,4,FALSE)*C:C,\"\")","v":""},"",null,""]
[null,{"$f":"IFERROR(VLOOKUP($A23,البيانات!$B$2:$L$7,11,FALSE),\"\")","v":""},null,{"$f":"IFERROR(VLOOKUP($A23,البيانات!$B$2:$L$7,2,FALSE)*C:C,\"\")","v":""},{"$f":"IFERROR(VLOOKUP($A23,البيانات!$B$2:$L$7,3,FALSE)*C:C,\"\")","v":""},{"$f":"IFERROR(VLOOKUP($A23,البيانات!$B$2:$L$7,4,FALSE)*C:C,\"\")","v":""},"",null,""]
[null,{"$f":"IFERROR(VLOOKUP($A24,البيانات!$B$2:$L$7,11,FALSE),\"\")","v":""},null,{"$f":"IFERROR(VLOOKUP($A24,البيانات!$B$2:$L$7,2,FALSE)*C:C,\"\")","v":""},{"$f":"IFERROR(VLOOKUP($A24,البيانات!$B$2:$L$7,3,FALSE)*C:C,\"\")","v":""},{"$f":"IFERROR(VLOOKUP($A24,البيانات!$B$2:$L$7,4,FALSE)*C:C,\"\")","v":""},"",null,""]
[null,{"$f":"IFERROR(VLOOKUP($A25,البيانات!$B$2:$L$7,11,FALSE),\"\")","v":""},null,{"$f":"IFERROR(VLOOKUP($A25,البيانات!$B$2:$L$7,2,FALSE)*C:C,\"\")","v":""},{"$f":"IFERROR(VLOOKUP($A25,البيانات!$B$2:$L$7,3,FALSE)*C:C,\"\")","v":""},{"$f":"IFERROR(VLOOKUP($A25,البيانات!$B$2:$L$7,4,FALSE)*C:C,\"\")","v":""},"",null,""]
[null,{"$f":"IFERROR(VLOOKUP($A26,البيانات!$B$2:$L$7,11,FALSE),\"\")","v":""},null,{"$f":"IFERROR(VLOOKUP($A26,البيانات!$B$2:$L$7,2,FALSE)*C:C,\"\")","v":""},{"$f":"IFERROR(VLOOKUP($A26,البيانات!$B$2:$L$7,3,FALSE)*C:C,\"\")","v":""},{"$f":"IFERROR(VLOOKUP($A26,البيانات!$B$2:$L$7,4,FALSE)*C:C,\"\")","v":""},"",null,""]
[null,{"$f":"IFERROR(VLOOKUP($A27,البيانات!$B$2:$L$7,11,FALSE),\"\")","v":""},null,{"$f":"IFERROR(VLOOKUP($A27,البيانات!$B$2:$L$7,2,FALSE)*C:C,\"\")","v":""},{"$f":"IFERROR(VLOOKUP($A27,البيانات!$B$2:$L$7,3,FALSE)*C:C,\"\")","v":""},{"$f":"IFERROR(VLOOKUP($A27,البيانات!$B$2:$L$7,4,FALSE)*C:C,\"\")","v":""},"",null,""]
[null,{"$f":"IFERROR(VLOOKUP($A28,البيانات!$B$2:$L$7,11,FALSE),\"\")","v":""},null,{"$f":"IFERROR(VLOOKUP($A28,البيانات!$B$2:$L$7,2,FALSE)*C:C,\"\")","v":""},{"$f":"IFERROR(VLOOKUP($A28,البيانات!$B$2:$L$7,3,FALSE)*C:C,\"\")","v":""},{"$f":"IFERROR(VLOOKUP($A28,البيانات!$B$2:$L$7,4,FALSE)*C:C,\"\")","v":""},"",null,""]
[null,{"$f":"IFERROR(VLOOKUP($A29,البيانات!$B$2:$L$7,11,FALSE),\"\")","v":""},null,{"$f":"IFERROR(VLOOKUP($A29,البيانات!$B$2:$L$7,2,FALSE)*C:C,\"\")","v":""},{"$f":"IFERROR(VLOOKUP($A29,البيانات!$B$2:$L$7,3,FALSE)*C:C,\"\")","v":""},{"$f":"IFERROR(VLOOKUP($A29,البيانات!$B$2:$L$7,4,FALSE)*C:C,\"\")","v":""},"",null,""]
[null,{"$f":"IFERROR(VLOOKUP($A30,البيانات!$B$2:$L$7,11,FALSE),\"\")","v":""},null,{"$f":"IFERROR(VLOOKUP($A30,البيانات!$B$2:$L$7,2,FALSE)*C:C,\"\")","v":""},{"$f":"IFERROR(VLOOKUP($A30,البيانات!$B$2:$L$7,3,FALSE)*C:C,\"\")","v":""},{"$f":"IFERROR(VLOOKUP($A30,البيانات!$B$2:$L$7,4,FALSE)*C:C,\"\")","v":""},"",null,""]
[null,{"$f":"IFERROR(VLOOKUP($A31,البيانات!$B$2:$L$7,11,FALSE),\"\")","v":""},null,{"$f":"IFERROR(VLOOKUP($A31,البيانات!$B$2:$L$7,2,FALSE)*C:C,\"\")","v":""},{"$f":"IFERROR(VLOOKUP($A31,البيانات!$B$2:$L$7,3,FALSE)*C:C,\"\")","v":""},{"$f":"IFERROR(VLOOKUP($A31,البيانات!$B$2:$L$7,4,FALSE)*C:C,\"\")","v":""},"",null,""]
[null,{"$f":"IFERROR(VLOOKUP($A32,البيانات!$B$2:$L$7,11,FALSE),\"\")","v":""},null,{"$f":"IFERROR(VLOOKUP($A32,البيانات!$B$2:$L$7,2,FALSE)*C:C,\"\")","v":""},{"$f":"IFERROR(VLOOKUP($A32,البيانات!$B$2:$L$7,3,FALSE)*C:C,\"\")","v":""},{"$f":"IFERROR(VLOOKUP($A32,البيانات!$B$2:$L$7,4,FALSE)*C:C,\"\")","v":""},"",null,""]
[null,{"$f":"IFERROR(VLOOKUP($A33,البيانات!$B$2:$L$7,11,FALSE),\"\")","v":""},null,{"$f":"IFERROR(VLOOKUP($A33,البيانات!$B$2:$L$7,2,FALSE)*C:C,\"\")","v":""},{"$f":"IFERROR(VLOOKUP($A33,البيانات!$B$2:$L$7,3,FALSE)*C:C,\"\")","v":""},{"$f":"IFERROR(VLOOKUP($A33,البيانات!$B$2:$L$7,4,FALSE)*C:C,\"\")","v":""},"",null,""]
[null,{"$f":"IFERROR(VLOOKUP($A34,البيانات!$B$2:$L$7,11,FALSE),\"\")","v":""},null,{"$f":"IFERROR(VLOOKUP($A34,البيانات!$B$2:$L$7,2,FALSE)*C:C,\"\")","v":""},{"$f":"IFERROR(VLOOKUP($A34,البيانات!$B$2:$L$7,3,FALSE)*C:C,\"\")","v":""},{"$f":"IFERROR(VLOOKUP($A34,البيانات!$B$2:$L$7,4,FALSE)*C:C,\"\")","v":""},"",null,""]
[null,{"$f":"IFERROR(VLOOKUP($A35,البيانات!$B$2:$L$7,11,FALSE),\"\")","v":""},null,{"$f":"IFERROR(VLOOKUP($A35,البيانات!$B$2:$L$7,2,FALSE)*C:C,\"\")","v":""},{"$f":"IFERROR(VLOOKUP($A35,البيانات!$B$2:$L$7,3,FALSE)*C:C,\"\")","v":""},{"$f":"IFERROR(VLOOKUP($A35,البيانات!$B$2:$L$7,4,FALSE)*C:C,\"\")","v":""},"",null,""]
[null,{"$f":"IFERROR(VLOOKUP($A36,البيانات!$B$2:$L$7,11,FALSE),\"\")","v":""},null,{"$f":"IFERROR(VLOOKUP($A36,البيانات!$B$2:$L$7,2,FALSE)*C:C,\"\")","v":""},{"$f":"IFERROR(VLOOKUP($A36,البيانات!$B$2:$L$7,3,FALSE)*C:C,\"\")","v":""},{"$f":"IFERROR(VLOOKUP($A36,البيانات!$B$2:$L$7,4,FALSE)*C:C,\"\")","v":""},"",null,""]
[null,{"$f":"IFERROR(VLOOKUP($A37,البيانات!$B$2:$L$7,11,FALSE),\"\")","v":""},null,{"$f":"IFERROR(VLOOKUP($A37,البيانات!$B$2:$L$7,2,FALSE)*C:C,\"\")","v":""},{"$f":"IFERROR(VLOOKUP($A37,البيانات!$B$2:$L$7,3,FALSE)*C:C,\"\")","v":""},{"$f":"IFERROR(VLOOKUP($A37,البيانات!$B$2:$L$7,4,FALSE)*C:C,\"\")","v":""},"",null,""]
[null,{"$f":"IFERROR(VLOOKUP($A38,البيانات!$B$2:$L$7,11,FALSE),\"\")","v":""},null,{"$f":"IFERROR(VLOOKUP($A38,البيانات!$B$2:$L$7,2,FALSE)*C:C,\"\")","v":""},{"$f":"IFERROR(VLOOKUP($A38,البيانات!$B$2:$L$7,3,FALSE)*C:C,\"\")","v":""},{"$f":"IFERROR(VLOOKUP($A38,البيانات!$B$2:$L$7,4,FALSE)*C:C,\"\")","v":""},"",null,""]
[null,{"$f":"IFERROR(VLOOKUP($A39,البيانات!$B$2:$L$7,11,FALSE),\"\")","v":""},null,{"$f":"IFERROR(VLOOKUP($A39,البيانات!$B$2:$L$7,2,FALSE)*C:C,\"\")","v":""},{"$f":"IFERROR(VLOOKUP($A39,البيانات!$B$2:$L$7,3,FALSE)*C:C,\"\")","v":""},{"$f":"IFERROR(VLOOKUP($A39,البيانات!$B$2:$L$7,4,FALSE)*C:C,\"\")","v":""},"",null,""]
[null,{"$f":"IFERROR(VLOOKUP($A40,البيانات!$B$2:$L$7,11,FALSE),\"\")","v":""},null,{"$f":"IFERROR(VLOOKUP($A40,البيانات!$B$2:$L$7,2,FALSE)*C:C,\"\")","v":""},{"$f":"IFERROR(VLOOKUP($A40,البيانات!$B$2:$L$7,3,FALSE)*C:C,\"\")","v":""},{"$f":"IFERROR(VLOOKUP($A40,البيانات!$B$2:$L$7,4,FALSE)*C:C,\"\")","v":""},"",null,""]
[null,{"$f":"IFERROR(VLOOKUP($A41,البيانات!$B$2:$L$7,11,FALSE),\"\")","v":""},null,{"$f":"IFERROR(VLOOKUP($A41,البيانات!$B$2:$L$7,2,FALSE)*C:C,\"\")","v":""},{"$f":"IFERROR(VLOOKUP($A41,البيانات!$B$2:$L$7,3,FALSE)*C:C,\"\")","v":""},{"$f":"IFERROR(VLOOKUP($A41,البيانات!$B$2:$L$7,4,FALSE)*C:C,\"\")","v":""},"",null,""]
[null,{"$f":"IFERROR(VLOOKUP($A42,البيانات!$B$2:$L$7,11,FALSE),\"\")","v":""},null,{"$f":"IFERROR(VLOOKUP($A42,البيانات!$B$2:$L$7,2,FALSE)*C:C,\"\")","v":""},{"$f":"IFERROR(VLOOKUP($A42,البيانات!$B$2:$L$7,3,FALSE)*C:C,\"\")","v":""},{"$f":"IFERROR(VLOOKUP($A42,البيانات!$B$2:$L$7,4,FALSE)*C:C,\"\")","v":""},"",null,""]
[null,{"$f":"IFERROR(VLOOKUP($A43,البيانات!$B$2:$L$7,11,FALSE),\"\")","v":""},null,{"$f":"IFERROR(VLOOKUP($A43,البيانات!$B$2:$L$7,2,FALSE)*C:C,\"\")","v":""},{"$f":"IFERROR(VLOOKUP($A43,البيانات!$B$2:$L$7,3,FALSE)*C:C,\"\")","v":""},{"$f":"IFERROR(VLOOKUP($A43,البيانات!$B$2:$L$7,4,FALSE)*C:C,\"\")","v":""},"",null,""]
[null,{"$f":"IFERROR(VLOOKUP($A44,البيانات!$B$2:$L$7,11,FALSE),\"\")","v":""},null,{"$f":"IFERROR(VLOOKUP($A44,البيانات!$B$2:$L$7,2,FALSE)*C:C,\"\")","v":""},{"$f":"IFERROR(VLOOKUP($A44,البيانات!$B$2:$L$7,3,FALSE)*C:C,\"\")","v":""},{"$f":"IFERROR(VLOOKUP($A44,البيانات!$B$2:$L$7,4,FALSE)*C:C,\"\")","v":""},"",null,""]
[null,{"$f":"IFERROR(VLOOKUP($A45,البيانات!$B$2:$L$7,11,FALSE),\"\")","v":""},null,{"$f":"IFERROR(VLOOKUP($A45,البيانات!$B$2:$L$7,2,FALSE)*C:C,\"\")","v":""},{"$f":"IFERROR(VLOOKUP($A45,البيانات!$B$2:$L$7,3,FALSE)*C:C,\"\")","v":""},{"$f":"IFERROR(VLOOKUP($A45,البيانات!$B$2:$L$7,4,FALSE)*C:C,\"\")","v":""},"",null,""]
[null,{"$f":"IFERROR(VLOOKUP($A46,البيانات!$B$2:$L$7,11,FALSE),\"\")","v":""},null,{"$f":"IFERROR(VLOOKUP($A46,البيانات!$B$2:$L$7,2,FALSE)*C:C,\"\")","v":""},{"$f":"IFERROR(VLOOKUP($A46,البيانات!$B$2:$L$7,3,FALSE)*C:C,\"\")","v":""},{"$f":"IFERROR(VLOOKUP($A46,البيانات!$B$2:$L$7,4,FALSE)*C:C,\"\")","v":""},"",null,""]
[null,{"$f":"IFERROR(VLOOKUP($A47,البيانات!$B$2:$L$7,11,FALSE),\"\")","v":""},null,{"$f":"IFERROR(VLOOKUP($A47,البيانات!$B$2:$L$7,2,FALSE)*C:C,\"\")","v":""},{"$f":"IFERROR(VLOOKUP($A47,البيانات!$B$2:$L$7,3,FALSE)*C:C,\"\")","v":""},{"$f":"IFERROR(VLOOKUP($A47,البيانات!$B$2:$L$7,4,FALSE)*C:C,\"\")","v":""},"",null,""]
[null,{"$f":"IFERROR(VLOOKUP($A48,البيانات!$B$2:$L$7,11,FALSE),\"\")","v":""},null,{"$f":"IFERROR(VLOOKUP($A48,البيانات!$B$2:$L$7,2,FALSE)*C:C,\"\")","v":""},{"$f":"IFERROR(VLOOKUP($A48,البيانات!$B$2:$L$7,3,FALSE)*C:C,\"\")","v":""},{"$f":"IFERROR(VLOOKUP($A48,البيانات!$B$2:$L$7,4,FALSE)*C:C,\"\")","v":""},"",null,""]
[null,{"$f":"IFERROR(VLOOKUP($A49,البيانات!$B$2:$L$7,11,FALSE),\"\")","v":""},null,{"$f":"IFERROR(VLOOKUP($A49,البيانات!$B$2:$L$7,2,FALSE)*C:C,\"\")","v":""},{"$f":"IFERROR(VLOOKUP($A49,البيانات!$B$2:$L$7,3,FALSE)*C:C,\"\")","v":""},{"$f":"IFERROR(VLOOKUP($A49,البيانات!$B$2:$L$7,4,FALSE)*C:C,\"\")","v":""},"",null,""]
[null,{"$f":"IFERROR(VLOOKUP($A50,البيانات!$B$2:$L$7,11,FALSE),\"\")","v":""},null,{"$f":"IFERROR(VLOOKUP($A50,البيانات!$B$2:$L$7,2,FALSE)*C:C,\"\")","v":""},{"$f":"IFERROR(VLOOKUP($A50,البيانات!$B$2:$L$7,3,FALSE)*C:C,\"\")","v":""},{"$f":"IFERROR(VLOOKUP($A50,البيانات!$B$2:$L$7,4,FALSE)*C:C,\"\")","v":""},"",null,""]
[null,{"$f":"IFERROR(VLOOKUP($A51,البيانات!$B$2:$L$7,11,FALSE),\"\")","v":""},null,{"$f":"IFERROR(VLOOKUP($A51,البيانات!$B$2:$L$7,2,FALSE)*C:C,\"\")","v":""},{"$f":"IFERROR(VLOOKUP($A51,البيانات!$B$2:$L$7,3,FALSE)*C:C,\"\")","v":""},{"$f":"IFERROR(VLOOKUP($A51,البيانات!$B$2:$L$7,4,FALSE)*C:C,\"\")","v":""},"",null,""]
[null,{"$f":"IFERROR(VLOOKUP($A52,البيانات!$B$2:$L$7,11,FALSE),\"\")","v":""},null,{"$f":"IFERROR(VLOOKUP($A52,البيانات!$B$2:$L$7,2,FALSE)*C:C,\"\")","v":""},{"$f":"IFERROR(VLOOKUP($A52,البيانات!$B$2:$L$7,3,FALSE)*C:C,\"\")","v":""},{"$f":"IFERROR(VLOOKUP($A52,البيانات!$B$2:$L$7,4,FALSE)*C:C,\"\")","v":""},"",null,""]
[null,{"$f":"IFERROR(VLOOKUP($A53,البيانات!$B$2:$L$7,11,FALSE),\"\")","v":""},null,{"$f":"IFERROR(VLOOKUP($A53,البيانات!$B$2:$L$7,2,FALSE)*C:C,\"\")","v":""},{"$f":"IFERROR(VLOOKUP($A53,البيانات!$B$2:$L$7,3,FALSE)*C:C,\"\")","v":""},{"$f":"IFERROR(VLOOKUP($A53,البيانات!$B$2:$L$7,4,FALSE)*C:C,\"\")","v":""},"",null,""]
[null,{"$f":"IFERROR(VLOOKUP($A54,البيانات!$B$2:$L$7,11,FALSE),\"\")","v":""},null,{"$f":"IFERROR(VLOOKUP($A54,البيانات!$B$2:$L$7,2,FALSE)*C:C,\"\")","v":""},{"$f":"IFERROR(VLOOKUP($A54,البيانات!$B$2:$L$7,3,FALSE)*C:C,\"\")","v":""},{"$f":"IFERROR(VLOOKUP($A54,البيانات!$B$2:$L$7,4,FALSE)*C:C,\"\")","v":""},"",null,""]
[null,{"$f":"IFERROR(VLOOKUP($A55,البيانات!$B$2:$L$7,11,FALSE),\"\")","v":""},null,{"$f":"IFERROR(VLOOKUP($A55,البيانات!$B$2:$L$7,2,FALSE)*C:C,\"\")","v":""},{"$f":"IFERROR(VLOOKUP($A55,البيانات!$B$2:$L$7,3,FALSE)*C:C,\"\")","v":""},{"$f":"IFERROR(VLOOKUP($A55,البيانات!$B$2:$L$7,4,FALSE)*C:C,\"\")","v":""},"",null,""]
[null,{"$f":"IFERROR(VLOOKUP($A56,البيانات!$B$2:$L$7,11,FALSE),\"\")","v":""},null,{"$f":"IFERROR(VLOOKUP($A56,البيانات!$B$2:$L$7,2,FALSE)*C:C,\"\")","v":""},{"$f":"IFERROR(VLOOKUP($A56,البيانات!$B$2:$L$7,3,FALSE)*C:C,\"\")","v":""},{"$f":"IFERROR(VLOOKUP($A56,البيانات!$B$2:$L$7,4,FALSE)*C:C,\"\")","v":""},{"$f":"IFERROR(C56*B56,\"\")","v":""},null,""]
[null,{"$f":"IFERROR(VLOOKUP($A57,البيانات!$B$2:$L$7,11,FALSE),\"\")","v":""},null,{"$f":"IFERROR(VLOOKUP($A57,البيانات!$B$2:$L$7,2,FALSE)*C:C,\"\")","v":""},{"$f":"IFERROR(VLOOKUP($A57,البيانات!$B$2:$L$7,3,FALSE)*C:C,\"\")","v":""},{"$f":"IFERROR(VLOOKUP($A57,البيانات!$B$2:$L$7,4,FALSE)*C:C,\"\")","v":""},"",null,""]
[null,{"$f":"IFERROR(VLOOKUP($A58,البيانات!$B$2:$L$7,11,FALSE),\"\")","v":""},null,{"$f":"IFERROR(VLOOKUP($A58,البيانات!$B$2:$L$7,2,FALSE)*C:C,\"\")","v":""},{"$f":"IFERROR(VLOOKUP($A58,البيانات!$B$2:$L$7,3,FALSE)*C:C,\"\")","v":""},{"$f":"IFERROR(VLOOKUP($A58,البيانات!$B$2:$L$7,4,FALSE)*C:C,\"\")","v":""},"",null,""]
[null,{"$f":"IFERROR(VLOOKUP($A59,البيانات!$B$2:$L$7,11,FALSE),\"\")","v":""},null,{"$f":"IFERROR(VLOOKUP($A59,البيانات!$B$2:$L$7,2,FALSE)*C:C,\"\")","v":""},{"$f":"IFERROR(VLOOKUP($A59,البيانات!$B$2:$L$7,3,FALSE)*C:C,\"\")","v":""},{"$f":"IFERROR(VLOOKUP($A59,البيانات!$B$2:$L$7,4,FALSE)*C:C,\"\")","v":""},"",null,""]
[null,{"$f":"IFERROR(VLOOKUP($A60,البيانات!$B$2:$L$7,11,FALSE),\"\")","v":""},null,{"$f":"IFERROR(VLOOKUP($A60,البيانات!$B$2:$L$7,2,FALSE)*C:C,\"\")","v":""},{"$f":"IFERROR(VLOOKUP($A60,البيانات!$B$2:$L$7,3,FALSE)*C:C,\"\")","v":""},{"$f":"IFERROR(VLOOKUP($A60,البيانات!$B$2:$L$7,4,FALSE)*C:C,\"\")","v":""},"",null,""]
{"$rows_left_out":784}
{"sheet":"البيانات","index":2,"n_rows":7,"n_cols":16,"rows_kept":7,"cut":false,"hidden":false,"merged":[]}
["ت","قياس الكابينة","MDFنوع الخشب"," شريط PVC","ظهر( طبقة الفايبر)","مسند بلاستك","سعر MDF","سعر PVC","سعر الظهر","سعر المسند","مواد تشغيل ","الأجمالي",null,null,"السعر ","المبلغ "]
[1,"AB 100*56*75",2.1,{"$f":"C2*700/100","v":14.7},{"$f":"C2*30/100","v":0.63},{"$f":"C2*4","v":8.4},{"$f":"IF(C2=\"\",\"\",VLOOKUP($G$1,$O$2:$P$6,2,0)*C2)","v":15.540000000000001},{"$f":"IF(D2=\"\",\"\",VLOOKUP($H$1,$O$2:$P$6,2,0)*D2)","v":2.0580000000000003},{"$f":"IF(E2=\"\",\"\",VLOOKUP($I$1,$O$2:$P$6,2,0)*E2)","v":2.52},{"$f":"IF(F2=\"\",\"\",VLOOKUP($J$1,$O$2:$P$6,2,0)*F2)","v":0.16800000000000001},null,{"$f":"SUM(G2:K2)","v":20.286000000000001},null,null,"سعر MDF",7.4]
[2,"AB 90*56*75","1.99",{"$f":"C3*700/100","v":13.93},{"$f":"C3*30/100","v":0.59699999999999998},{"$f":"C3*4","v":7.96},14.726000000000001,1.9502000000000002,2.3879999999999999,0.15920000000000001,null,19.223399999999998,null,null,"سعر PVC",0.14000000000000001]
[3,"AB 80*56*75","1.85",12.95,0.55500000000000005,7.4,13.690000000000001,1.8130000000000002,2.2200000000000002,0.14800000000000002,null,17.871000000000002,null,null,"سعر الظهر",4]
[4,"AB 75*56*75",1.79,12.53,0.53700000000000003,7.16,13.246,1.7542,2.1480000000000001,0.14319999999999999,null,17.291399999999999,null,null,"سعر المسند",0.02]
[5,"AB 70*56*75","1.72",12.04,0.51600000000000001,6.88,12.728,1.6856,2.0640000000000001,0.1376,null,16.615199999999998,null,null,"مواد تشغيل ",0]
[6,"AB 60*56*75",1.6,11.2,0.48,6.4,11.840000000000002,1.5680000000000001,1.92,0.128,null,15.456000000000001]

{"sheet":"اسماء الزبائن والجهات ","index":3,"n_rows":10,"n_cols":2,"rows_kept":10,"cut":false,"hidden":false,"merged":[]}
[null,"اسماء الجهات والعملاء"]
[null,"الزبون 1"]
[null,"الزبون 2"]
[null,"الزبون 3"]
[null,"الزبون 4"]
[null,"الزبون 5"]
[null,"الزبون 6"]
[null,"الزبون 7"]
[null,"الزبون 8"]
[null,"الزبون 9"]