{"text_format":"1","workbook":"xlsx","n_sheets":13,"sheets":["يناير","فبراير","مارس","ابريل","مايو","يونيو","يوليو","أغسطس","سبتمبر","أكتوبر","نوفمبر","ديسمبر","ميزان"],"not_rendered":{"charts":0,"images":1,"macros":1,"external_links":1,"defined_names":13,"comments":0,"pivot_tables":0},"unopened":[],"bounds":{"document_bytes":16777216,"sheet_cells":100000,"rows_first":2000,"rows_last":500,"rows_between":2000,"halvings":0,"cell_chars":16384,"cell_head_chars":4096},"cells_cut":0,"cells_raw":0,"read":"whole","date_system":"1900"}

{"sheet":"يناير","index":0,"n_rows":104,"n_cols":35,"rows_kept":104,"cut":false,"hidden":false,"merged":[[1,7,2,7],[1,9,2,9],[103,2,103,4],[1,2,2,2],[1,3,2,3],[1,4,2,4],[1,5,2,5],[1,6,2,6],[1,22,2,22],[1,11,2,11],[1,12,2,12],[1,13,2,13],[1,14,2,14],[1,15,2,15],[1,16,2,16],[1,17,2,17],[1,18,2,18],[1,19,2,19],[1,20,2,20],[1,21,2,21],[1,33,2,33],[1,26,2,26],[1,27,2,27],[1,28,2,28],[1,29,2,29],[0,2,0,14],[1,0,2,1],[1,38,2,38],[1,39,2,39],[1,10,2,10],[1,8,2,8],[1,34,2,34],[1,35,2,35],[1,36,2,36],[1,37,2,37],[1,30,2,30],[1,23,2,23],[1,24,2,24],[1,25,2,25],[1,31,2,31],[1,32,2,32]]}
["زر إخفاء","زر إظهار","تحليـــــــــــــــــل مصـــــــــــــــروفات التشغيـــــــــــــــل عن شهـــــــــر يناير لعام 201",null,null,null,null,null,null,null,null,null,null,null,null,null,null,null,null,null,null,null,null,null,null,0]
["OR",null,"التاريخ","رقم القيد","البيان","الإجمالى","صيانة\nواصلاح\nوقطع غيار","خامات تشغيل","م سيارات","كهرباء","م نظافة","مياه","تأمينات","أجور"]
[]
[{"$f":"IF(F4=[1]يناير!$J3,\"ok\",\"error\")","v":"ok"},{"$f":"F4-[1]يناير!$J3","v":0},{"$f":"IF([1]يناير!$J3>0,[1]يناير!$C3,\" \")","v":" "},1,null,{"$f":"SUM(G4:AX4)","v":0}]
[{"$f":"IF(F5=[1]يناير!$J4,\"ok\",\"error\")","v":"ok"},{"$f":"F5-[1]يناير!$J4","v":0},{"$f":"IF([1]يناير!$J4>0,[1]يناير!$C4,\" \")","v":" "},2,null,{"$f":"SUM(G5:AX5)","v":0}]
[{"$f":"IF(F6=[1]يناير!$J5,\"ok\",\"error\")","v":"ok"},{"$f":"F6-[1]يناير!$J5","v":0},{"$f":"IF([1]يناير!$J5>0,[1]يناير!$C5,\" \")","v":" "},3,null,0]
[{"$f":"IF(F7=[1]يناير!$J6,\"ok\",\"error\")","v":"ok"},{"$f":"F7-[1]يناير!$J6","v":0},{"$f":"IF([1]يناير!$J6>0,[1]يناير!$C6,\" \")","v":" "},4,null,0]
[{"$f":"IF(F8=[1]يناير!$J7,\"ok\",\"error\")","v":"ok"},{"$f":"F8-[1]يناير!$J7","v":0},{"$f":"IF([1]يناير!$J7>0,[1]يناير!$C7,\" \")","v":" "},5,null,0]
[{"$f":"IF(F9=[1]يناير!$J8,\"ok\",\"error\")","v":"ok"},{"$f":"F9-[1]يناير!$J8","v":0},{"$f":"IF([1]يناير!$J8>0,[1]يناير!$C8,\" \")","v":" "},6,null,0]
[{"$f":"IF(F10=[1]يناير!$J9,\"ok\",\"error\")","v":"ok"},{"$f":"F10-[1]يناير!$J9","v":0},{"$f":"IF([1]يناير!$J9>0,[1]يناير!$C9,\" \")","v":" "},7,null,0]
[{"$f":"IF(F11=[1]يناير!$J10,\"ok\",\"error\")","v":"ok"},{"$f":"F11-[1]يناير!$J10","v":0},{"$f":"IF([1]يناير!$J10>0,[1]يناير!$C10,\" \")","v":" "},8,null,0]
[{"$f":"IF(F12=[1]يناير!$J11,\"ok\",\"error\")","v":"ok"},{"$f":"F12-[1]يناير!$J11","v":0},{"$f":"IF([1]يناير!$J11>0,[1]يناير!$C11,\" \")","v":" "},9,null,0]
[{"$f":"IF(F13=[1]يناير!$J12,\"ok\",\"error\")","v":"ok"},{"$f":"F13-[1]يناير!$J12","v":0},{"$f":"IF([1]يناير!$J12>0,[1]يناير!$C12,\" \")","v":" "},10,null,0]
[{"$f":"IF(F14=[1]يناير!$J13,\"ok\",\"error\")","v":"ok"},{"$f":"F14-[1]يناير!$J13","v":0},{"$f":"IF([1]يناير!$J13>0,[1]يناير!$C13,\" \")","v":" "},11,null,0]
[{"$f":"IF(F15=[1]يناير!$J14,\"ok\",\"error\")","v":"ok"},{"$f":"F15-[1]يناير!$J14","v":0},{"$f":"IF([1]يناير!$J14>0,[1]يناير!$C14,\" \")","v":" "},12,null,0]
[{"$f":"IF(F16=[1]يناير!$J15,\"ok\",\"error\")","v":"ok"},{"$f":"F16-[1]يناير!$J15","v":0},{"$f":"IF([1]يناير!$J15>0,[1]يناير!$C15,\" \")","v":" "},13,null,0]
[{"$f":"IF(F17=[1]يناير!$J16,\"ok\",\"error\")","v":"ok"},{"$f":"F17-[1]يناير!$J16","v":0},{"$f":"IF([1]يناير!$J16>0,[1]يناير!$C16,\" \")","v":" "},14,null,0]
[{"$f":"IF(F18=[1]يناير!$J17,\"ok\",\"error\")","v":"ok"},{"$f":"F18-[1]يناير!$J17","v":0},{"$f":"IF([1]يناير!$J17>0,[1]يناير!$C17,\" \")","v":" "},15,null,0]
[{"$f":"IF(F19=[1]يناير!$J18,\"ok\",\"error\")","v":"ok"},{"$f":"F19-[1]يناير!$J18","v":0},{"$f":"IF([1]يناير!$J18>0,[1]يناير!$C18,\" \")","v":" "},16,null,0]
[{"$f":"IF(F20=[1]يناير!$J19,\"ok\",\"error\")","v":"ok"},{"$f":"F20-[1]يناير!$J19","v":0},{"$f":"IF([1]يناير!$J19>0,[1]يناير!$C19,\" \")","v":" "},17,null,0]
[{"$f":"IF(F21=[1]يناير!$J20,\"ok\",\"error\")","v":"ok"},{"$f":"F21-[1]يناير!$J20","v":0},{"$f":"IF([1]يناير!$J20>0,[1]يناير!$C20,\" \")","v":" "},18,null,0]
[{"$f":"IF(F22=[1]يناير!$J21,\"ok\",\"error\")","v":"ok"},{"$f":"F22-[1]يناير!$J21","v":0},{"$f":"IF([1]يناير!$J21>0,[1]يناير!$C21,\" \")","v":" "},19,null,0]
[{"$f":"IF(F23=[1]يناير!$J22,\"ok\",\"error\")","v":"ok"},{"$f":"F23-[1]يناير!$J22","v":0},{"$f":"IF([1]يناير!$J22>0,[1]يناير!$C22,\" \")","v":" "},20,null,0]
[{"$f":"IF(F24=[1]يناير!$J23,\"ok\",\"error\")","v":"ok"},{"$f":"F24-[1]يناير!$J23","v":0},{"$f":"IF([1]يناير!$J23>0,[1]يناير!$C23,\" \")","v":" "},21,null,0]
[{"$f":"IF(F25=[1]يناير!$J24,\"ok\",\"error\")","v":"ok"},{"$f":"F25-[1]يناير!$J24","v":0},{"$f":"IF([1]يناير!$J24>0,[1]يناير!$C24,\" \")","v":" "},22,null,0]
[{"$f":"IF(F26=[1]يناير!$J25,\"ok\",\"error\")","v":"ok"},{"$f":"F26-[1]يناير!$J25","v":0},{"$f":"IF([1]يناير!$J25>0,[1]يناير!$C25,\" \")","v":" "},23,null,0]
[{"$f":"IF(F27=[1]يناير!$J26,\"ok\",\"error\")","v":"ok"},{"$f":"F27-[1]يناير!$J26","v":0},{"$f":"IF([1]يناير!$J26>0,[1]يناير!$C26,\" \")","v":" "},24,null,0]
[{"$f":"IF(F28=[1]يناير!$J27,\"ok\",\"error\")","v":"ok"},{"$f":"F28-[1]يناير!$J27","v":0},{"$f":"IF([1]يناير!$J27>0,[1]يناير!$C27,\" \")","v":" "},25,null,0]
[{"$f":"IF(F29=[1]يناير!$J28,\"ok\",\"error\")","v":"ok"},{"$f":"F29-[1]يناير!$J28","v":0},{"$f":"IF([1]يناير!$J28>0,[1]يناير!$C28,\" \")","v":" "},26,null,0]
[{"$f":"IF(F30=[1]يناير!$J29,\"ok\",\"error\")","v":"ok"},{"$f":"F30-[1]يناير!$J29","v":0},{"$f":"IF([1]يناير!$J29>0,[1]يناير!$C29,\" \")","v":" "},27,null,0]
[{"$f":"IF(F31=[1]يناير!$J30,\"ok\",\"error\")","v":"ok"},{"$f":"F31-[1]يناير!$J30","v":0},{"$f":"IF([1]يناير!$J30>0,[1]يناير!$C30,\" \")","v":" "},28,null,0]
[{"$f":"IF(F32=[1]يناير!$J31,\"ok\",\"error\")","v":"ok"},{"$f":"F32-[1]يناير!$J31","v":0},{"$f":"IF([1]يناير!$J31>0,[1]يناير!$C31,\" \")","v":" "},29,null,0]
[{"$f":"IF(F33=[1]يناير!$J32,\"ok\",\"error\")","v":"ok"},{"$f":"F33-[1]يناير!$J32","v":0},{"$f":"IF([1]يناير!$J32>0,[1]يناير!$C32,\" \")","v":" "},30,null,0]
[{"$f":"IF(F34=[1]يناير!$J33,\"ok\",\"error\")","v":"ok"},{"$f":"F34-[1]يناير!$J33","v":0},{"$f":"IF([1]يناير!$J33>0,[1]يناير!$C33,\" \")","v":" "},31,null,0]
[{"$f":"IF(F35=[1]يناير!$J34,\"ok\",\"error\")","v":"ok"},{"$f":"F35-[1]يناير!$J34","v":0},{"$f":"IF([1]يناير!$J34>0,[1]يناير!$C34,\" \")","v":" "},32,null,0]
[{"$f":"IF(F36=[1]يناير!$J35,\"ok\",\"error\")","v":"ok"},{"$f":"F36-[1]يناير!$J35","v":0},{"$f":"IF([1]يناير!$J35>0,[1]يناير!$C35,\" \")","v":" "},33,null,0]
[{"$f":"IF(F37=[1]يناير!$J36,\"ok\",\"error\")","v":"ok"},{"$f":"F37-[1]يناير!$J36","v":0},{"$f":"IF([1]يناير!$J36>0,[1]يناير!$C36,\" \")","v":" "},34,null,0]
[{"$f":"IF(F38=[1]يناير!$J37,\"ok\",\"error\")","v":"ok"},{"$f":"F38-[1]يناير!$J37","v":0},{"$f":"IF([1]يناير!$J37>0,[1]يناير!$C37,\" \")","v":" "},35,null,0]
[{"$f":"IF(F39=[1]يناير!$J38,\"ok\",\"error\")","v":"ok"},{"$f":"F39-[1]يناير!$J38","v":0},{"$f":"IF([1]يناير!$J38>0,[1]يناير!$C38,\" \")","v":" "},36,null,0]
[{"$f":"IF(F40=[1]يناير!$J39,\"ok\",\"error\")","v":"ok"},{"$f":"F40-[1]يناير!$J39","v":0},{"$f":"IF([1]يناير!$J39>0,[1]يناير!$C39,\" \")","v":" "},37,null,0]
[{"$f":"IF(F41=[1]يناير!$J40,\"ok\",\"error\")","v":"ok"},{"$f":"F41-[1]يناير!$J40","v":0},{"$f":"IF([1]يناير!$J40>0,[1]يناير!$C40,\" \")","v":" "},38,null,0]
[{"$f":"IF(F42=[1]يناير!$J41,\"ok\",\"error\")","v":"ok"},{"$f":"F42-[1]يناير!$J41","v":0},{"$f":"IF([1]يناير!$J41>0,[1]يناير!$C41,\" \")","v":" "},39,null,0]
[{"$f":"IF(F43=[1]يناير!$J42,\"ok\",\"error\")","v":"ok"},{"$f":"F43-[1]يناير!$J42","v":0},{"$f":"IF([1]يناير!$J42>0,[1]يناير!$C42,\" \")","v":" "},40,null,0]
[{"$f":"IF(F44=[1]يناير!$J43,\"ok\",\"error\")","v":"ok"},{"$f":"F44-[1]يناير!$J43","v":0},{"$f":"IF([1]يناير!$J43>0,[1]يناير!$C43,\" \")","v":" "},41,null,0]
[{"$f":"IF(F45=[1]يناير!$J44,\"ok\",\"error\")","v":"ok"},{"$f":"F45-[1]يناير!$J44","v":0},{"$f":"IF([1]يناير!$J44>0,[1]يناير!$C44,\" \")","v":" "},42,null,0]
[{"$f":"IF(F46=[1]يناير!$J45,\"ok\",\"error\")","v":"ok"},{"$f":"F46-[1]يناير!$J45","v":0},{"$f":"IF([1]يناير!$J45>0,[1]يناير!$C45,\" \")","v":" "},43,null,0]
[{"$f":"IF(F47=[1]يناير!$J46,\"ok\",\"error\")","v":"ok"},{"$f":"F47-[1]يناير!$J46","v":0},{"$f":"IF([1]يناير!$J46>0,[1]يناير!$C46,\" \")","v":" "},44,null,0]
[{"$f":"IF(F48=[1]يناير!$J47,\"ok\",\"error\")","v":"ok"},{"$f":"F48-[1]يناير!$J47","v":0},{"$f":"IF([1]يناير!$J47>0,[1]يناير!$C47,\" \")","v":" "},45,null,0]
[{"$f":"IF(F49=[1]يناير!$J48,\"ok\",\"error\")","v":"ok"},{"$f":"F49-[1]يناير!$J48","v":0},{"$f":"IF([1]يناير!$J48>0,[1]يناير!$C48,\" \")","v":" "},46,null,0]
[{"$f":"IF(F50=[1]يناير!$J49,\"ok\",\"error\")","v":"ok"},{"$f":"F50-[1]يناير!$J49","v":0},{"$f":"IF([1]يناير!$J49>0,[1]يناير!$C49,\" \")","v":" "},47,null,0]
[{"$f":"IF(F51=[1]يناير!$J50,\"ok\",\"error\")","v":"ok"},{"$f":"F51-[1]يناير!$J50","v":0},{"$f":"IF([1]يناير!$J50>0,[1]يناير!$C50,\" \")","v":" "},48,null,0]
[{"$f":"IF(F52=[1]يناير!$J51,\"ok\",\"error\")","v":"ok"},{"$f":"F52-[1]يناير!$J51","v":0},{"$f":"IF([1]يناير!$J51>0,[1]يناير!$C51,\" \")","v":" "},49,null,0]
[{"$f":"IF(F53=[1]يناير!$J52,\"ok\",\"error\")","v":"ok"},{"$f":"F53-[1]يناير!$J52","v":0},{"$f":"IF([1]يناير!$J52>0,[1]يناير!$C52,\" \")","v":" "},50,null,0]
[{"$f":"IF(F54=[1]يناير!$J53,\"ok\",\"error\")","v":"ok"},{"$f":"F54-[1]يناير!$J53","v":0},{"$f":"IF([1]يناير!$J53>0,[1]يناير!$C53,\" \")","v":" "},51,null,0]
[{"$f":"IF(F55=[1]يناير!$J54,\"ok\",\"error\")","v":"ok"},{"$f":"F55-[1]يناير!$J54","v":0},{"$f":"IF([1]يناير!$J54>0,[1]يناير!$C54,\" \")","v":" "},52,null,0]
[{"$f":"IF(F56=[1]يناير!$J55,\"ok\",\"error\")","v":"ok"},{"$f":"F56-[1]يناير!$J55","v":0},{"$f":"IF([1]يناير!$J55>0,[1]يناير!$C55,\" \")","v":" "},53,null,0]
[{"$f":"IF(F57=[1]يناير!$J56,\"ok\",\"error\")","v":"ok"},{"$f":"F57-[1]يناير!$J56","v":0},{"$f":"IF([1]يناير!$J56>0,[1]يناير!$C56,\" \")","v":" "},54,null,0]
[{"$f":"IF(F58=[1]يناير!$J57,\"ok\",\"error\")","v":"ok"},{"$f":"F58-[1]يناير!$J57","v":0},{"$f":"IF([1]يناير!$J57>0,[1]يناير!$C57,\" \")","v":" "},55,null,0]
[{"$f":"IF(F59=[1]يناير!$J58,\"ok\",\"error\")","v":"ok"},{"$f":"F59-[1]يناير!$J58","v":0},{"$f":"IF([1]يناير!$J58>0,[1]يناير!$C58,\" \")","v":" "},56,null,0]
[{"$f":"IF(F60=[1]يناير!$J59,\"ok\",\"error\")","v":"ok"},{"$f":"F60-[1]يناير!$J59","v":0},{"$f":"IF([1]يناير!$J59>0,[1]يناير!$C59,\" \")","v":" "},57,null,0]
[{"$f":"IF(F61=[1]يناير!$J60,\"ok\",\"error\")","v":"ok"},{"$f":"F61-[1]يناير!$J60","v":0},{"$f":"IF([1]يناير!$J60>0,[1]يناير!$C60,\" \")","v":" "},58,null,0]
[{"$f":"IF(F62=[1]يناير!$J61,\"ok\",\"error\")","v":"ok"},{"$f":"F62-[1]يناير!$J61","v":0},{"$f":"IF([1]يناير!$J61>0,[1]يناير!$C61,\" \")","v":" "},59,null,0]
[{"$f":"IF(F63=[1]يناير!$J62,\"ok\",\"error\")","v":"ok"},{"$f":"F63-[1]يناير!$J62","v":0},{"$f":"IF([1]يناير!$J62>0,[1]يناير!$C62,\" \")","v":" "},60,null,0]
[{"$f":"IF(F64=[1]يناير!$J63,\"ok\",\"error\")","v":"ok"},{"$f":"F64-[1]يناير!$J63","v":0},{"$f":"IF([1]يناير!$J63>0,[1]يناير!$C63,\" \")","v":" "},61,null,0]
[{"$f":"IF(F65=[1]يناير!$J64,\"ok\",\"error\")","v":"ok"},{"$f":"F65-[1]يناير!$J64","v":0},{"$f":"IF([1]يناير!$J64>0,[1]يناير!$C64,\" \")","v":" "},62,null,0]
[{"$f":"IF(F66=[1]يناير!$J65,\"ok\",\"error\")","v":"ok"},{"$f":"F66-[1]يناير!$J65","v":0},{"$f":"IF([1]يناير!$J65>0,[1]يناير!$C65,\" \")","v":" "},63,null,0]
[{"$f":"IF(F67=[1]يناير!$J66,\"ok\",\"error\")","v":"ok"},{"$f":"F67-[1]يناير!$J66","v":0},{"$f":"IF([1]يناير!$J66>0,[1]يناير!$C66,\" \")","v":" "},64,null,0]
[{"$f":"IF(F68=[1]يناير!$J67,\"ok\",\"error\")","v":"ok"},{"$f":"F68-[1]يناير!$J67","v":0},{"$f":"IF([1]يناير!$J67>0,[1]يناير!$C67,\" \")","v":" "},65,null,0]
[{"$f":"IF(F69=[1]يناير!$J68,\"ok\",\"error\")","v":"ok"},{"$f":"F69-[1]يناير!$J68","v":0},{"$f":"IF([1]يناير!$J68>0,[1]يناير!$C68,\" \")","v":" "},66,null,{"$f":"SUM(G69:AX69)","v":0}]
[{"$f":"IF(F70=[1]يناير!$J69,\"ok\",\"error\")","v":"ok"},{"$f":"F70-[1]يناير!$J69","v":0},{"$f":"IF([1]يناير!$J69>0,[1]يناير!$C69,\" \")","v":" "},67,null,0]
[{"$f":"IF(F71=[1]يناير!$J70,\"ok\",\"error\")","v":"ok"},{"$f":"F71-[1]يناير!$J70","v":0},{"$f":"IF([1]يناير!$J70>0,[1]يناير!$C70,\" \")","v":" "},68,null,0]
[{"$f":"IF(F72=[1]يناير!$J71,\"ok\",\"error\")","v":"ok"},{"$f":"F72-[1]يناير!$J71","v":0},{"$f":"IF([1]يناير!$J71>0,[1]يناير!$C71,\" \")","v":" "},69,null,0]
[{"$f":"IF(F73=[1]يناير!$J72,\"ok\",\"error\")","v":"ok"},{"$f":"F73-[1]يناير!$J72","v":0},{"$f":"IF([1]يناير!$J72>0,[1]يناير!$C72,\" \")","v":" "},70,null,0]
[{"$f":"IF(F74=[1]يناير!$J73,\"ok\",\"error\")","v":"ok"},{"$f":"F74-[1]يناير!$J73","v":0},{"$f":"IF([1]يناير!$J73>0,[1]يناير!$C73,\" \")","v":" "},71,null,0]
[{"$f":"IF(F75=[1]يناير!$J74,\"ok\",\"error\")","v":"ok"},{"$f":"F75-[1]يناير!$J74","v":0},{"$f":"IF([1]يناير!$J74>0,[1]يناير!$C74,\" \")","v":" "},72,null,0]
[{"$f":"IF(F76=[1]يناير!$J75,\"ok\",\"error\")","v":"ok"},{"$f":"F76-[1]يناير!$J75","v":0},{"$f":"IF([1]يناير!$J75>0,[1]يناير!$C75,\" \")","v":" "},73,null,0]
[{"$f":"IF(F77=[1]يناير!$J76,\"ok\",\"error\")","v":"ok"},{"$f":"F77-[1]يناير!$J76","v":0},{"$f":"IF([1]يناير!$J76>0,[1]يناير!$C76,\" \")","v":" "},74,null,0]
[{"$f":"IF(F78=[1]يناير!$J77,\"ok\",\"error\")","v":"ok"},{"$f":"F78-[1]يناير!$J77","v":0},{"$f":"IF([1]يناير!$J77>0,[1]يناير!$C77,\" \")","v":" "},75,null,0]
[{"$f":"IF(F79=[1]يناير!$J78,\"ok\",\"error\")","v":"ok"},{"$f":"F79-[1]يناير!$J78","v":0},{"$f":"IF([1]يناير!$J78>0,[1]يناير!$C78,\" \")","v":" "},76,null,0]
[{"$f":"IF(F80=[1]يناير!$J79,\"ok\",\"error\")","v":"ok"},{"$f":"F80-[1]يناير!$J79","v":0},{"$f":"IF([1]يناير!$J79>0,[1]يناير!$C79,\" \")","v":" "},77,null,0]
[{"$f":"IF(F81=[1]يناير!$J80,\"ok\",\"error\")","v":"ok"},{"$f":"F81-[1]يناير!$J80","v":0},{"$f":"IF([1]يناير!$J80>0,[1]يناير!$C80,\" \")","v":" "},78,null,0]
[{"$f":"IF(F82=[1]يناير!$J81,\"ok\",\"error\")","v":"ok"},{"$f":"F82-[1]يناير!$J81","v":0},{"$f":"IF([1]يناير!$J81>0,[1]يناير!$C81,\" \")","v":" "},79,null,0]
[{"$f":"IF(F83=[1]يناير!$J82,\"ok\",\"error\")","v":"ok"},{"$f":"F83-[1]يناير!$J82","v":0},{"$f":"IF([1]يناير!$J82>0,[1]يناير!$C82,\" \")","v":" "},80,null,0]
[{"$f":"IF(F84=[1]يناير!$J83,\"ok\",\"error\")","v":"ok"},{"$f":"F84-[1]يناير!$J83","v":0},{"$f":"IF([1]يناير!$J83>0,[1]يناير!$C83,\" \")","v":" "},81,null,0]
[{"$f":"IF(F85=[1]يناير!$J84,\"ok\",\"error\")","v":"ok"},{"$f":"F85-[1]يناير!$J84","v":0},{"$f":"IF([1]يناير!$J84>0,[1]يناير!$C84,\" \")","v":" "},82,null,0]
[{"$f":"IF(F86=[1]يناير!$J85,\"ok\",\"error\")","v":"ok"},{"$f":"F86-[1]يناير!$J85","v":0},{"$f":"IF([1]يناير!$J85>0,[1]يناير!$C85,\" \")","v":" "},83,null,0]
[{"$f":"IF(F87=[1]يناير!$J86,\"ok\",\"error\")","v":"ok"},{"$f":"F87-[1]يناير!$J86","v":0},{"$f":"IF([1]يناير!$J86>0,[1]يناير!$C86,\" \")","v":" "},84,null,0]
[{"$f":"IF(F88=[1]يناير!$J87,\"ok\",\"error\")","v":"ok"},{"$f":"F88-[1]يناير!$J87","v":0},{"$f":"IF([1]يناير!$J87>0,[1]يناير!$C87,\" \")","v":" "},85,null,0]
[{"$f":"IF(F89=[1]يناير!$J88,\"ok\",\"error\")","v":"ok"},{"$f":"F89-[1]يناير!$J88","v":0},{"$f":"IF([1]يناير!$J88>0,[1]يناير!$C88,\" \")","v":" "},86,null,0]
[{"$f":"IF(F90=[1]يناير!$J89,\"ok\",\"error\")","v":"ok"},{"$f":"F90-[1]يناير!$J89","v":0},{"$f":"IF([1]يناير!$J89>0,[1]يناير!$C89,\" \")","v":" "},87,null,0]
[{"$f":"IF(F91=[1]يناير!$J90,\"ok\",\"error\")","v":"ok"},{"$f":"F91-[1]يناير!$J90","v":0},{"$f":"IF([1]يناير!$J90>0,[1]يناير!$C90,\" \")","v":" "},88,null,0]
[{"$f":"IF(F92=[1]يناير!$J91,\"ok\",\"error\")","v":"ok"},{"$f":"F92-[1]يناير!$J91","v":0},{"$f":"IF([1]يناير!$J91>0,[1]يناير!$C91,\" \")","v":" "},89,null,0]
[{"$f":"IF(F93=[1]يناير!$J92,\"ok\",\"error\")","v":"ok"},{"$f":"F93-[1]يناير!$J92","v":0},{"$f":"IF([1]يناير!$J92>0,[1]يناير!$C92,\" \")","v":" "},90,null,0]
[{"$f":"IF(F94=[1]يناير!$J93,\"ok\",\"error\")","v":"ok"},{"$f":"F94-[1]يناير!$J93","v":0},{"$f":"IF([1]يناير!$J93>0,[1]يناير!$C93,\" \")","v":" "},91,null,0]
[{"$f":"IF(F95=[1]يناير!$J94,\"ok\",\"error\")","v":"ok"},{"$f":"F95-[1]يناير!$J94","v":0},{"$f":"IF([1]يناير!$J94>0,[1]يناير!$C94,\" \")","v":" "},92,null,0]
[{"$f":"IF(F96=[1]يناير!$J95,\"ok\",\"error\")","v":"ok"},{"$f":"F96-[1]يناير!$J95","v":0},{"$f":"IF([1]يناير!$J95>0,[1]يناير!$C95,\" \")","v":" "},93,null,0]
[{"$f":"IF(F97=[1]يناير!$J96,\"ok\",\"error\")","v":"ok"},{"$f":"F97-[1]يناير!$J96","v":0},{"$f":"IF([1]يناير!$J96>0,[1]يناير!$C96,\" \")","v":" "},94,null,0]
[{"$f":"IF(F98=[1]يناير!$J97,\"ok\",\"error\")","v":"ok"},{"$f":"F98-[1]يناير!$J97","v":0},{"$f":"IF([1]يناير!$J97>0,[1]يناير!$C97,\" \")","v":" "},95,null,0]
[{"$f":"IF(F99=[1]يناير!$J98,\"ok\",\"error\")","v":"ok"},{"$f":"F99-[1]يناير!$J98","v":0},{"$f":"IF([1]يناير!$J98>0,[1]يناير!$C98,\" \")","v":" "},96,null,0]
[{"$f":"IF(F100=[1]يناير!$J99,\"ok\",\"error\")","v":"ok"},{"$f":"F100-[1]يناير!$J99","v":0},{"$f":"IF([1]يناير!$J99>0,[1]يناير!$C99,\" \")","v":" "},97,null,0]
[{"$f":"IF(F101=[1]يناير!$J100,\"ok\",\"error\")","v":"ok"},{"$f":"F101-[1]يناير!$J100","v":0},{"$f":"IF([1]يناير!$J100>0,[1]يناير!$C100,\" \")","v":" "},98,null,0]
[{"$f":"IF(F102=[1]يناير!$J101,\"ok\",\"error\")","v":"ok"},{"$f":"F102-[1]يناير!$J101","v":0},{"$f":"IF([1]يناير!$J101>0,[1]يناير!$C101,\" \")","v":" "},99,null,0]
[{"$f":"IF(F103=[1]يناير!$J102,\"ok\",\"error\")","v":"ok"},{"$f":"F103-[1]يناير!$J102","v":0},{"$f":"IF([1]يناير!$J102>0,[1]يناير!$C102,\" \")","v":" "},100,null,0]
[{"$f":"IF(F104=[1]يناير!$J103,\"ok\",\"error\")","v":"ok"},{"$f":"F104-[1]يناير!$J103","v":0},"الإجمالى",null,null,{"$f":"SUM(F4:F103)","v":0},{"$f":"SUM(G4:G103)","v":0},0,0,0,0,0,0,0,0,0,0,0,0,0,0,0,0,0,0,0,0,0,0,0,0,0,0,0,0]

{"sheet":"فبراير","index":1,"n_rows":106,"n_cols":35,"rows_kept":106,"cut":false,"hidden":false,"merged":[[1,38,2,38],[1,39,2,39],[1,10,2,10],[1,8,2,8],[1,34,2,34],[1,35,2,35],[1,36,2,36],[1,37,2,37],[1,30,2,30],[1,31,2,31],[1,32,2,32],[1,33,2,33],[1,26,2,26],[1,27,2,27],[1,28,2,28],[1,29,2,29],[1,22,2,22],[1,23,2,23],[1,24,2,24],[1,25,2,25],[1,18,2,18],[1,19,2,19],[1,20,2,20],[1,21,2,21],[1,15,2,15],[1,16,2,16],[1,17,2,17],[1,9,2,9],[1,11,2,11],[1,12,2,12],[1,13,2,13],[103,2,103,4],[1,2,2,2],[1,3,2,3],[1,4,2,4],[1,14,2,14],[0,2,0,14],[1,0,2,1],[1,5,2,5],[1,6,2,6],[1,7,2,7]]}
[null,null,"تحليـــــــــــــــــل مصـــــــــــــــروفات التشغيـــــــــــــــل عن شهـــــــــر فــــــــــبراير لعام 201"]
["OR",null,"التاريخ","رقم القيد","البيان","الإجمالى",{"$f":"يناير!G2","v":"صيانة\nواصلاح\nوقطع غيار"},{"$f":"يناير!H2","v":"خامات تشغيل"},{"$f":"يناير!I2","v":"م سيارات"},{"$f":"يناير!J2","v":"كهرباء"},{"$f":"يناير!K2","v":"م نظافة"},{"$f":"يناير!L2","v":"مياه"},{"$f":"يناير!M2","v":"تأمينات"},{"$f":"يناير!N2","v":"أجور"},{"$f":"يناير!O2","v":0},{"$f":"يناير!P2","v":0},{"$f":"يناير!Q2","v":0},{"$f":"يناير!R2","v":0},{"$f":"يناير!S2","v":0},{"$f":"يناير!T2","v":0},{"$f":"يناير!U2","v":0},{"$f":"يناير!V2","v":0},{"$f":"يناير!W2","v":0},{"$f":"يناير!X2","v":0},{"$f":"يناير!Y2","v":0},{"$f":"يناير!Z2","v":0},{"$f":"يناير!AA2","v":0},{"$f":"يناير!AB2","v":0},{"$f":"يناير!AC2","v":0},{"$f":"يناير!AD2","v":0}]
[]
[{"$f":"IF(F4=[1]فبراير!$J3,\"ok\",\"error\")","v":"ok"},{"$f":"F4-[1]فبراير!$J3","v":0},{"$f":"IF([1]فبراير!$J3>0,[1]فبراير!$C3,\" \")","v":" "},1,null,{"$f":"SUM(G4:AX4)","v":0}]
[{"$f":"IF(F5=[1]فبراير!$J4,\"ok\",\"error\")","v":"ok"},{"$f":"F5-[1]فبراير!$J4","v":0},{"$f":"IF([1]فبراير!$J4>0,[1]فبراير!$C4,\" \")","v":" "},2,null,0]
[{"$f":"IF(F6=[1]فبراير!$J5,\"ok\",\"error\")","v":"ok"},{"$f":"F6-[1]فبراير!$J5","v":0},{"$f":"IF([1]فبراير!$J5>0,[1]فبراير!$C5,\" \")","v":" "},3,null,0]
[{"$f":"IF(F7=[1]فبراير!$J6,\"ok\",\"error\")","v":"ok"},{"$f":"F7-[1]فبراير!$J6","v":0},{"$f":"IF([1]فبراير!$J6>0,[1]فبراير!$C6,\" \")","v":" "},4,null,0]
[{"$f":"IF(F8=[1]فبراير!$J7,\"ok\",\"error\")","v":"ok"},{"$f":"F8-[1]فبراير!$J7","v":0},{"$f":"IF([1]فبراير!$J7>0,[1]فبراير!$C7,\" \")","v":" "},5,null,0]
[{"$f":"IF(F9=[1]فبراير!$J8,\"ok\",\"error\")","v":"ok"},{"$f":"F9-[1]فبراير!$J8","v":0},{"$f":"IF([1]فبراير!$J8>0,[1]فبراير!$C8,\" \")","v":" "},6,null,0]
[{"$f":"IF(F10=[1]فبراير!$J9,\"ok\",\"error\")","v":"ok"},{"$f":"F10-[1]فبراير!$J9","v":0},{"$f":"IF([1]فبراير!$J9>0,[1]فبراير!$C9,\" \")","v":" "},7,null,0]
[{"$f":"IF(F11=[1]فبراير!$J10,\"ok\",\"error\")","v":"ok"},{"$f":"F11-[1]فبراير!$J10","v":0},{"$f":"IF([1]فبراير!$J10>0,[1]فبراير!$C10,\" \")","v":" "},8,null,0]
[{"$f":"IF(F12=[1]فبراير!$J11,\"ok\",\"error\")","v":"ok"},{"$f":"F12-[1]فبراير!$J11","v":0},{"$f":"IF([1]فبراير!$J11>0,[1]فبراير!$C11,\" \")","v":" "},9,null,0]
[{"$f":"IF(F13=[1]فبراير!$J12,\"ok\",\"error\")","v":"ok"},{"$f":"F13-[1]فبراير!$J12","v":0},{"$f":"IF([1]فبراير!$J12>0,[1]فبراير!$C12,\" \")","v":" "},10,null,0]
[{"$f":"IF(F14=[1]فبراير!$J13,\"ok\",\"error\")","v":"ok"},{"$f":"F14-[1]فبراير!$J13","v":0},{"$f":"IF([1]فبراير!$J13>0,[1]فبراير!$C13,\" \")","v":" "},11,null,0]
[{"$f":"IF(F15=[1]فبراير!$J14,\"ok\",\"error\")","v":"ok"},{"$f":"F15-[1]فبراير!$J14","v":0},{"$f":"IF([1]فبراير!$J14>0,[1]فبراير!$C14,\" \")","v":" "},12,null,0]
[{"$f":"IF(F16=[1]فبراير!$J15,\"ok\",\"error\")","v":"ok"},{"$f":"F16-[1]فبراير!$J15","v":0},{"$f":"IF([1]فبراير!$J15>0,[1]فبراير!$C15,\" \")","v":" "},13,null,0]
[{"$f":"IF(F17=[1]فبراير!$J16,\"ok\",\"error\")","v":"ok"},{"$f":"F17-[1]فبراير!$J16","v":0},{"$f":"IF([1]فبراير!$J16>0,[1]فبراير!$C16,\" \")","v":" "},14,null,0]
[{"$f":"IF(F18=[1]فبراير!$J17,\"ok\",\"error\")","v":"ok"},{"$f":"F18-[1]فبراير!$J17","v":0},{"$f":"IF([1]فبراير!$J17>0,[1]فبراير!$C17,\" \")","v":" "},15,null,0]
[{"$f":"IF(F19=[1]فبراير!$J18,\"ok\",\"error\")","v":"ok"},{"$f":"F19-[1]فبراير!$J18","v":0},{"$f":"IF([1]فبراير!$J18>0,[1]فبراير!$C18,\" \")","v":" "},16,null,0]
[{"$f":"IF(F20=[1]فبراير!$J19,\"ok\",\"error\")","v":"ok"},{"$f":"F20-[1]فبراير!$J19","v":0},{"$f":"IF([1]فبراير!$J19>0,[1]فبراير!$C19,\" \")","v":" "},17,null,0]
[{"$f":"IF(F21=[1]فبراير!$J20,\"ok\",\"error\")","v":"ok"},{"$f":"F21-[1]فبراير!$J20","v":0},{"$f":"IF([1]فبراير!$J20>0,[1]فبراير!$C20,\" \")","v":" "},18,null,0]
[{"$f":"IF(F22=[1]فبراير!$J21,\"ok\",\"error\")","v":"ok"},{"$f":"F22-[1]فبراير!$J21","v":0},{"$f":"IF([1]فبراير!$J21>0,[1]فبراير!$C21,\" \")","v":" "},19,null,0]
[{"$f":"IF(F23=[1]فبراير!$J22,\"ok\",\"error\")","v":"ok"},{"$f":"F23-[1]فبراير!$J22","v":0},{"$f":"IF([1]فبراير!$J22>0,[1]فبراير!$C22,\" \")","v":" "},20,null,0]
[{"$f":"IF(F24=[1]فبراير!$J23,\"ok\",\"error\")","v":"ok"},{"$f":"F24-[1]فبراير!$J23","v":0},{"$f":"IF([1]فبراير!$J23>0,[1]فبراير!$C23,\" \")","v":" "},21,null,0]
[{"$f":"IF(F25=[1]فبراير!$J24,\"ok\",\"error\")","v":"ok"},{"$f":"F25-[1]فبراير!$J24","v":0},{"$f":"IF([1]فبراير!$J24>0,[1]فبراير!$C24,\" \")","v":" "},22,null,0]
[{"$f":"IF(F26=[1]فبراير!$J25,\"ok\",\"error\")","v":"ok"},{"$f":"F26-[1]فبراير!$J25","v":0},{"$f":"IF([1]فبراير!$J25>0,[1]فبراير!$C25,\" \")","v":" "},23,null,0]
[{"$f":"IF(F27=[1]فبراير!$J26,\"ok\",\"error\")","v":"ok"},{"$f":"F27-[1]فبراير!$J26","v":0},{"$f":"IF([1]فبراير!$J26>0,[1]فبراير!$C26,\" \")","v":" "},24,null,0]
[{"$f":"IF(F28=[1]فبراير!$J27,\"ok\",\"error\")","v":"ok"},{"$f":"F28-[1]فبراير!$J27","v":0},{"$f":"IF([1]فبراير!$J27>0,[1]فبراير!$C27,\" \")","v":" "},25,null,0]
[{"$f":"IF(F29=[1]فبراير!$J28,\"ok\",\"error\")","v":"ok"},{"$f":"F29-[1]فبراير!$J28","v":0},{"$f":"IF([1]فبراير!$J28>0,[1]فبراير!$C28,\" \")","v":" "},26,null,0]
[{"$f":"IF(F30=[1]فبراير!$J29,\"ok\",\"error\")","v":"ok"},{"$f":"F30-[1]فبراير!$J29","v":0},{"$f":"IF([1]فبراير!$J29>0,[1]فبراير!$C29,\" \")","v":" "},27,null,0]
[{"$f":"IF(F31=[1]فبراير!$J30,\"ok\",\"error\")","v":"ok"},{"$f":"F31-[1]فبراير!$J30","v":0},{"$f":"IF([1]فبراير!$J30>0,[1]فبراير!$C30,\" \")","v":" "},28,null,0]
[{"$f":"IF(F32=[1]فبراير!$J31,\"ok\",\"error\")","v":"ok"},{"$f":"F32-[1]فبراير!$J31","v":0},{"$f":"IF([1]فبراير!$J31>0,[1]فبراير!$C31,\" \")","v":" "},29,null,0]
[{"$f":"IF(F33=[1]فبراير!$J32,\"ok\",\"error\")","v":"ok"},{"$f":"F33-[1]فبراير!$J32","v":0},{"$f":"IF([1]فبراير!$J32>0,[1]فبراير!$C32,\" \")","v":" "},30,null,0]
[{"$f":"IF(F34=[1]فبراير!$J33,\"ok\",\"error\")","v":"ok"},{"$f":"F34-[1]فبراير!$J33","v":0},{"$f":"IF([1]فبراير!$J33>0,[1]فبراير!$C33,\" \")","v":" "},31,null,0]
[{"$f":"IF(F35=[1]فبراير!$J34,\"ok\",\"error\")","v":"ok"},{"$f":"F35-[1]فبراير!$J34","v":0},{"$f":"IF([1]فبراير!$J34>0,[1]فبراير!$C34,\" \")","v":" "},32,null,0]
[{"$f":"IF(F36=[1]فبراير!$J35,\"ok\",\"error\")","v":"ok"},{"$f":"F36-[1]فبراير!$J35","v":0},{"$f":"IF([1]فبراير!$J35>0,[1]فبراير!$C35,\" \")","v":" "},33,null,{"$f":"SUM(G36:AX36)","v":0}]
[{"$f":"IF(F37=[1]فبراير!$J36,\"ok\",\"error\")","v":"ok"},{"$f":"F37-[1]فبراير!$J36","v":0},{"$f":"IF([1]فبراير!$J36>0,[1]فبراير!$C36,\" \")","v":" "},34,null,0]
[{"$f":"IF(F38=[1]فبراير!$J37,\"ok\",\"error\")","v":"ok"},{"$f":"F38-[1]فبراير!$J37","v":0},{"$f":"IF([1]فبراير!$J37>0,[1]فبراير!$C37,\" \")","v":" "},35,null,0]
[{"$f":"IF(F39=[1]فبراير!$J38,\"ok\",\"error\")","v":"ok"},{"$f":"F39-[1]فبراير!$J38","v":0},{"$f":"IF([1]فبراير!$J38>0,[1]فبراير!$C38,\" \")","v":" "},36,null,0]
[{"$f":"IF(F40=[1]فبراير!$J39,\"ok\",\"error\")","v":"ok"},{"$f":"F40-[1]فبراير!$J39","v":0},{"$f":"IF([1]فبراير!$J39>0,[1]فبراير!$C39,\" \")","v":" "},37,null,0]
[{"$f":"IF(F41=[1]فبراير!$J40,\"ok\",\"error\")","v":"ok"},{"$f":"F41-[1]فبراير!$J40","v":0},{"$f":"IF([1]فبراير!$J40>0,[1]فبراير!$C40,\" \")","v":" "},38,null,0]
[{"$f":"IF(F42=[1]فبراير!$J41,\"ok\",\"error\")","v":"ok"},{"$f":"F42-[1]فبراير!$J41","v":0},{"$f":"IF([1]فبراير!$J41>0,[1]فبراير!$C41,\" \")","v":" "},39,null,0]
[{"$f":"IF(F43=[1]فبراير!$J42,\"ok\",\"error\")","v":"ok"},{"$f":"F43-[1]فبراير!$J42","v":0},{"$f":"IF([1]فبراير!$J42>0,[1]فبراير!$C42,\" \")","v":" "},40,null,0]
[{"$f":"IF(F44=[1]فبراير!$J43,\"ok\",\"error\")","v":"ok"},{"$f":"F44-[1]فبراير!$J43","v":0},{"$f":"IF([1]فبراير!$J43>0,[1]فبراير!$C43,\" \")","v":" "},41,null,0]
[{"$f":"IF(F45=[1]فبراير!$J44,\"ok\",\"error\")","v":"ok"},{"$f":"F45-[1]فبراير!$J44","v":0},{"$f":"IF([1]فبراير!$J44>0,[1]فبراير!$C44,\" \")","v":" "},42,null,0]
[{"$f":"IF(F46=[1]فبراير!$J45,\"ok\",\"error\")","v":"ok"},{"$f":"F46-[1]فبراير!$J45","v":0},{"$f":"IF([1]فبراير!$J45>0,[1]فبراير!$C45,\" \")","v":" "},43,null,0]
[{"$f":"IF(F47=[1]فبراير!$J46,\"ok\",\"error\")","v":"ok"},{"$f":"F47-[1]فبراير!$J46","v":0},{"$f":"IF([1]فبراير!$J46>0,[1]فبراير!$C46,\" \")","v":" "},44,null,0]
[{"$f":"IF(F48=[1]فبراير!$J47,\"ok\",\"error\")","v":"ok"},{"$f":"F48-[1]فبراير!$J47","v":0},{"$f":"IF([1]فبراير!$J47>0,[1]فبراير!$C47,\" \")","v":" "},45,null,0]
[{"$f":"IF(F49=[1]فبراير!$J48,\"ok\",\"error\")","v":"ok"},{"$f":"F49-[1]فبراير!$J48","v":0},{"$f":"IF([1]فبراير!$J48>0,[1]فبراير!$C48,\" \")","v":" "},46,null,0]
[{"$f":"IF(F50=[1]فبراير!$J49,\"ok\",\"error\")","v":"ok"},{"$f":"F50-[1]فبراير!$J49","v":0},{"$f":"IF([1]فبراير!$J49>0,[1]فبراير!$C49,\" \")","v":" "},47,null,0]
[{"$f":"IF(F51=[1]فبراير!$J50,\"ok\",\"error\")","v":"ok"},{"$f":"F51-[1]فبراير!$J50","v":0},{"$f":"IF([1]فبراير!$J50>0,[1]فبراير!$C50,\" \")","v":" "},48,null,0]
[{"$f":"IF(F52=[1]فبراير!$J51,\"ok\",\"error\")","v":"ok"},{"$f":"F52-[1]فبراير!$J51","v":0},{"$f":"IF([1]فبراير!$J51>0,[1]فبراير!$C51,\" \")","v":" "},49,null,0]
[{"$f":"IF(F53=[1]فبراير!$J52,\"ok\",\"error\")","v":"ok"},{"$f":"F53-[1]فبراير!$J52","v":0},{"$f":"IF([1]فبراير!$J52>0,[1]فبراير!$C52,\" \")","v":" "},50,null,0]
[{"$f":"IF(F54=[1]فبراير!$J53,\"ok\",\"error\")","v":"ok"},{"$f":"F54-[1]فبراير!$J53","v":0},{"$f":"IF([1]فبراير!$J53>0,[1]فبراير!$C53,\" \")","v":" "},51,null,0]
[{"$f":"IF(F55=[1]فبراير!$J54,\"ok\",\"error\")","v":"ok"},{"$f":"F55-[1]فبراير!$J54","v":0},{"$f":"IF([1]فبراير!$J54>0,[1]فبراير!$C54,\" \")","v":" "},52,null,0]
[{"$f":"IF(F56=[1]فبراير!$J55,\"ok\",\"error\")","v":"ok"},{"$f":"F56-[1]فبراير!$J55","v":0},{"$f":"IF([1]فبراير!$J55>0,[1]فبراير!$C55,\" \")","v":" "},53,null,0]
[{"$f":"IF(F57=[1]فبراير!$J56,\"ok\",\"error\")","v":"ok"},{"$f":"F57-[1]فبراير!$J56","v":0},{"$f":"IF([1]فبراير!$J56>0,[1]فبراير!$C56,\" \")","v":" "},54,null,0]
[{"$f":"IF(F58=[1]فبراير!$J57,\"ok\",\"error\")","v":"ok"},{"$f":"F58-[1]فبراير!$J57","v":0},{"$f":"IF([1]فبراير!$J57>0,[1]فبراير!$C57,\" \")","v":" "},55,null,0]
[{"$f":"IF(F59=[1]فبراير!$J58,\"ok\",\"error\")","v":"ok"},{"$f":"F59-[1]فبراير!$J58","v":0},{"$f":"IF([1]فبراير!$J58>0,[1]فبراير!$C58,\" \")","v":" "},56,null,0]
[{"$f":"IF(F60=[1]فبراير!$J59,\"ok\",\"error\")","v":"ok"},{"$f":"F60-[1]فبراير!$J59","v":0},{"$f":"IF([1]فبراير!$J59>0,[1]فبراير!$C59,\" \")","v":" "},57,null,0]
[{"$f":"IF(F61=[1]فبراير!$J60,\"ok\",\"error\")","v":"ok"},{"$f":"F61-[1]فبراير!$J60","v":0},{"$f":"IF([1]فبراير!$J60>0,[1]فبراير!$C60,\" \")","v":" "},58,null,0]
[{"$f":"IF(F62=[1]فبراير!$J61,\"ok\",\"error\")","v":"ok"},{"$f":"F62-[1]فبراير!$J61","v":0},{"$f":"IF([1]فبراير!$J61>0,[1]فبراير!$C61,\" \")","v":" "},59,null,0]
[{"$f":"IF(F63=[1]فبراير!$J62,\"ok\",\"error\")","v":"ok"},{"$f":"F63-[1]فبراير!$J62","v":0},{"$f":"IF([1]فبراير!$J62>0,[1]فبراير!$C62,\" \")","v":" "},60,null,0]
[{"$f":"IF(F64=[1]فبراير!$J63,\"ok\",\"error\")","v":"ok"},{"$f":"F64-[1]فبراير!$J63","v":0},{"$f":"IF([1]فبراير!$J63>0,[1]فبراير!$C63,\" \")","v":" "},61,null,0]
[{"$f":"IF(F65=[1]فبراير!$J64,\"ok\",\"error\")","v":"ok"},{"$f":"F65-[1]فبراير!$J64","v":0},{"$f":"IF([1]فبراير!$J64>0,[1]فبراير!$C64,\" \")","v":" "},62,null,0]
[{"$f":"IF(F66=[1]فبراير!$J65,\"ok\",\"error\")","v":"ok"},{"$f":"F66-[1]فبراير!$J65","v":0},{"$f":"IF([1]فبراير!$J65>0,[1]فبراير!$C65,\" \")","v":" "},63,null,0]
[{"$f":"IF(F67=[1]فبراير!$J66,\"ok\",\"error\")","v":"ok"},{"$f":"F67-[1]فبراير!$J66","v":0},{"$f":"IF([1]فبراير!$J66>0,[1]فبراير!$C66,\" \")","v":" "},64,null,0]
[{"$f":"IF(F68=[1]فبراير!$J67,\"ok\",\"error\")","v":"ok"},{"$f":"F68-[1]فبراير!$J67","v":0},{"$f":"IF([1]فبراير!$J67>0,[1]فبراير!$C67,\" \")","v":" "},65,null,{"$f":"SUM(G68:AX68)","v":0}]
[{"$f":"IF(F69=[1]فبراير!$J68,\"ok\",\"error\")","v":"ok"},{"$f":"F69-[1]فبراير!$J68","v":0},{"$f":"IF([1]فبراير!$J68>0,[1]فبراير!$C68,\" \")","v":" "},66,null,0]
[{"$f":"IF(F70=[1]فبراير!$J69,\"ok\",\"error\")","v":"ok"},{"$f":"F70-[1]فبراير!$J69","v":0},{"$f":"IF([1]فبراير!$J69>0,[1]فبراير!$C69,\" \")","v":" "},67,null,0]
[{"$f":"IF(F71=[1]فبراير!$J70,\"ok\",\"error\")","v":"ok"},{"$f":"F71-[1]فبراير!$J70","v":0},{"$f":"IF([1]فبراير!$J70>0,[1]فبراير!$C70,\" \")","v":" "},68,null,0]
[{"$f":"IF(F72=[1]فبراير!$J71,\"ok\",\"error\")","v":"ok"},{"$f":"F72-[1]فبراير!$J71","v":0},{"$f":"IF([1]فبراير!$J71>0,[1]فبراير!$C71,\" \")","v":" "},69,null,0]
[{"$f":"IF(F73=[1]فبراير!$J72,\"ok\",\"error\")","v":"ok"},{"$f":"F73-[1]فبراير!$J72","v":0},{"$f":"IF([1]فبراير!$J72>0,[1]فبراير!$C72,\" \")","v":" "},70,null,0]
[{"$f":"IF(F74=[1]فبراير!$J73,\"ok\",\"error\")","v":"ok"},{"$f":"F74-[1]فبراير!$J73","v":0},{"$f":"IF([1]فبراير!$J73>0,[1]فبراير!$C73,\" \")","v":" "},71,null,0]
[{"$f":"IF(F75=[1]فبراير!$J74,\"ok\",\"error\")","v":"ok"},{"$f":"F75-[1]فبراير!$J74","v":0},{"$f":"IF([1]فبراير!$J74>0,[1]فبراير!$C74,\" \")","v":" "},72,null,0]
[{"$f":"IF(F76=[1]فبراير!$J75,\"ok\",\"error\")","v":"ok"},{"$f":"F76-[1]فبراير!$J75","v":0},{"$f":"IF([1]فبراير!$J75>0,[1]فبراير!$C75,\" \")","v":" "},73,null,0]
[{"$f":"IF(F77=[1]فبراير!$J76,\"ok\",\"error\")","v":"ok"},{"$f":"F77-[1]فبراير!$J76","v":0},{"$f":"IF([1]فبراير!$J76>0,[1]فبراير!$C76,\" \")","v":" "},74,null,0]
[{"$f":"IF(F78=[1]فبراير!$J77,\"ok\",\"error\")","v":"ok"},{"$f":"F78-[1]فبراير!$J77","v":0},{"$f":"IF([1]فبراير!$J77>0,[1]فبراير!$C77,\" \")","v":" "},75,null,0]
[{"$f":"IF(F79=[1]فبراير!$J78,\"ok\",\"error\")","v":"ok"},{"$f":"F79-[1]فبراير!$J78","v":0},{"$f":"IF([1]فبراير!$J78>0,[1]فبراير!$C78,\" \")","v":" "},76,null,0]
[{"$f":"IF(F80=[1]فبراير!$J79,\"ok\",\"error\")","v":"ok"},{"$f":"F80-[1]فبراير!$J79","v":0},{"$f":"IF([1]فبراير!$J79>0,[1]فبراير!$C79,\" \")","v":" "},77,null,0]
[{"$f":"IF(F81=[1]فبراير!$J80,\"ok\",\"error\")","v":"ok"},{"$f":"F81-[1]فبراير!$J80","v":0},{"$f":"IF([1]فبراير!$J80>0,[1]فبراير!$C80,\" \")","v":" "},78,null,0]
[{"$f":"IF(F82=[1]فبراير!$J81,\"ok\",\"error\")","v":"ok"},{"$f":"F82-[1]فبراير!$J81","v":0},{"$f":"IF([1]فبراير!$J81>0,[1]فبراير!$C81,\" \")","v":" "},79,null,0]
[{"$f":"IF(F83=[1]فبراير!$J82,\"ok\",\"error\")","v":"ok"},{"$f":"F83-[1]فبراير!$J82","v":0},{"$f":"IF([1]فبراير!$J82>0,[1]فبراير!$C82,\" \")","v":" "},80,null,0]
[{"$f":"IF(F84=[1]فبراير!$J83,\"ok\",\"error\")","v":"ok"},{"$f":"F84-[1]فبراير!$J83","v":0},{"$f":"IF([1]فبراير!$J83>0,[1]فبراير!$C83,\" \")","v":" "},81,null,0]
[{"$f":"IF(F85=[1]فبراير!$J84,\"ok\",\"error\")","v":"ok"},{"$f":"F85-[1]فبراير!$J84","v":0},{"$f":"IF([1]فبراير!$J84>0,[1]فبراير!$C84,\" \")","v":" "},82,null,0]
[{"$f":"IF(F86=[1]فبراير!$J85,\"ok\",\"error\")","v":"ok"},{"$f":"F86-[1]فبراير!$J85","v":0},{"$f":"IF([1]فبراير!$J85>0,[1]فبراير!$C85,\" \")","v":" "},83,null,0]
[{"$f":"IF(F87=[1]فبراير!$J86,\"ok\",\"error\")","v":"ok"},{"$f":"F87-[1]فبراير!$J86","v":0},{"$f":"IF([1]فبراير!$J86>0,[1]فبراير!$C86,\" \")","v":" "},84,null,0]
[{"$f":"IF(F88=[1]فبراير!$J87,\"ok\",\"error\")","v":"ok"},{"$f":"F88-[1]فبراير!$J87","v":0},{"$f":"IF([1]فبراير!$J87>0,[1]فبراير!$C87,\" \")","v":" "},85,null,0]
[{"$f":"IF(F89=[1]فبراير!$J88,\"ok\",\"error\")","v":"ok"},{"$f":"F89-[1]فبراير!$J88","v":0},{"$f":"IF([1]فبراير!$J88>0,[1]فبراير!$C88,\" \")","v":" "},86,null,0]
[{"$f":"IF(F90=[1]فبراير!$J89,\"ok\",\"error\")","v":"ok"},{"$f":"F90-[1]فبراير!$J89","v":0},{"$f":"IF([1]فبراير!$J89>0,[1]فبراير!$C89,\" \")","v":" "},87,null,0]
[{"$f":"IF(F91=[1]فبراير!$J90,\"ok\",\"error\")","v":"ok"},{"$f":"F91-[1]فبراير!$J90","v":0},{"$f":"IF([1]فبراير!$J90>0,[1]فبراير!$C90,\" \")","v":" "},88,null,0]
[{"$f":"IF(F92=[1]فبراير!$J91,\"ok\",\"error\")","v":"ok"},{"$f":"F92-[1]فبراير!$J91","v":0},{"$f":"IF([1]فبراير!$J91>0,[1]فبراير!$C91,\" \")","v":" "},89,null,0]
[{"$f":"IF(F93=[1]فبراير!$J92,\"ok\",\"error\")","v":"ok"},{"$f":"F93-[1]فبراير!$J92","v":0},{"$f":"IF([1]فبراير!$J92>0,[1]فبراير!$C92,\" \")","v":" "},90,null,0]
[{"$f":"IF(F94=[1]فبراير!$J93,\"ok\",\"error\")","v":"ok"},{"$f":"F94-[1]فبراير!$J93","v":0},{"$f":"IF([1]فبراير!$J93>0,[1]فبراير!$C93,\" \")","v":" "},91,null,0]
[{"$f":"IF(F95=[1]فبراير!$J94,\"ok\",\"error\")","v":"ok"},{"$f":"F95-[1]فبراير!$J94","v":0},{"$f":"IF([1]فبراير!$J94>0,[1]فبراير!$C94,\" \")","v":" "},92,null,0]
[{"$f":"IF(F96=[1]فبراير!$J95,\"ok\",\"error\")","v":"ok"},{"$f":"F96-[1]فبراير!$J95","v":0},{"$f":"IF([1]فبراير!$J95>0,[1]فبراير!$C95,\" \")","v":" "},93,null,0]
[{"$f":"IF(F97=[1]فبراير!$J96,\"ok\",\"error\")","v":"ok"},{"$f":"F97-[1]فبراير!$J96","v":0},{"$f":"IF([1]فبراير!$J96>0,[1]فبراير!$C96,\" \")","v":" "},94,null,0]
[{"$f":"IF(F98=[1]فبراير!$J97,\"ok\",\"error\")","v":"ok"},{"$f":"F98-[1]فبراير!$J97","v":0},{"$f":"IF([1]فبراير!$J97>0,[1]فبراير!$C97,\" \")","v":" "},95,null,0]
[{"$f":"IF(F99=[1]فبراير!$J98,\"ok\",\"error\")","v":"ok"},{"$f":"F99-[1]فبراير!$J98","v":0},{"$f":"IF([1]فبراير!$J98>0,[1]فبراير!$C98,\" \")","v":" "},96,null,0]
[{"$f":"IF(F100=[1]فبراير!$J99,\"ok\",\"error\")","v":"ok"},{"$f":"F100-[1]فبراير!$J99","v":0},{"$f":"IF([1]فبراير!$J99>0,[1]فبراير!$C99,\" \")","v":" "},97,null,{"$f":"SUM(G100:AX100)","v":0}]
[{"$f":"IF(F101=[1]فبراير!$J100,\"ok\",\"error\")","v":"ok"},{"$f":"F101-[1]فبراير!$J100","v":0},{"$f":"IF([1]فبراير!$J100>0,[1]فبراير!$C100,\" \")","v":" "},98,null,{"$f":"SUM(G101:AX101)","v":0}]
[{"$f":"IF(F102=[1]فبراير!$J101,\"ok\",\"error\")","v":"ok"},{"$f":"F102-[1]فبراير!$J101","v":0},{"$f":"IF([1]فبراير!$J101>0,[1]فبراير!$C101,\" \")","v":" "},99,null,{"$f":"SUM(G102:AX102)","v":0}]
[{"$f":"IF(F103=[1]فبراير!$J102,\"ok\",\"error\")","v":"ok"},{"$f":"F103-[1]فبراير!$J102","v":0},{"$f":"IF([1]فبراير!$J102>0,[1]فبراير!$C102,\" \")","v":" "},100,null,{"$f":"SUM(G103:AX103)","v":0}]
[{"$f":"IF(F104=[1]فبراير!$J103,\"ok\",\"error\")","v":"ok"},{"$f":"F104-[1]فبراير!$J103","v":0},"الإجمالى",null,null,{"$f":"SUM(F4:F103)","v":0},0,0,0,0,0,0,0,0,0,0,0,0,0,0,0,0,0,0,0,0,0,0,0,0,0,0,0,0,0]
[]
[null,null,null,null,"؟",{"$f":"F104-[1]فبراير!$J$103","v":0}]

{"sheet":"مارس","index":2,"n_rows":106,"n_cols":35,"rows_kept":106,"cut":false,"hidden":false,"merged":[[1,7,2,7],[1,9,2,9],[103,2,103,4],[1,2,2,2],[1,3,2,3],[1,4,2,4],[1,5,2,5],[1,6,2,6],[1,22,2,22],[1,11,2,11],[1,12,2,12],[1,13,2,13],[1,14,2,14],[1,15,2,15],[1,16,2,16],[1,17,2,17],[1,18,2,18],[1,19,2,19],[1,20,2,20],[1,21,2,21],[1,33,2,33],[1,26,2,26],[1,27,2,27],[1,28,2,28],[1,29,2,29],[0,2,0,14],[1,0,2,1],[1,38,2,38],[1,39,2,39],[1,10,2,10],[1,8,2,8],[1,34,2,34],[1,35,2,35],[1,36,2,36],[1,37,2,37],[1,30,2,30],[1,23,2,23],[1,24,2,24],[1,25,2,25],[1,31,2,31],[1,32,2,32]]}
[null,null,"تحليـــــــــــــــــل مصـــــــــــــــروفات التشغيـــــــــــــــل عن شهـــــــــر مــــــارس لعام 201"]
["OR",null,"التاريخ","رقم القيد","البيان","الإجمالى",{"$f":"فبراير!G2","v":"صيانة\nواصلاح\nوقطع غيار"},{"$f":"فبراير!H2","v":"خامات تشغيل"},{"$f":"فبراير!I2","v":"م سيارات"},{"$f":"فبراير!J2","v":"كهرباء"},{"$f":"فبراير!K2","v":"م نظافة"},{"$f":"فبراير!L2","v":"مياه"},{"$f":"فبراير!M2","v":"تأمينات"},{"$f":"فبراير!N2","v":"أجور"},{"$f":"فبراير!O2","v":0},{"$f":"فبراير!P2","v":0},{"$f":"فبراير!Q2","v":0},{"$f":"فبراير!R2","v":0},{"$f":"فبراير!S2","v":0},{"$f":"فبراير!T2","v":0},{"$f":"فبراير!U2","v":0},{"$f":"فبراير!V2","v":0},{"$f":"فبراير!W2","v":0},{"$f":"فبراير!X2","v":0},{"$f":"فبراير!Y2","v":0},{"$f":"فبراير!Z2","v":0},{"$f":"فبراير!AA2","v":0},{"$f":"فبراير!AB2","v":0},{"$f":"فبراير!AC2","v":0},{"$f":"فبراير!AD2","v":0}]
[]
[{"$f":"IF(F4=[1]مارس!$J3,\"ok\",\"error\")","v":"ok"},{"$f":"F4-[1]مارس!$J3","v":0},{"$f":"IF([1]مارس!$J3>0,[1]مارس!$C3,\" \")","v":" "},1,null,{"$f":"SUM(G4:AX4)","v":0}]
[{"$f":"IF(F5=[1]مارس!$J4,\"ok\",\"error\")","v":"ok"},{"$f":"F5-[1]مارس!$J4","v":0},{"$f":"IF([1]مارس!$J4>0,[1]مارس!$C4,\" \")","v":" "},2,null,0]
[{"$f":"IF(F6=[1]مارس!$J5,\"ok\",\"error\")","v":"ok"},{"$f":"F6-[1]مارس!$J5","v":0},{"$f":"IF([1]مارس!$J5>0,[1]مارس!$C5,\" \")","v":" "},3,null,0]
[{"$f":"IF(F7=[1]مارس!$J6,\"ok\",\"error\")","v":"ok"},{"$f":"F7-[1]مارس!$J6","v":0},{"$f":"IF([1]مارس!$J6>0,[1]مارس!$C6,\" \")","v":" "},4,null,0]
[{"$f":"IF(F8=[1]مارس!$J7,\"ok\",\"error\")","v":"ok"},{"$f":"F8-[1]مارس!$J7","v":0},{"$f":"IF([1]مارس!$J7>0,[1]مارس!$C7,\" \")","v":" "},5,null,0]
[{"$f":"IF(F9=[1]مارس!$J8,\"ok\",\"error\")","v":"ok"},{"$f":"F9-[1]مارس!$J8","v":0},{"$f":"IF([1]مارس!$J8>0,[1]مارس!$C8,\" \")","v":" "},6,null,0]
[{"$f":"IF(F10=[1]مارس!$J9,\"ok\",\"error\")","v":"ok"},{"$f":"F10-[1]مارس!$J9","v":0},{"$f":"IF([1]مارس!$J9>0,[1]مارس!$C9,\" \")","v":" "},7,null,0]
[{"$f":"IF(F11=[1]مارس!$J10,\"ok\",\"error\")","v":"ok"},{"$f":"F11-[1]مارس!$J10","v":0},{"$f":"IF([1]مارس!$J10>0,[1]مارس!$C10,\" \")","v":" "},8,null,0]
[{"$f":"IF(F12=[1]مارس!$J11,\"ok\",\"error\")","v":"ok"},{"$f":"F12-[1]مارس!$J11","v":0},{"$f":"IF([1]مارس!$J11>0,[1]مارس!$C11,\" \")","v":" "},9,null,0]
[{"$f":"IF(F13=[1]مارس!$J12,\"ok\",\"error\")","v":"ok"},{"$f":"F13-[1]مارس!$J12","v":0},{"$f":"IF([1]مارس!$J12>0,[1]مارس!$C12,\" \")","v":" "},10,null,0]
[{"$f":"IF(F14=[1]مارس!$J13,\"ok\",\"error\")","v":"ok"},{"$f":"F14-[1]مارس!$J13","v":0},{"$f":"IF([1]مارس!$J13>0,[1]مارس!$C13,\" \")","v":" "},11,null,0]
[{"$f":"IF(F15=[1]مارس!$J14,\"ok\",\"error\")","v":"ok"},{"$f":"F15-[1]مارس!$J14","v":0},{"$f":"IF([1]مارس!$J14>0,[1]مارس!$C14,\" \")","v":" "},12,null,0]
[{"$f":"IF(F16=[1]مارس!$J15,\"ok\",\"error\")","v":"ok"},{"$f":"F16-[1]مارس!$J15","v":0},{"$f":"IF([1]مارس!$J15>0,[1]مارس!$C15,\" \")","v":" "},13,null,0]
[{"$f":"IF(F17=[1]مارس!$J16,\"ok\",\"error\")","v":"ok"},{"$f":"F17-[1]مارس!$J16","v":0},{"$f":"IF([1]مارس!$J16>0,[1]مارس!$C16,\" \")","v":" "},14,null,0]
[{"$f":"IF(F18=[1]مارس!$J17,\"ok\",\"error\")","v":"ok"},{"$f":"F18-[1]مارس!$J17","v":0},{"$f":"IF([1]مارس!$J17>0,[1]مارس!$C17,\" \")","v":" "},15,null,0]
[{"$f":"IF(F19=[1]مارس!$J18,\"ok\",\"error\")","v":"ok"},{"$f":"F19-[1]مارس!$J18","v":0},{"$f":"IF([1]مارس!$J18>0,[1]مارس!$C18,\" \")","v":" "},16,null,0]
[{"$f":"IF(F20=[1]مارس!$J19,\"ok\",\"error\")","v":"ok"},{"$f":"F20-[1]مارس!$J19","v":0},{"$f":"IF([1]مارس!$J19>0,[1]مارس!$C19,\" \")","v":" "},17,null,0]
[{"$f":"IF(F21=[1]مارس!$J20,\"ok\",\"error\")","v":"ok"},{"$f":"F21-[1]مارس!$J20","v":0},{"$f":"IF([1]مارس!$J20>0,[1]مارس!$C20,\" \")","v":" "},18,null,0]
[{"$f":"IF(F22=[1]مارس!$J21,\"ok\",\"error\")","v":"ok"},{"$f":"F22-[1]مارس!$J21","v":0},{"$f":"IF([1]مارس!$J21>0,[1]مارس!$C21,\" \")","v":" "},19,null,0]
[{"$f":"IF(F23=[1]مارس!$J22,\"ok\",\"error\")","v":"ok"},{"$f":"F23-[1]مارس!$J22","v":0},{"$f":"IF([1]مارس!$J22>0,[1]مارس!$C22,\" \")","v":" "},20,null,0]
[{"$f":"IF(F24=[1]مارس!$J23,\"ok\",\"error\")","v":"ok"},{"$f":"F24-[1]مارس!$J23","v":0},{"$f":"IF([1]مارس!$J23>0,[1]مارس!$C23,\" \")","v":" "},21,null,0]
[{"$f":"IF(F25=[1]مارس!$J24,\"ok\",\"error\")","v":"ok"},{"$f":"F25-[1]مارس!$J24","v":0},{"$f":"IF([1]مارس!$J24>0,[1]مارس!$C24,\" \")","v":" "},22,null,0]
[{"$f":"IF(F26=[1]مارس!$J25,\"ok\",\"error\")","v":"ok"},{"$f":"F26-[1]مارس!$J25","v":0},{"$f":"IF([1]مارس!$J25>0,[1]مارس!$C25,\" \")","v":" "},23,null,0]
[{"$f":"IF(F27=[1]مارس!$J26,\"ok\",\"error\")","v":"ok"},{"$f":"F27-[1]مارس!$J26","v":0},{"$f":"IF([1]مارس!$J26>0,[1]مارس!$C26,\" \")","v":" "},24,null,0]
[{"$f":"IF(F28=[1]مارس!$J27,\"ok\",\"error\")","v":"ok"},{"$f":"F28-[1]مارس!$J27","v":0},{"$f":"IF([1]مارس!$J27>0,[1]مارس!$C27,\" \")","v":" "},25,null,0]
[{"$f":"IF(F29=[1]مارس!$J28,\"ok\",\"error\")","v":"ok"},{"$f":"F29-[1]مارس!$J28","v":0},{"$f":"IF([1]مارس!$J28>0,[1]مارس!$C28,\" \")","v":" "},26,null,0]
[{"$f":"IF(F30=[1]مارس!$J29,\"ok\",\"error\")","v":"ok"},{"$f":"F30-[1]مارس!$J29","v":0},{"$f":"IF([1]مارس!$J29>0,[1]مارس!$C29,\" \")","v":" "},27,null,0]
[{"$f":"IF(F31=[1]مارس!$J30,\"ok\",\"error\")","v":"ok"},{"$f":"F31-[1]مارس!$J30","v":0},{"$f":"IF([1]مارس!$J30>0,[1]مارس!$C30,\" \")","v":" "},28,null,0]
[{"$f":"IF(F32=[1]مارس!$J31,\"ok\",\"error\")","v":"ok"},{"$f":"F32-[1]مارس!$J31","v":0},{"$f":"IF([1]مارس!$J31>0,[1]مارس!$C31,\" \")","v":" "},29,null,0]
[{"$f":"IF(F33=[1]مارس!$J32,\"ok\",\"error\")","v":"ok"},{"$f":"F33-[1]مارس!$J32","v":0},{"$f":"IF([1]مارس!$J32>0,[1]مارس!$C32,\" \")","v":" "},30,null,0]
[{"$f":"IF(F34=[1]مارس!$J33,\"ok\",\"error\")","v":"ok"},{"$f":"F34-[1]مارس!$J33","v":0},{"$f":"IF([1]مارس!$J33>0,[1]مارس!$C33,\" \")","v":" "},31,null,0]
[{"$f":"IF(F35=[1]مارس!$J34,\"ok\",\"error\")","v":"ok"},{"$f":"F35-[1]مارس!$J34","v":0},{"$f":"IF([1]مارس!$J34>0,[1]مارس!$C34,\" \")","v":" "},32,null,0]
[{"$f":"IF(F36=[1]مارس!$J35,\"ok\",\"error\")","v":"ok"},{"$f":"F36-[1]مارس!$J35","v":0},{"$f":"IF([1]مارس!$J35>0,[1]مارس!$C35,\" \")","v":" "},33,null,{"$f":"SUM(G36:AX36)","v":0}]
[{"$f":"IF(F37=[1]مارس!$J36,\"ok\",\"error\")","v":"ok"},{"$f":"F37-[1]مارس!$J36","v":0},{"$f":"IF([1]مارس!$J36>0,[1]مارس!$C36,\" \")","v":" "},34,null,0]
[{"$f":"IF(F38=[1]مارس!$J37,\"ok\",\"error\")","v":"ok"},{"$f":"F38-[1]مارس!$J37","v":0},{"$f":"IF([1]مارس!$J37>0,[1]مارس!$C37,\" \")","v":" "},35,null,0]
[{"$f":"IF(F39=[1]مارس!$J38,\"ok\",\"error\")","v":"ok"},{"$f":"F39-[1]مارس!$J38","v":0},{"$f":"IF([1]مارس!$J38>0,[1]مارس!$C38,\" \")","v":" "},36,null,0]
[{"$f":"IF(F40=[1]مارس!$J39,\"ok\",\"error\")","v":"ok"},{"$f":"F40-[1]مارس!$J39","v":0},{"$f":"IF([1]مارس!$J39>0,[1]مارس!$C39,\" \")","v":" "},37,null,0]
[{"$f":"IF(F41=[1]مارس!$J40,\"ok\",\"error\")","v":"ok"},{"$f":"F41-[1]مارس!$J40","v":0},{"$f":"IF([1]مارس!$J40>0,[1]مارس!$C40,\" \")","v":" "},38,null,0]
[{"$f":"IF(F42=[1]مارس!$J41,\"ok\",\"error\")","v":"ok"},{"$f":"F42-[1]مارس!$J41","v":0},{"$f":"IF([1]مارس!$J41>0,[1]مارس!$C41,\" \")","v":" "},39,null,0]
[{"$f":"IF(F43=[1]مارس!$J42,\"ok\",\"error\")","v":"ok"},{"$f":"F43-[1]مارس!$J42","v":0},{"$f":"IF([1]مارس!$J42>0,[1]مارس!$C42,\" \")","v":" "},40,null,0]
[{"$f":"IF(F44=[1]مارس!$J43,\"ok\",\"error\")","v":"ok"},{"$f":"F44-[1]مارس!$J43","v":0},{"$f":"IF([1]مارس!$J43>0,[1]مارس!$C43,\" \")","v":" "},41,null,0]
[{"$f":"IF(F45=[1]مارس!$J44,\"ok\",\"error\")","v":"ok"},{"$f":"F45-[1]مارس!$J44","v":0},{"$f":"IF([1]مارس!$J44>0,[1]مارس!$C44,\" \")","v":" "},42,null,0]
[{"$f":"IF(F46=[1]مارس!$J45,\"ok\",\"error\")","v":"ok"},{"$f":"F46-[1]مارس!$J45","v":0},{"$f":"IF([1]مارس!$J45>0,[1]مارس!$C45,\" \")","v":" "},43,null,0]
[{"$f":"IF(F47=[1]مارس!$J46,\"ok\",\"error\")","v":"ok"},{"$f":"F47-[1]مارس!$J46","v":0},{"$f":"IF([1]مارس!$J46>0,[1]مارس!$C46,\" \")","v":" "},44,null,0]
[{"$f":"IF(F48=[1]مارس!$J47,\"ok\",\"error\")","v":"ok"},{"$f":"F48-[1]مارس!$J47","v":0},{"$f":"IF([1]مارس!$J47>0,[1]مارس!$C47,\" \")","v":" "},45,null,0]
[{"$f":"IF(F49=[1]مارس!$J48,\"ok\",\"error\")","v":"ok"},{"$f":"F49-[1]مارس!$J48","v":0},{"$f":"IF([1]مارس!$J48>0,[1]مارس!$C48,\" \")","v":" "},46,null,0]
[{"$f":"IF(F50=[1]مارس!$J49,\"ok\",\"error\")","v":"ok"},{"$f":"F50-[1]مارس!$J49","v":0},{"$f":"IF([1]مارس!$J49>0,[1]مارس!$C49,\" \")","v":" "},47,null,0]
[{"$f":"IF(F51=[1]مارس!$J50,\"ok\",\"error\")","v":"ok"},{"$f":"F51-[1]مارس!$J50","v":0},{"$f":"IF([1]مارس!$J50>0,[1]مارس!$C50,\" \")","v":" "},48,null,0]
[{"$f":"IF(F52=[1]مارس!$J51,\"ok\",\"error\")","v":"ok"},{"$f":"F52-[1]مارس!$J51","v":0},{"$f":"IF([1]مارس!$J51>0,[1]مارس!$C51,\" \")","v":" "},49,null,0]
[{"$f":"IF(F53=[1]مارس!$J52,\"ok\",\"error\")","v":"ok"},{"$f":"F53-[1]مارس!$J52","v":0},{"$f":"IF([1]مارس!$J52>0,[1]مارس!$C52,\" \")","v":" "},50,null,0]
[{"$f":"IF(F54=[1]مارس!$J53,\"ok\",\"error\")","v":"ok"},{"$f":"F54-[1]مارس!$J53","v":0},{"$f":"IF([1]مارس!$J53>0,[1]مارس!$C53,\" \")","v":" "},51,null,0]
[{"$f":"IF(F55=[1]مارس!$J54,\"ok\",\"error\")","v":"ok"},{"$f":"F55-[1]مارس!$J54","v":0},{"$f":"IF([1]مارس!$J54>0,[1]مارس!$C54,\" \")","v":" "},52,null,0]
[{"$f":"IF(F56=[1]مارس!$J55,\"ok\",\"error\")","v":"ok"},{"$f":"F56-[1]مارس!$J55","v":0},{"$f":"IF([1]مارس!$J55>0,[1]مارس!$C55,\" \")","v":" "},53,null,0]
[{"$f":"IF(F57=[1]مارس!$J56,\"ok\",\"error\")","v":"ok"},{"$f":"F57-[1]مارس!$J56","v":0},{"$f":"IF([1]مارس!$J56>0,[1]مارس!$C56,\" \")","v":" "},54,null,0]
[{"$f":"IF(F58=[1]مارس!$J57,\"ok\",\"error\")","v":"ok"},{"$f":"F58-[1]مارس!$J57","v":0},{"$f":"IF([1]مارس!$J57>0,[1]مارس!$C57,\" \")","v":" "},55,null,0]
[{"$f":"IF(F59=[1]مارس!$J58,\"ok\",\"error\")","v":"ok"},{"$f":"F59-[1]مارس!$J58","v":0},{"$f":"IF([1]مارس!$J58>0,[1]مارس!$C58,\" \")","v":" "},56,null,0]
[{"$f":"IF(F60=[1]مارس!$J59,\"ok\",\"error\")","v":"ok"},{"$f":"F60-[1]مارس!$J59","v":0},{"$f":"IF([1]مارس!$J59>0,[1]مارس!$C59,\" \")","v":" "},57,null,0]
[{"$f":"IF(F61=[1]مارس!$J60,\"ok\",\"error\")","v":"ok"},{"$f":"F61-[1]مارس!$J60","v":0},{"$f":"IF([1]مارس!$J60>0,[1]مارس!$C60,\" \")","v":" "},58,null,0]
[{"$f":"IF(F62=[1]مارس!$J61,\"ok\",\"error\")","v":"ok"},{"$f":"F62-[1]مارس!$J61","v":0},{"$f":"IF([1]مارس!$J61>0,[1]مارس!$C61,\" \")","v":" "},59,null,0]
[{"$f":"IF(F63=[1]مارس!$J62,\"ok\",\"error\")","v":"ok"},{"$f":"F63-[1]مارس!$J62","v":0},{"$f":"IF([1]مارس!$J62>0,[1]مارس!$C62,\" \")","v":" "},60,null,0]
[{"$f":"IF(F64=[1]مارس!$J63,\"ok\",\"error\")","v":"ok"},{"$f":"F64-[1]مارس!$J63","v":0},{"$f":"IF([1]مارس!$J63>0,[1]مارس!$C63,\" \")","v":" "},61,null,0]
[{"$f":"IF(F65=[1]مارس!$J64,\"ok\",\"error\")","v":"ok"},{"$f":"F65-[1]مارس!$J64","v":0},{"$f":"IF([1]مارس!$J64>0,[1]مارس!$C64,\" \")","v":" "},62,null,0]
[{"$f":"IF(F66=[1]مارس!$J65,\"ok\",\"error\")","v":"ok"},{"$f":"F66-[1]مارس!$J65","v":0},{"$f":"IF([1]مارس!$J65>0,[1]مارس!$C65,\" \")","v":" "},63,null,0]
[{"$f":"IF(F67=[1]مارس!$J66,\"ok\",\"error\")","v":"ok"},{"$f":"F67-[1]مارس!$J66","v":0},{"$f":"IF([1]مارس!$J66>0,[1]مارس!$C66,\" \")","v":" "},64,null,0]
[{"$f":"IF(F68=[1]مارس!$J67,\"ok\",\"error\")","v":"ok"},{"$f":"F68-[1]مارس!$J67","v":0},{"$f":"IF([1]مارس!$J67>0,[1]مارس!$C67,\" \")","v":" "},65,null,{"$f":"SUM(G68:AX68)","v":0}]
[{"$f":"IF(F69=[1]مارس!$J68,\"ok\",\"error\")","v":"ok"},{"$f":"F69-[1]مارس!$J68","v":0},{"$f":"IF([1]مارس!$J68>0,[1]مارس!$C68,\" \")","v":" "},66,null,0]
[{"$f":"IF(F70=[1]مارس!$J69,\"ok\",\"error\")","v":"ok"},{"$f":"F70-[1]مارس!$J69","v":0},{"$f":"IF([1]مارس!$J69>0,[1]مارس!$C69,\" \")","v":" "},67,null,0]
[{"$f":"IF(F71=[1]مارس!$J70,\"ok\",\"error\")","v":"ok"},{"$f":"F71-[1]مارس!$J70","v":0},{"$f":"IF([1]مارس!$J70>0,[1]مارس!$C70,\" \")","v":" "},68,null,0]
[{"$f":"IF(F72=[1]مارس!$J71,\"ok\",\"error\")","v":"ok"},{"$f":"F72-[1]مارس!$J71","v":0},{"$f":"IF([1]مارس!$J71>0,[1]مارس!$C71,\" \")","v":" "},69,null,0]
[{"$f":"IF(F73=[1]مارس!$J72,\"ok\",\"error\")","v":"ok"},{"$f":"F73-[1]مارس!$J72","v":0},{"$f":"IF([1]مارس!$J72>0,[1]مارس!$C72,\" \")","v":" "},70,null,0]
[{"$f":"IF(F74=[1]مارس!$J73,\"ok\",\"error\")","v":"ok"},{"$f":"F74-[1]مارس!$J73","v":0},{"$f":"IF([1]مارس!$J73>0,[1]مارس!$C73,\" \")","v":" "},71,null,0]
[{"$f":"IF(F75=[1]مارس!$J74,\"ok\",\"error\")","v":"ok"},{"$f":"F75-[1]مارس!$J74","v":0},{"$f":"IF([1]مارس!$J74>0,[1]مارس!$C74,\" \")","v":" "},72,null,0]
[{"$f":"IF(F76=[1]مارس!$J75,\"ok\",\"error\")","v":"ok"},{"$f":"F76-[1]مارس!$J75","v":0},{"$f":"IF([1]مارس!$J75>0,[1]مارس!$C75,\" \")","v":" "},73,null,0]
[{"$f":"IF(F77=[1]مارس!$J76,\"ok\",\"error\")","v":"ok"},{"$f":"F77-[1]مارس!$J76","v":0},{"$f":"IF([1]مارس!$J76>0,[1]مارس!$C76,\" \")","v":" "},74,null,0]
[{"$f":"IF(F78=[1]مارس!$J77,\"ok\",\"error\")","v":"ok"},{"$f":"F78-[1]مارس!$J77","v":0},{"$f":"IF([1]مارس!$J77>0,[1]مارس!$C77,\" \")","v":" "},75,null,0]
[{"$f":"IF(F79=[1]مارس!$J78,\"ok\",\"error\")","v":"ok"},{"$f":"F79-[1]مارس!$J78","v":0},{"$f":"IF([1]مارس!$J78>0,[1]مارس!$C78,\" \")","v":" "},76,null,0]
[{"$f":"IF(F80=[1]مارس!$J79,\"ok\",\"error\")","v":"ok"},{"$f":"F80-[1]مارس!$J79","v":0},{"$f":"IF([1]مارس!$J79>0,[1]مارس!$C79,\" \")","v":" "},77,null,0]
[{"$f":"IF(F81=[1]مارس!$J80,\"ok\",\"error\")","v":"ok"},{"$f":"F81-[1]مارس!$J80","v":0},{"$f":"IF([1]مارس!$J80>0,[1]مارس!$C80,\" \")","v":" "},78,null,0]
[{"$f":"IF(F82=[1]مارس!$J81,\"ok\",\"error\")","v":"ok"},{"$f":"F82-[1]مارس!$J81","v":0},{"$f":"IF([1]مارس!$J81>0,[1]مارس!$C81,\" \")","v":" "},79,null,0]
[{"$f":"IF(F83=[1]مارس!$J82,\"ok\",\"error\")","v":"ok"},{"$f":"F83-[1]مارس!$J82","v":0},{"$f":"IF([1]مارس!$J82>0,[1]مارس!$C82,\" \")","v":" "},80,null,0]
[{"$f":"IF(F84=[1]مارس!$J83,\"ok\",\"error\")","v":"ok"},{"$f":"F84-[1]مارس!$J83","v":0},{"$f":"IF([1]مارس!$J83>0,[1]مارس!$C83,\" \")","v":" "},81,null,0]
[{"$f":"IF(F85=[1]مارس!$J84,\"ok\",\"error\")","v":"ok"},{"$f":"F85-[1]مارس!$J84","v":0},{"$f":"IF([1]مارس!$J84>0,[1]مارس!$C84,\" \")","v":" "},82,null,0]
[{"$f":"IF(F86=[1]مارس!$J85,\"ok\",\"error\")","v":"ok"},{"$f":"F86-[1]مارس!$J85","v":0},{"$f":"IF([1]مارس!$J85>0,[1]مارس!$C85,\" \")","v":" "},83,null,0]
[{"$f":"IF(F87=[1]مارس!$J86,\"ok\",\"error\")","v":"ok"},{"$f":"F87-[1]مارس!$J86","v":0},{"$f":"IF([1]مارس!$J86>0,[1]مارس!$C86,\" \")","v":" "},84,null,0]
[{"$f":"IF(F88=[1]مارس!$J87,\"ok\",\"error\")","v":"ok"},{"$f":"F88-[1]مارس!$J87","v":0},{"$f":"IF([1]مارس!$J87>0,[1]مارس!$C87,\" \")","v":" "},85,null,0]
[{"$f":"IF(F89=[1]مارس!$J88,\"ok\",\"error\")","v":"ok"},{"$f":"F89-[1]مارس!$J88","v":0},{"$f":"IF([1]مارس!$J88>0,[1]مارس!$C88,\" \")","v":" "},86,null,0]
[{"$f":"IF(F90=[1]مارس!$J89,\"ok\",\"error\")","v":"ok"},{"$f":"F90-[1]مارس!$J89","v":0},{"$f":"IF([1]مارس!$J89>0,[1]مارس!$C89,\" \")","v":" "},87,null,0]
[{"$f":"IF(F91=[1]مارس!$J90,\"ok\",\"error\")","v":"ok"},{"$f":"F91-[1]مارس!$J90","v":0},{"$f":"IF([1]مارس!$J90>0,[1]مارس!$C90,\" \")","v":" "},88,null,0]
[{"$f":"IF(F92=[1]مارس!$J91,\"ok\",\"error\")","v":"ok"},{"$f":"F92-[1]مارس!$J91","v":0},{"$f":"IF([1]مارس!$J91>0,[1]مارس!$C91,\" \")","v":" "},89,null,0]
[{"$f":"IF(F93=[1]مارس!$J92,\"ok\",\"error\")","v":"ok"},{"$f":"F93-[1]مارس!$J92","v":0},{"$f":"IF([1]مارس!$J92>0,[1]مارس!$C92,\" \")","v":" "},90,null,0]
[{"$f":"IF(F94=[1]مارس!$J93,\"ok\",\"error\")","v":"ok"},{"$f":"F94-[1]مارس!$J93","v":0},{"$f":"IF([1]مارس!$J93>0,[1]مارس!$C93,\" \")","v":" "},91,null,0]
[{"$f":"IF(F95=[1]مارس!$J94,\"ok\",\"error\")","v":"ok"},{"$f":"F95-[1]مارس!$J94","v":0},{"$f":"IF([1]مارس!$J94>0,[1]مارس!$C94,\" \")","v":" "},92,null,0]
[{"$f":"IF(F96=[1]مارس!$J95,\"ok\",\"error\")","v":"ok"},{"$f":"F96-[1]مارس!$J95","v":0},{"$f":"IF([1]مارس!$J95>0,[1]مارس!$C95,\" \")","v":" "},93,null,0]
[{"$f":"IF(F97=[1]مارس!$J96,\"ok\",\"error\")","v":"ok"},{"$f":"F97-[1]مارس!$J96","v":0},{"$f":"IF([1]مارس!$J96>0,[1]مارس!$C96,\" \")","v":" "},94,null,0]
[{"$f":"IF(F98=[1]مارس!$J97,\"ok\",\"error\")","v":"ok"},{"$f":"F98-[1]مارس!$J97","v":0},{"$f":"IF([1]مارس!$J97>0,[1]مارس!$C97,\" \")","v":" "},95,null,0]
[{"$f":"IF(F99=[1]مارس!$J98,\"ok\",\"error\")","v":"ok"},{"$f":"F99-[1]مارس!$J98","v":0},{"$f":"IF([1]مارس!$J98>0,[1]مارس!$C98,\" \")","v":" "},96,null,0]
[{"$f":"IF(F100=[1]مارس!$J99,\"ok\",\"error\")","v":"ok"},{"$f":"F100-[1]مارس!$J99","v":0},{"$f":"IF([1]مارس!$J99>0,[1]مارس!$C99,\" \")","v":" "},97,null,{"$f":"SUM(G100:AX100)","v":0}]
[{"$f":"IF(F101=[1]مارس!$J100,\"ok\",\"error\")","v":"ok"},{"$f":"F101-[1]مارس!$J100","v":0},{"$f":"IF([1]مارس!$J100>0,[1]مارس!$C100,\" \")","v":" "},98,null,{"$f":"SUM(G101:AX101)","v":0}]
[{"$f":"IF(F102=[1]مارس!$J101,\"ok\",\"error\")","v":"ok"},{"$f":"F102-[1]مارس!$J101","v":0},{"$f":"IF([1]مارس!$J101>0,[1]مارس!$C101,\" \")","v":" "},99,null,{"$f":"SUM(G102:AX102)","v":0}]
[{"$f":"IF(F103=[1]مارس!$J102,\"ok\",\"error\")","v":"ok"},{"$f":"F103-[1]مارس!$J102","v":0},{"$f":"IF([1]مارس!$J102>0,[1]مارس!$C102,\" \")","v":" "},100,null,{"$f":"SUM(G103:AX103)","v":0}]
[{"$f":"IF(F104=[1]مارس!$J103,\"ok\",\"error\")","v":"ok"},{"$f":"F104-[1]مارس!$J103","v":0},"الإجمالى",null,null,{"$f":"SUM(F4:F103)","v":0},0,0,0,0,0,0,0,0,0,0,0,0,0,0,0,0,0,0,0,0,0,0,0,0,0,0,0,0,0]
[]
[null,null,null,null,"؟",{"$f":"F104-[1]مارس!$J$103","v":0}]

{"sheet":"ابريل","index":3,"n_rows":106,"n_cols":35,"rows_kept":106,"cut":false,"hidden":false,"merged":[[1,38,2,38],[1,39,2,39],[1,10,2,10],[1,8,2,8],[1,34,2,34],[1,35,2,35],[1,36,2,36],[1,37,2,37],[1,30,2,30],[1,31,2,31],[1,32,2,32],[1,33,2,33],[1,26,2,26],[1,27,2,27],[1,28,2,28],[1,29,2,29],[1,22,2,22],[1,23,2,23],[1,24,2,24],[1,25,2,25],[1,18,2,18],[1,19,2,19],[1,20,2,20],[1,21,2,21],[1,15,2,15],[1,16,2,16],[1,17,2,17],[1,9,2,9],[1,11,2,11],[1,12,2,12],[1,13,2,13],[103,2,103,4],[1,2,2,2],[1,3,2,3],[1,4,2,4],[1,14,2,14],[0,2,0,14],[1,0,2,1],[1,5,2,5],[1,6,2,6],[1,7,2,7]]}
[null,null,"تحليـــــــــــــــــل مصـــــــــــــــروفات التشغيـــــــــــــــل عن شهـــــــــر ابــــــــريـــــــــــل لعام 201"]
["OR",null,"التاريخ","رقم القيد","البيان","الإجمالى",{"$f":"مارس!G2","v":"صيانة\nواصلاح\nوقطع غيار"},{"$f":"مارس!H2","v":"خامات تشغيل"},{"$f":"مارس!I2","v":"م سيارات"},{"$f":"مارس!J2","v":"كهرباء"},{"$f":"مارس!K2","v":"م نظافة"},{"$f":"مارس!L2","v":"مياه"},{"$f":"مارس!M2","v":"تأمينات"},{"$f":"مارس!N2","v":"أجور"},{"$f":"مارس!O2","v":0},{"$f":"مارس!P2","v":0},{"$f":"مارس!Q2","v":0},{"$f":"مارس!R2","v":0},{"$f":"مارس!S2","v":0},{"$f":"مارس!T2","v":0},{"$f":"مارس!U2","v":0},{"$f":"مارس!V2","v":0},{"$f":"مارس!W2","v":0},{"$f":"مارس!X2","v":0},{"$f":"مارس!Y2","v":0},{"$f":"مارس!Z2","v":0},{"$f":"مارس!AA2","v":0},{"$f":"مارس!AB2","v":0},{"$f":"مارس!AC2","v":0},{"$f":"مارس!AD2","v":0}]
[]
[{"$f":"IF(F4=[1]ابريل!$J3,\"ok\",\"error\")","v":"ok"},{"$f":"F4-[1]ابريل!$J3","v":0},{"$f":"IF([1]ابريل!$J3>0,[1]ابريل!$C3,\" \")","v":" "},1,null,{"$f":"SUM(G4:AX4)","v":0}]
[{"$f":"IF(F5=[1]ابريل!$J4,\"ok\",\"error\")","v":"ok"},{"$f":"F5-[1]ابريل!$J4","v":0},{"$f":"IF([1]ابريل!$J4>0,[1]ابريل!$C4,\" \")","v":" "},2,null,0]
[{"$f":"IF(F6=[1]ابريل!$J5,\"ok\",\"error\")","v":"ok"},{"$f":"F6-[1]ابريل!$J5","v":0},{"$f":"IF([1]ابريل!$J5>0,[1]ابريل!$C5,\" \")","v":" "},3,null,0]
[{"$f":"IF(F7=[1]ابريل!$J6,\"ok\",\"error\")","v":"ok"},{"$f":"F7-[1]ابريل!$J6","v":0},{"$f":"IF([1]ابريل!$J6>0,[1]ابريل!$C6,\" \")","v":" "},4,null,0]
[{"$f":"IF(F8=[1]ابريل!$J7,\"ok\",\"error\")","v":"ok"},{"$f":"F8-[1]ابريل!$J7","v":0},{"$f":"IF([1]ابريل!$J7>0,[1]ابريل!$C7,\" \")","v":" "},5,null,0]
[{"$f":"IF(F9=[1]ابريل!$J8,\"ok\",\"error\")","v":"ok"},{"$f":"F9-[1]ابريل!$J8","v":0},{"$f":"IF([1]ابريل!$J8>0,[1]ابريل!$C8,\" \")","v":" "},6,null,0]
[{"$f":"IF(F10=[1]ابريل!$J9,\"ok\",\"error\")","v":"ok"},{"$f":"F10-[1]ابريل!$J9","v":0},{"$f":"IF([1]ابريل!$J9>0,[1]ابريل!$C9,\" \")","v":" "},7,null,0]
[{"$f":"IF(F11=[1]ابريل!$J10,\"ok\",\"error\")","v":"ok"},{"$f":"F11-[1]ابريل!$J10","v":0},{"$f":"IF([1]ابريل!$J10>0,[1]ابريل!$C10,\" \")","v":" "},8,null,0]
[{"$f":"IF(F12=[1]ابريل!$J11,\"ok\",\"error\")","v":"ok"},{"$f":"F12-[1]ابريل!$J11","v":0},{"$f":"IF([1]ابريل!$J11>0,[1]ابريل!$C11,\" \")","v":" "},9,null,0]
[{"$f":"IF(F13=[1]ابريل!$J12,\"ok\",\"error\")","v":"ok"},{"$f":"F13-[1]ابريل!$J12","v":0},{"$f":"IF([1]ابريل!$J12>0,[1]ابريل!$C12,\" \")","v":" "},10,null,0]
[{"$f":"IF(F14=[1]ابريل!$J13,\"ok\",\"error\")","v":"ok"},{"$f":"F14-[1]ابريل!$J13","v":0},{"$f":"IF([1]ابريل!$J13>0,[1]ابريل!$C13,\" \")","v":" "},11,null,0]
[{"$f":"IF(F15=[1]ابريل!$J14,\"ok\",\"error\")","v":"ok"},{"$f":"F15-[1]ابريل!$J14","v":0},{"$f":"IF([1]ابريل!$J14>0,[1]ابريل!$C14,\" \")","v":" "},12,null,0]
[{"$f":"IF(F16=[1]ابريل!$J15,\"ok\",\"error\")","v":"ok"},{"$f":"F16-[1]ابريل!$J15","v":0},{"$f":"IF([1]ابريل!$J15>0,[1]ابريل!$C15,\" \")","v":" "},13,null,0]
[{"$f":"IF(F17=[1]ابريل!$J16,\"ok\",\"error\")","v":"ok"},{"$f":"F17-[1]ابريل!$J16","v":0},{"$f":"IF([1]ابريل!$J16>0,[1]ابريل!$C16,\" \")","v":" "},14,null,0]
[{"$f":"IF(F18=[1]ابريل!$J17,\"ok\",\"error\")","v":"ok"},{"$f":"F18-[1]ابريل!$J17","v":0},{"$f":"IF([1]ابريل!$J17>0,[1]ابريل!$C17,\" \")","v":" "},15,null,0]
[{"$f":"IF(F19=[1]ابريل!$J18,\"ok\",\"error\")","v":"ok"},{"$f":"F19-[1]ابريل!$J18","v":0},{"$f":"IF([1]ابريل!$J18>0,[1]ابريل!$C18,\" \")","v":" "},16,null,0]
[{"$f":"IF(F20=[1]ابريل!$J19,\"ok\",\"error\")","v":"ok"},{"$f":"F20-[1]ابريل!$J19","v":0},{"$f":"IF([1]ابريل!$J19>0,[1]ابريل!$C19,\" \")","v":" "},17,null,0]
[{"$f":"IF(F21=[1]ابريل!$J20,\"ok\",\"error\")","v":"ok"},{"$f":"F21-[1]ابريل!$J20","v":0},{"$f":"IF([1]ابريل!$J20>0,[1]ابريل!$C20,\" \")","v":" "},18,null,0]
[{"$f":"IF(F22=[1]ابريل!$J21,\"ok\",\"error\")","v":"ok"},{"$f":"F22-[1]ابريل!$J21","v":0},{"$f":"IF([1]ابريل!$J21>0,[1]ابريل!$C21,\" \")","v":" "},19,null,0]
[{"$f":"IF(F23=[1]ابريل!$J22,\"ok\",\"error\")","v":"ok"},{"$f":"F23-[1]ابريل!$J22","v":0},{"$f":"IF([1]ابريل!$J22>0,[1]ابريل!$C22,\" \")","v":" "},20,null,0]
[{"$f":"IF(F24=[1]ابريل!$J23,\"ok\",\"error\")","v":"ok"},{"$f":"F24-[1]ابريل!$J23","v":0},{"$f":"IF([1]ابريل!$J23>0,[1]ابريل!$C23,\" \")","v":" "},21,null,0]
[{"$f":"IF(F25=[1]ابريل!$J24,\"ok\",\"error\")","v":"ok"},{"$f":"F25-[1]ابريل!$J24","v":0},{"$f":"IF([1]ابريل!$J24>0,[1]ابريل!$C24,\" \")","v":" "},22,null,0]
[{"$f":"IF(F26=[1]ابريل!$J25,\"ok\",\"error\")","v":"ok"},{"$f":"F26-[1]ابريل!$J25","v":0},{"$f":"IF([1]ابريل!$J25>0,[1]ابريل!$C25,\" \")","v":" "},23,null,0]
[{"$f":"IF(F27=[1]ابريل!$J26,\"ok\",\"error\")","v":"ok"},{"$f":"F27-[1]ابريل!$J26","v":0},{"$f":"IF([1]ابريل!$J26>0,[1]ابريل!$C26,\" \")","v":" "},24,null,0]
[{"$f":"IF(F28=[1]ابريل!$J27,\"ok\",\"error\")","v":"ok"},{"$f":"F28-[1]ابريل!$J27","v":0},{"$f":"IF([1]ابريل!$J27>0,[1]ابريل!$C27,\" \")","v":" "},25,null,0]
[{"$f":"IF(F29=[1]ابريل!$J28,\"ok\",\"error\")","v":"ok"},{"$f":"F29-[1]ابريل!$J28","v":0},{"$f":"IF([1]ابريل!$J28>0,[1]ابريل!$C28,\" \")","v":" "},26,null,0]
[{"$f":"IF(F30=[1]ابريل!$J29,\"ok\",\"error\")","v":"ok"},{"$f":"F30-[1]ابريل!$J29","v":0},{"$f":"IF([1]ابريل!$J29>0,[1]ابريل!$C29,\" \")","v":" "},27,null,0]
[{"$f":"IF(F31=[1]ابريل!$J30,\"ok\",\"error\")","v":"ok"},{"$f":"F31-[1]ابريل!$J30","v":0},{"$f":"IF([1]ابريل!$J30>0,[1]ابريل!$C30,\" \")","v":" "},28,null,0]
[{"$f":"IF(F32=[1]ابريل!$J31,\"ok\",\"error\")","v":"ok"},{"$f":"F32-[1]ابريل!$J31","v":0},{"$f":"IF([1]ابريل!$J31>0,[1]ابريل!$C31,\" \")","v":" "},29,null,0]
[{"$f":"IF(F33=[1]ابريل!$J32,\"ok\",\"error\")","v":"ok"},{"$f":"F33-[1]ابريل!$J32","v":0},{"$f":"IF([1]ابريل!$J32>0,[1]ابريل!$C32,\" \")","v":" "},30,null,0]
[{"$f":"IF(F34=[1]ابريل!$J33,\"ok\",\"error\")","v":"ok"},{"$f":"F34-[1]ابريل!$J33","v":0},{"$f":"IF([1]ابريل!$J33>0,[1]ابريل!$C33,\" \")","v":" "},31,null,0]
[{"$f":"IF(F35=[1]ابريل!$J34,\"ok\",\"error\")","v":"ok"},{"$f":"F35-[1]ابريل!$J34","v":0},{"$f":"IF([1]ابريل!$J34>0,[1]ابريل!$C34,\" \")","v":" "},32,null,0]
[{"$f":"IF(F36=[1]ابريل!$J35,\"ok\",\"error\")","v":"ok"},{"$f":"F36-[1]ابريل!$J35","v":0},{"$f":"IF([1]ابريل!$J35>0,[1]ابريل!$C35,\" \")","v":" "},33,null,{"$f":"SUM(G36:AX36)","v":0}]
[{"$f":"IF(F37=[1]ابريل!$J36,\"ok\",\"error\")","v":"ok"},{"$f":"F37-[1]ابريل!$J36","v":0},{"$f":"IF([1]ابريل!$J36>0,[1]ابريل!$C36,\" \")","v":" "},34,null,0]
[{"$f":"IF(F38=[1]ابريل!$J37,\"ok\",\"error\")","v":"ok"},{"$f":"F38-[1]ابريل!$J37","v":0},{"$f":"IF([1]ابريل!$J37>0,[1]ابريل!$C37,\" \")","v":" "},35,null,0]
[{"$f":"IF(F39=[1]ابريل!$J38,\"ok\",\"error\")","v":"ok"},{"$f":"F39-[1]ابريل!$J38","v":0},{"$f":"IF([1]ابريل!$J38>0,[1]ابريل!$C38,\" \")","v":" "},36,null,0]
[{"$f":"IF(F40=[1]ابريل!$J39,\"ok\",\"error\")","v":"ok"},{"$f":"F40-[1]ابريل!$J39","v":0},{"$f":"IF([1]ابريل!$J39>0,[1]ابريل!$C39,\" \")","v":" "},37,null,0]
[{"$f":"IF(F41=[1]ابريل!$J40,\"ok\",\"error\")","v":"ok"},{"$f":"F41-[1]ابريل!$J40","v":0},{"$f":"IF([1]ابريل!$J40>0,[1]ابريل!$C40,\" \")","v":" "},38,null,0]
[{"$f":"IF(F42=[1]ابريل!$J41,\"ok\",\"error\")","v":"ok"},{"$f":"F42-[1]ابريل!$J41","v":0},{"$f":"IF([1]ابريل!$J41>0,[1]ابريل!$C41,\" \")","v":" "},39,null,0]
[{"$f":"IF(F43=[1]ابريل!$J42,\"ok\",\"error\")","v":"ok"},{"$f":"F43-[1]ابريل!$J42","v":0},{"$f":"IF([1]ابريل!$J42>0,[1]ابريل!$C42,\" \")","v":" "},40,null,0]
[{"$f":"IF(F44=[1]ابريل!$J43,\"ok\",\"error\")","v":"ok"},{"$f":"F44-[1]ابريل!$J43","v":0},{"$f":"IF([1]ابريل!$J43>0,[1]ابريل!$C43,\" \")","v":" "},41,null,0]
[{"$f":"IF(F45=[1]ابريل!$J44,\"ok\",\"error\")","v":"ok"},{"$f":"F45-[1]ابريل!$J44","v":0},{"$f":"IF([1]ابريل!$J44>0,[1]ابريل!$C44,\" \")","v":" "},42,null,0]
[{"$f":"IF(F46=[1]ابريل!$J45,\"ok\",\"error\")","v":"ok"},{"$f":"F46-[1]ابريل!$J45","v":0},{"$f":"IF([1]ابريل!$J45>0,[1]ابريل!$C45,\" \")","v":" "},43,null,0]
[{"$f":"IF(F47=[1]ابريل!$J46,\"ok\",\"error\")","v":"ok"},{"$f":"F47-[1]ابريل!$J46","v":0},{"$f":"IF([1]ابريل!$J46>0,[1]ابريل!$C46,\" \")","v":" "},44,null,0]
[{"$f":"IF(F48=[1]ابريل!$J47,\"ok\",\"error\")","v":"ok"},{"$f":"F48-[1]ابريل!$J47","v":0},{"$f":"IF([1]ابريل!$J47>0,[1]ابريل!$C47,\" \")","v":" "},45,null,0]
[{"$f":"IF(F49=[1]ابريل!$J48,\"ok\",\"error\")","v":"ok"},{"$f":"F49-[1]ابريل!$J48","v":0},{"$f":"IF([1]ابريل!$J48>0,[1]ابريل!$C48,\" \")","v":" "},46,null,0]
[{"$f":"IF(F50=[1]ابريل!$J49,\"ok\",\"error\")","v":"ok"},{"$f":"F50-[1]ابريل!$J49","v":0},{"$f":"IF([1]ابريل!$J49>0,[1]ابريل!$C49,\" \")","v":" "},47,null,0]
[{"$f":"IF(F51=[1]ابريل!$J50,\"ok\",\"error\")","v":"ok"},{"$f":"F51-[1]ابريل!$J50","v":0},{"$f":"IF([1]ابريل!$J50>0,[1]ابريل!$C50,\" \")","v":" "},48,null,0]
[{"$f":"IF(F52=[1]ابريل!$J51,\"ok\",\"error\")","v":"ok"},{"$f":"F52-[1]ابريل!$J51","v":0},{"$f":"IF([1]ابريل!$J51>0,[1]ابريل!$C51,\" \")","v":" "},49,null,0]
[{"$f":"IF(F53=[1]ابريل!$J52,\"ok\",\"error\")","v":"ok"},{"$f":"F53-[1]ابريل!$J52","v":0},{"$f":"IF([1]ابريل!$J52>0,[1]ابريل!$C52,\" \")","v":" "},50,null,0]
[{"$f":"IF(F54=[1]ابريل!$J53,\"ok\",\"error\")","v":"ok"},{"$f":"F54-[1]ابريل!$J53","v":0},{"$f":"IF([1]ابريل!$J53>0,[1]ابريل!$C53,\" \")","v":" "},51,null,0]
[{"$f":"IF(F55=[1]ابريل!$J54,\"ok\",\"error\")","v":"ok"},{"$f":"F55-[1]ابريل!$J54","v":0},{"$f":"IF([1]ابريل!$J54>0,[1]ابريل!$C54,\" \")","v":" "},52,null,0]
[{"$f":"IF(F56=[1]ابريل!$J55,\"ok\",\"error\")","v":"ok"},{"$f":"F56-[1]ابريل!$J55","v":0},{"$f":"IF([1]ابريل!$J55>0,[1]ابريل!$C55,\" \")","v":" "},53,null,0]
[{"$f":"IF(F57=[1]ابريل!$J56,\"ok\",\"error\")","v":"ok"},{"$f":"F57-[1]ابريل!$J56","v":0},{"$f":"IF([1]ابريل!$J56>0,[1]ابريل!$C56,\" \")","v":" "},54,null,0]
[{"$f":"IF(F58=[1]ابريل!$J57,\"ok\",\"error\")","v":"ok"},{"$f":"F58-[1]ابريل!$J57","v":0},{"$f":"IF([1]ابريل!$J57>0,[1]ابريل!$C57,\" \")","v":" "},55,null,0]
[{"$f":"IF(F59=[1]ابريل!$J58,\"ok\",\"error\")","v":"ok"},{"$f":"F59-[1]ابريل!$J58","v":0},{"$f":"IF([1]ابريل!$J58>0,[1]ابريل!$C58,\" \")","v":" "},56,null,0]
[{"$f":"IF(F60=[1]ابريل!$J59,\"ok\",\"error\")","v":"ok"},{"$f":"F60-[1]ابريل!$J59","v":0},{"$f":"IF([1]ابريل!$J59>0,[1]ابريل!$C59,\" \")","v":" "},57,null,0]
[{"$f":"IF(F61=[1]ابريل!$J60,\"ok\",\"error\")","v":"ok"},{"$f":"F61-[1]ابريل!$J60","v":0},{"$f":"IF([1]ابريل!$J60>0,[1]ابريل!$C60,\" \")","v":" "},58,null,0]
[{"$f":"IF(F62=[1]ابريل!$J61,\"ok\",\"error\")","v":"ok"},{"$f":"F62-[1]ابريل!$J61","v":0},{"$f":"IF([1]ابريل!$J61>0,[1]ابريل!$C61,\" \")","v":" "},59,null,0]
[{"$f":"IF(F63=[1]ابريل!$J62,\"ok\",\"error\")","v":"ok"},{"$f":"F63-[1]ابريل!$J62","v":0},{"$f":"IF([1]ابريل!$J62>0,[1]ابريل!$C62,\" \")","v":" "},60,null,0]
[{"$f":"IF(F64=[1]ابريل!$J63,\"ok\",\"error\")","v":"ok"},{"$f":"F64-[1]ابريل!$J63","v":0},{"$f":"IF([1]ابريل!$J63>0,[1]ابريل!$C63,\" \")","v":" "},61,null,0]
[{"$f":"IF(F65=[1]ابريل!$J64,\"ok\",\"error\")","v":"ok"},{"$f":"F65-[1]ابريل!$J64","v":0},{"$f":"IF([1]ابريل!$J64>0,[1]ابريل!$C64,\" \")","v":" "},62,null,0]
[{"$f":"IF(F66=[1]ابريل!$J65,\"ok\",\"error\")","v":"ok"},{"$f":"F66-[1]ابريل!$J65","v":0},{"$f":"IF([1]ابريل!$J65>0,[1]ابريل!$C65,\" \")","v":" "},63,null,0]
[{"$f":"IF(F67=[1]ابريل!$J66,\"ok\",\"error\")","v":"ok"},{"$f":"F67-[1]ابريل!$J66","v":0},{"$f":"IF([1]ابريل!$J66>0,[1]ابريل!$C66,\" \")","v":" "},64,null,0]
[{"$f":"IF(F68=[1]ابريل!$J67,\"ok\",\"error\")","v":"ok"},{"$f":"F68-[1]ابريل!$J67","v":0},{"$f":"IF([1]ابريل!$J67>0,[1]ابريل!$C67,\" \")","v":" "},65,null,{"$f":"SUM(G68:AX68)","v":0}]
[{"$f":"IF(F69=[1]ابريل!$J68,\"ok\",\"error\")","v":"ok"},{"$f":"F69-[1]ابريل!$J68","v":0},{"$f":"IF([1]ابريل!$J68>0,[1]ابريل!$C68,\" \")","v":" "},66,null,0]
[{"$f":"IF(F70=[1]ابريل!$J69,\"ok\",\"error\")","v":"ok"},{"$f":"F70-[1]ابريل!$J69","v":0},{"$f":"IF([1]ابريل!$J69>0,[1]ابريل!$C69,\" \")","v":" "},67,null,0]
[{"$f":"IF(F71=[1]ابريل!$J70,\"ok\",\"error\")","v":"ok"},{"$f":"F71-[1]ابريل!$J70","v":0},{"$f":"IF([1]ابريل!$J70>0,[1]ابريل!$C70,\" \")","v":" "},68,null,0]
[{"$f":"IF(F72=[1]ابريل!$J71,\"ok\",\"error\")","v":"ok"},{"$f":"F72-[1]ابريل!$J71","v":0},{"$f":"IF([1]ابريل!$J71>0,[1]ابريل!$C71,\" \")","v":" "},69,null,0]
[{"$f":"IF(F73=[1]ابريل!$J72,\"ok\",\"error\")","v":"ok"},{"$f":"F73-[1]ابريل!$J72","v":0},{"$f":"IF([1]ابريل!$J72>0,[1]ابريل!$C72,\" \")","v":" "},70,null,0]
[{"$f":"IF(F74=[1]ابريل!$J73,\"ok\",\"error\")","v":"ok"},{"$f":"F74-[1]ابريل!$J73","v":0},{"$f":"IF([1]ابريل!$J73>0,[1]ابريل!$C73,\" \")","v":" "},71,null,0]
[{"$f":"IF(F75=[1]ابريل!$J74,\"ok\",\"error\")","v":"ok"},{"$f":"F75-[1]ابريل!$J74","v":0},{"$f":"IF([1]ابريل!$J74>0,[1]ابريل!$C74,\" \")","v":" "},72,null,0]
[{"$f":"IF(F76=[1]ابريل!$J75,\"ok\",\"error\")","v":"ok"},{"$f":"F76-[1]ابريل!$J75","v":0},{"$f":"IF([1]ابريل!$J75>0,[1]ابريل!$C75,\" \")","v":" "},73,null,0]
[{"$f":"IF(F77=[1]ابريل!$J76,\"ok\",\"error\")","v":"ok"},{"$f":"F77-[1]ابريل!$J76","v":0},{"$f":"IF([1]ابريل!$J76>0,[1]ابريل!$C76,\" \")","v":" "},74,null,0]
[{"$f":"IF(F78=[1]ابريل!$J77,\"ok\",\"error\")","v":"ok"},{"$f":"F78-[1]ابريل!$J77","v":0},{"$f":"IF([1]ابريل!$J77>0,[1]ابريل!$C77,\" \")","v":" "},75,null,0]
[{"$f":"IF(F79=[1]ابريل!$J78,\"ok\",\"error\")","v":"ok"},{"$f":"F79-[1]ابريل!$J78","v":0},{"$f":"IF([1]ابريل!$J78>0,[1]ابريل!$C78,\" \")","v":" "},76,null,0]
[{"$f":"IF(F80=[1]ابريل!$J79,\"ok\",\"error\")","v":"ok"},{"$f":"F80-[1]ابريل!$J79","v":0},{"$f":"IF([1]ابريل!$J79>0,[1]ابريل!$C79,\" \")","v":" "},77,null,0]
[{"$f":"IF(F81=[1]ابريل!$J80,\"ok\",\"error\")","v":"ok"},{"$f":"F81-[1]ابريل!$J80","v":0},{"$f":"IF([1]ابريل!$J80>0,[1]ابريل!$C80,\" \")","v":" "},78,null,0]
[{"$f":"IF(F82=[1]ابريل!$J81,\"ok\",\"error\")","v":"ok"},{"$f":"F82-[1]ابريل!$J81","v":0},{"$f":"IF([1]ابريل!$J81>0,[1]ابريل!$C81,\" \")","v":" "},79,null,0]
[{"$f":"IF(F83=[1]ابريل!$J82,\"ok\",\"error\")","v":"ok"},{"$f":"F83-[1]ابريل!$J82","v":0},{"$f":"IF([1]ابريل!$J82>0,[1]ابريل!$C82,\" \")","v":" "},80,null,0]
[{"$f":"IF(F84=[1]ابريل!$J83,\"ok\",\"error\")","v":"ok"},{"$f":"F84-[1]ابريل!$J83","v":0},{"$f":"IF([1]ابريل!$J83>0,[1]ابريل!$C83,\" \")","v":" "},81,null,0]
[{"$f":"IF(F85=[1]ابريل!$J84,\"ok\",\"error\")","v":"ok"},{"$f":"F85-[1]ابريل!$J84","v":0},{"$f":"IF([1]ابريل!$J84>0,[1]ابريل!$C84,\" \")","v":" "},82,null,0]
[{"$f":"IF(F86=[1]ابريل!$J85,\"ok\",\"error\")","v":"ok"},{"$f":"F86-[1]ابريل!$J85","v":0},{"$f":"IF([1]ابريل!$J85>0,[1]ابريل!$C85,\" \")","v":" "},83,null,0]
[{"$f":"IF(F87=[1]ابريل!$J86,\"ok\",\"error\")","v":"ok"},{"$f":"F87-[1]ابريل!$J86","v":0},{"$f":"IF([1]ابريل!$J86>0,[1]ابريل!$C86,\" \")","v":" "},84,null,0]
[{"$f":"IF(F88=[1]ابريل!$J87,\"ok\",\"error\")","v":"ok"},{"$f":"F88-[1]ابريل!$J87","v":0},{"$f":"IF([1]ابريل!$J87>0,[1]ابريل!$C87,\" \")","v":" "},85,null,0]
[{"$f":"IF(F89=[1]ابريل!$J88,\"ok\",\"error\")","v":"ok"},{"$f":"F89-[1]ابريل!$J88","v":0},{"$f":"IF([1]ابريل!$J88>0,[1]ابريل!$C88,\" \")","v":" "},86,null,0]
[{"$f":"IF(F90=[1]ابريل!$J89,\"ok\",\"error\")","v":"ok"},{"$f":"F90-[1]ابريل!$J89","v":0},{"$f":"IF([1]ابريل!$J89>0,[1]ابريل!$C89,\" \")","v":" "},87,null,0]
[{"$f":"IF(F91=[1]ابريل!$J90,\"ok\",\"error\")","v":"ok"},{"$f":"F91-[1]ابريل!$J90","v":0},{"$f":"IF([1]ابريل!$J90>0,[1]ابريل!$C90,\" \")","v":" "},88,null,0]
[{"$f":"IF(F92=[1]ابريل!$J91,\"ok\",\"error\")","v":"ok"},{"$f":"F92-[1]ابريل!$J91","v":0},{"$f":"IF([1]ابريل!$J91>0,[1]ابريل!$C91,\" \")","v":" "},89,null,0]
[{"$f":"IF(F93=[1]ابريل!$J92,\"ok\",\"error\")","v":"ok"},{"$f":"F93-[1]ابريل!$J92","v":0},{"$f":"IF([1]ابريل!$J92>0,[1]ابريل!$C92,\" \")","v":" "},90,null,0]
[{"$f":"IF(F94=[1]ابريل!$J93,\"ok\",\"error\")","v":"ok"},{"$f":"F94-[1]ابريل!$J93","v":0},{"$f":"IF([1]ابريل!$J93>0,[1]ابريل!$C93,\" \")","v":" "},91,null,0]
[{"$f":"IF(F95=[1]ابريل!$J94,\"ok\",\"error\")","v":"ok"},{"$f":"F95-[1]ابريل!$J94","v":0},{"$f":"IF([1]ابريل!$J94>0,[1]ابريل!$C94,\" \")","v":" "},92,null,0]
[{"$f":"IF(F96=[1]ابريل!$J95,\"ok\",\"error\")","v":"ok"},{"$f":"F96-[1]ابريل!$J95","v":0},{"$f":"IF([1]ابريل!$J95>0,[1]ابريل!$C95,\" \")","v":" "},93,null,0]
[{"$f":"IF(F97=[1]ابريل!$J96,\"ok\",\"error\")","v":"ok"},{"$f":"F97-[1]ابريل!$J96","v":0},{"$f":"IF([1]ابريل!$J96>0,[1]ابريل!$C96,\" \")","v":" "},94,null,0]
[{"$f":"IF(F98=[1]ابريل!$J97,\"ok\",\"error\")","v":"ok"},{"$f":"F98-[1]ابريل!$J97","v":0},{"$f":"IF([1]ابريل!$J97>0,[1]ابريل!$C97,\" \")","v":" "},95,null,0]
[{"$f":"IF(F99=[1]ابريل!$J98,\"ok\",\"error\")","v":"ok"},{"$f":"F99-[1]ابريل!$J98","v":0},{"$f":"IF([1]ابريل!$J98>0,[1]ابريل!$C98,\" \")","v":" "},96,null,0]
[{"$f":"IF(F100=[1]ابريل!$J99,\"ok\",\"error\")","v":"ok"},{"$f":"F100-[1]ابريل!$J99","v":0},{"$f":"IF([1]ابريل!$J99>0,[1]ابريل!$C99,\" \")","v":" "},97,null,{"$f":"SUM(G100:AX100)","v":0}]
[{"$f":"IF(F101=[1]ابريل!$J100,\"ok\",\"error\")","v":"ok"},{"$f":"F101-[1]ابريل!$J100","v":0},{"$f":"IF([1]ابريل!$J100>0,[1]ابريل!$C100,\" \")","v":" "},98,null,{"$f":"SUM(G101:AX101)","v":0}]
[{"$f":"IF(F102=[1]ابريل!$J101,\"ok\",\"error\")","v":"ok"},{"$f":"F102-[1]ابريل!$J101","v":0},{"$f":"IF([1]ابريل!$J101>0,[1]ابريل!$C101,\" \")","v":" "},99,null,{"$f":"SUM(G102:AX102)","v":0}]
[{"$f":"IF(F103=[1]ابريل!$J102,\"ok\",\"error\")","v":"ok"},{"$f":"F103-[1]ابريل!$J102","v":0},{"$f":"IF([1]ابريل!$J102>0,[1]ابريل!$C102,\" \")","v":" "},100,null,{"$f":"SUM(G103:AX103)","v":0}]
[{"$f":"IF(F104=[1]ابريل!$J103,\"ok\",\"error\")","v":"ok"},{"$f":"F104-[1]ابريل!$J103","v":0},"الإجمالى",null,null,{"$f":"SUM(F4:F103)","v":0},0,0,0,0,0,0,0,0,0,0,0,0,0,0,0,0,0,0,0,0,0,0,0,0,0,0,0,0,0]
[]
[null,null,null,null,"؟",{"$f":"F104-[1]ابريل!$J$103","v":0}]

{"sheet":"مايو","index":4,"n_rows":106,"n_cols":35,"rows_kept":106,"cut":false,"hidden":false,"merged":[[1,7,2,7],[1,9,2,9],[103,2,103,4],[1,2,2,2],[1,3,2,3],[1,4,2,4],[1,5,2,5],[1,6,2,6],[1,22,2,22],[1,11,2,11],[1,12,2,12],[1,13,2,13],[1,14,2,14],[1,15,2,15],[1,16,2,16],[1,17,2,17],[1,18,2,18],[1,19,2,19],[1,20,2,20],[1,21,2,21],[1,33,2,33],[1,26,2,26],[1,27,2,27],[1,28,2,28],[1,29,2,29],[0,2,0,14],[1,0,2,1],[1,38,2,38],[1,39,2,39],[1,10,2,10],[1,8,2,8],[1,34,2,34],[1,35,2,35],[1,36,2,36],[1,37,2,37],[1,30,2,30],[1,23,2,23],[1,24,2,24],[1,25,2,25],[1,31,2,31],[1,32,2,32]]}
[null,null,"تحليـــــــــــــــــل مصـــــــــــــــروفات التشغيـــــــــــــــل عن شهـــــــــر مــــــــايـــــــو لعام 201"]
["OR",null,"التاريخ","رقم القيد","البيان","الإجمالى",{"$f":"ابريل!G2","v":"صيانة\nواصلاح\nوقطع غيار"},{"$f":"ابريل!H2","v":"خامات تشغيل"},{"$f":"ابريل!I2","v":"م سيارات"},{"$f":"ابريل!J2","v":"كهرباء"},{"$f":"ابريل!K2","v":"م نظافة"},{"$f":"ابريل!L2","v":"مياه"},{"$f":"ابريل!M2","v":"تأمينات"},{"$f":"ابريل!N2","v":"أجور"},{"$f":"ابريل!O2","v":0},{"$f":"ابريل!P2","v":0},{"$f":"ابريل!Q2","v":0},{"$f":"ابريل!R2","v":0},{"$f":"ابريل!S2","v":0},{"$f":"ابريل!T2","v":0},{"$f":"ابريل!U2","v":0},{"$f":"ابريل!V2","v":0},{"$f":"ابريل!W2","v":0},{"$f":"ابريل!X2","v":0},{"$f":"ابريل!Y2","v":0},{"$f":"ابريل!Z2","v":0},{"$f":"ابريل!AA2","v":0},{"$f":"ابريل!AB2","v":0},{"$f":"ابريل!AC2","v":0},{"$f":"ابريل!AD2","v":0}]
[]
[{"$f":"IF(F4=[1]مايو!$J3,\"ok\",\"error\")","v":"ok"},{"$f":"F4-[1]مايو!$J3","v":0},{"$f":"IF([1]مايو!$J3>0,[1]مايو!$C3,\" \")","v":" "},1,null,{"$f":"SUM(G4:AX4)","v":0}]
[{"$f":"IF(F5=[1]مايو!$J4,\"ok\",\"error\")","v":"ok"},{"$f":"F5-[1]مايو!$J4","v":0},{"$f":"IF([1]مايو!$J4>0,[1]مايو!$C4,\" \")","v":" "},2,null,0]
[{"$f":"IF(F6=[1]مايو!$J5,\"ok\",\"error\")","v":"ok"},{"$f":"F6-[1]مايو!$J5","v":0},{"$f":"IF([1]مايو!$J5>0,[1]مايو!$C5,\" \")","v":" "},3,null,0]
[{"$f":"IF(F7=[1]مايو!$J6,\"ok\",\"error\")","v":"ok"},{"$f":"F7-[1]مايو!$J6","v":0},{"$f":"IF([1]مايو!$J6>0,[1]مايو!$C6,\" \")","v":" "},4,null,0]
[{"$f":"IF(F8=[1]مايو!$J7,\"ok\",\"error\")","v":"ok"},{"$f":"F8-[1]مايو!$J7","v":0},{"$f":"IF([1]مايو!$J7>0,[1]مايو!$C7,\" \")","v":" "},5,null,0]
[{"$f":"IF(F9=[1]مايو!$J8,\"ok\",\"error\")","v":"ok"},{"$f":"F9-[1]مايو!$J8","v":0},{"$f":"IF([1]مايو!$J8>0,[1]مايو!$C8,\" \")","v":" "},6,null,0]
[{"$f":"IF(F10=[1]مايو!$J9,\"ok\",\"error\")","v":"ok"},{"$f":"F10-[1]مايو!$J9","v":0},{"$f":"IF([1]مايو!$J9>0,[1]مايو!$C9,\" \")","v":" "},7,null,0]
[{"$f":"IF(F11=[1]مايو!$J10,\"ok\",\"error\")","v":"ok"},{"$f":"F11-[1]مايو!$J10","v":0},{"$f":"IF([1]مايو!$J10>0,[1]مايو!$C10,\" \")","v":" "},8,null,0]
[{"$f":"IF(F12=[1]مايو!$J11,\"ok\",\"error\")","v":"ok"},{"$f":"F12-[1]مايو!$J11","v":0},{"$f":"IF([1]مايو!$J11>0,[1]مايو!$C11,\" \")","v":" "},9,null,0]
[{"$f":"IF(F13=[1]مايو!$J12,\"ok\",\"error\")","v":"ok"},{"$f":"F13-[1]مايو!$J12","v":0},{"$f":"IF([1]مايو!$J12>0,[1]مايو!$C12,\" \")","v":" "},10,null,0]
[{"$f":"IF(F14=[1]مايو!$J13,\"ok\",\"error\")","v":"ok"},{"$f":"F14-[1]مايو!$J13","v":0},{"$f":"IF([1]مايو!$J13>0,[1]مايو!$C13,\" \")","v":" "},11,null,0]
[{"$f":"IF(F15=[1]مايو!$J14,\"ok\",\"error\")","v":"ok"},{"$f":"F15-[1]مايو!$J14","v":0},{"$f":"IF([1]مايو!$J14>0,[1]مايو!$C14,\" \")","v":" "},12,null,0]
[{"$f":"IF(F16=[1]مايو!$J15,\"ok\",\"error\")","v":"ok"},{"$f":"F16-[1]مايو!$J15","v":0},{"$f":"IF([1]مايو!$J15>0,[1]مايو!$C15,\" \")","v":" "},13,null,0]
[{"$f":"IF(F17=[1]مايو!$J16,\"ok\",\"error\")","v":"ok"},{"$f":"F17-[1]مايو!$J16","v":0},{"$f":"IF([1]مايو!$J16>0,[1]مايو!$C16,\" \")","v":" "},14,null,0]
[{"$f":"IF(F18=[1]مايو!$J17,\"ok\",\"error\")","v":"ok"},{"$f":"F18-[1]مايو!$J17","v":0},{"$f":"IF([1]مايو!$J17>0,[1]مايو!$C17,\" \")","v":" "},15,null,0]
[{"$f":"IF(F19=[1]مايو!$J18,\"ok\",\"error\")","v":"ok"},{"$f":"F19-[1]مايو!$J18","v":0},{"$f":"IF([1]مايو!$J18>0,[1]مايو!$C18,\" \")","v":" "},16,null,0]
[{"$f":"IF(F20=[1]مايو!$J19,\"ok\",\"error\")","v":"ok"},{"$f":"F20-[1]مايو!$J19","v":0},{"$f":"IF([1]مايو!$J19>0,[1]مايو!$C19,\" \")","v":" "},17,null,0]
[{"$f":"IF(F21=[1]مايو!$J20,\"ok\",\"error\")","v":"ok"},{"$f":"F21-[1]مايو!$J20","v":0},{"$f":"IF([1]مايو!$J20>0,[1]مايو!$C20,\" \")","v":" "},18,null,0]
[{"$f":"IF(F22=[1]مايو!$J21,\"ok\",\"error\")","v":"ok"},{"$f":"F22-[1]مايو!$J21","v":0},{"$f":"IF([1]مايو!$J21>0,[1]مايو!$C21,\" \")","v":" "},19,null,0]
[{"$f":"IF(F23=[1]مايو!$J22,\"ok\",\"error\")","v":"ok"},{"$f":"F23-[1]مايو!$J22","v":0},{"$f":"IF([1]مايو!$J22>0,[1]مايو!$C22,\" \")","v":" "},20,null,0]
[{"$f":"IF(F24=[1]مايو!$J23,\"ok\",\"error\")","v":"ok"},{"$f":"F24-[1]مايو!$J23","v":0},{"$f":"IF([1]مايو!$J23>0,[1]مايو!$C23,\" \")","v":" "},21,null,0]
[{"$f":"IF(F25=[1]مايو!$J24,\"ok\",\"error\")","v":"ok"},{"$f":"F25-[1]مايو!$J24","v":0},{"$f":"IF([1]مايو!$J24>0,[1]مايو!$C24,\" \")","v":" "},22,null,0]
[{"$f":"IF(F26=[1]مايو!$J25,\"ok\",\"error\")","v":"ok"},{"$f":"F26-[1]مايو!$J25","v":0},{"$f":"IF([1]مايو!$J25>0,[1]مايو!$C25,\" \")","v":" "},23,null,0]
[{"$f":"IF(F27=[1]مايو!$J26,\"ok\",\"error\")","v":"ok"},{"$f":"F27-[1]مايو!$J26","v":0},{"$f":"IF([1]مايو!$J26>0,[1]مايو!$C26,\" \")","v":" "},24,null,0]
[{"$f":"IF(F28=[1]مايو!$J27,\"ok\",\"error\")","v":"ok"},{"$f":"F28-[1]مايو!$J27","v":0},{"$f":"IF([1]مايو!$J27>0,[1]مايو!$C27,\" \")","v":" "},25,null,0]
[{"$f":"IF(F29=[1]مايو!$J28,\"ok\",\"error\")","v":"ok"},{"$f":"F29-[1]مايو!$J28","v":0},{"$f":"IF([1]مايو!$J28>0,[1]مايو!$C28,\" \")","v":" "},26,null,0]
[{"$f":"IF(F30=[1]مايو!$J29,\"ok\",\"error\")","v":"ok"},{"$f":"F30-[1]مايو!$J29","v":0},{"$f":"IF([1]مايو!$J29>0,[1]مايو!$C29,\" \")","v":" "},27,null,0]
[{"$f":"IF(F31=[1]مايو!$J30,\"ok\",\"error\")","v":"ok"},{"$f":"F31-[1]مايو!$J30","v":0},{"$f":"IF([1]مايو!$J30>0,[1]مايو!$C30,\" \")","v":" "},28,null,0]
[{"$f":"IF(F32=[1]مايو!$J31,\"ok\",\"error\")","v":"ok"},{"$f":"F32-[1]مايو!$J31","v":0},{"$f":"IF([1]مايو!$J31>0,[1]مايو!$C31,\" \")","v":" "},29,null,0]
[{"$f":"IF(F33=[1]مايو!$J32,\"ok\",\"error\")","v":"ok"},{"$f":"F33-[1]مايو!$J32","v":0},{"$f":"IF([1]مايو!$J32>0,[1]مايو!$C32,\" \")","v":" "},30,null,0]
[{"$f":"IF(F34=[1]مايو!$J33,\"ok\",\"error\")","v":"ok"},{"$f":"F34-[1]مايو!$J33","v":0},{"$f":"IF([1]مايو!$J33>0,[1]مايو!$C33,\" \")","v":" "},31,null,0]
[{"$f":"IF(F35=[1]مايو!$J34,\"ok\",\"error\")","v":"ok"},{"$f":"F35-[1]مايو!$J34","v":0},{"$f":"IF([1]مايو!$J34>0,[1]مايو!$C34,\" \")","v":" "},32,null,0]
[{"$f":"IF(F36=[1]مايو!$J35,\"ok\",\"error\")","v":"ok"},{"$f":"F36-[1]مايو!$J35","v":0},{"$f":"IF([1]مايو!$J35>0,[1]مايو!$C35,\" \")","v":" "},33,null,{"$f":"SUM(G36:AX36)","v":0}]
[{"$f":"IF(F37=[1]مايو!$J36,\"ok\",\"error\")","v":"ok"},{"$f":"F37-[1]مايو!$J36","v":0},{"$f":"IF([1]مايو!$J36>0,[1]مايو!$C36,\" \")","v":" "},34,null,0]
[{"$f":"IF(F38=[1]مايو!$J37,\"ok\",\"error\")","v":"ok"},{"$f":"F38-[1]مايو!$J37","v":0},{"$f":"IF([1]مايو!$J37>0,[1]مايو!$C37,\" \")","v":" "},35,null,0]
[{"$f":"IF(F39=[1]مايو!$J38,\"ok\",\"error\")","v":"ok"},{"$f":"F39-[1]مايو!$J38","v":0},{"$f":"IF([1]مايو!$J38>0,[1]مايو!$C38,\" \")","v":" "},36,null,0]
[{"$f":"IF(F40=[1]مايو!$J39,\"ok\",\"error\")","v":"ok"},{"$f":"F40-[1]مايو!$J39","v":0},{"$f":"IF([1]مايو!$J39>0,[1]مايو!$C39,\" \")","v":" "},37,null,0]
[{"$f":"IF(F41=[1]مايو!$J40,\"ok\",\"error\")","v":"ok"},{"$f":"F41-[1]مايو!$J40","v":0},{"$f":"IF([1]مايو!$J40>0,[1]مايو!$C40,\" \")","v":" "},38,null,0]
[{"$f":"IF(F42=[1]مايو!$J41,\"ok\",\"error\")","v":"ok"},{"$f":"F42-[1]مايو!$J41","v":0},{"$f":"IF([1]مايو!$J41>0,[1]مايو!$C41,\" \")","v":" "},39,null,0]
[{"$f":"IF(F43=[1]مايو!$J42,\"ok\",\"error\")","v":"ok"},{"$f":"F43-[1]مايو!$J42","v":0},{"$f":"IF([1]مايو!$J42>0,[1]مايو!$C42,\" \")","v":" "},40,null,0]
[{"$f":"IF(F44=[1]مايو!$J43,\"ok\",\"error\")","v":"ok"},{"$f":"F44-[1]مايو!$J43","v":0},{"$f":"IF([1]مايو!$J43>0,[1]مايو!$C43,\" \")","v":" "},41,null,0]
[{"$f":"IF(F45=[1]مايو!$J44,\"ok\",\"error\")","v":"ok"},{"$f":"F45-[1]مايو!$J44","v":0},{"$f":"IF([1]مايو!$J44>0,[1]مايو!$C44,\" \")","v":" "},42,null,0]
[{"$f":"IF(F46=[1]مايو!$J45,\"ok\",\"error\")","v":"ok"},{"$f":"F46-[1]مايو!$J45","v":0},{"$f":"IF([1]مايو!$J45>0,[1]مايو!$C45,\" \")","v":" "},43,null,0]
[{"$f":"IF(F47=[1]مايو!$J46,\"ok\",\"error\")","v":"ok"},{"$f":"F47-[1]مايو!$J46","v":0},{"$f":"IF([1]مايو!$J46>0,[1]مايو!$C46,\" \")","v":" "},44,null,0]
[{"$f":"IF(F48=[1]مايو!$J47,\"ok\",\"error\")","v":"ok"},{"$f":"F48-[1]مايو!$J47","v":0},{"$f":"IF([1]مايو!$J47>0,[1]مايو!$C47,\" \")","v":" "},45,null,0]
[{"$f":"IF(F49=[1]مايو!$J48,\"ok\",\"error\")","v":"ok"},{"$f":"F49-[1]مايو!$J48","v":0},{"$f":"IF([1]مايو!$J48>0,[1]مايو!$C48,\" \")","v":" "},46,null,0]
[{"$f":"IF(F50=[1]مايو!$J49,\"ok\",\"error\")","v":"ok"},{"$f":"F50-[1]مايو!$J49","v":0},{"$f":"IF([1]مايو!$J49>0,[1]مايو!$C49,\" \")","v":" "},47,null,0]
[{"$f":"IF(F51=[1]مايو!$J50,\"ok\",\"error\")","v":"ok"},{"$f":"F51-[1]مايو!$J50","v":0},{"$f":"IF([1]مايو!$J50>0,[1]مايو!$C50,\" \")","v":" "},48,null,0]
[{"$f":"IF(F52=[1]مايو!$J51,\"ok\",\"error\")","v":"ok"},{"$f":"F52-[1]مايو!$J51","v":0},{"$f":"IF([1]مايو!$J51>0,[1]مايو!$C51,\" \")","v":" "},49,null,0]
[{"$f":"IF(F53=[1]مايو!$J52,\"ok\",\"error\")","v":"ok"},{"$f":"F53-[1]مايو!$J52","v":0},{"$f":"IF([1]مايو!$J52>0,[1]مايو!$C52,\" \")","v":" "},50,null,0]
[{"$f":"IF(F54=[1]مايو!$J53,\"ok\",\"error\")","v":"ok"},{"$f":"F54-[1]مايو!$J53","v":0},{"$f":"IF([1]مايو!$J53>0,[1]مايو!$C53,\" \")","v":" "},51,null,0]
[{"$f":"IF(F55=[1]مايو!$J54,\"ok\",\"error\")","v":"ok"},{"$f":"F55-[1]مايو!$J54","v":0},{"$f":"IF([1]مايو!$J54>0,[1]مايو!$C54,\" \")","v":" "},52,null,0]
[{"$f":"IF(F56=[1]مايو!$J55,\"ok\",\"error\")","v":"ok"},{"$f":"F56-[1]مايو!$J55","v":0},{"$f":"IF([1]مايو!$J55>0,[1]مايو!$C55,\" \")","v":" "},53,null,0]
[{"$f":"IF(F57=[1]مايو!$J56,\"ok\",\"error\")","v":"ok"},{"$f":"F57-[1]مايو!$J56","v":0},{"$f":"IF([1]مايو!$J56>0,[1]مايو!$C56,\" \")","v":" "},54,null,0]
[{"$f":"IF(F58=[1]مايو!$J57,\"ok\",\"error\")","v":"ok"},{"$f":"F58-[1]مايو!$J57","v":0},{"$f":"IF([1]مايو!$J57>0,[1]مايو!$C57,\" \")","v":" "},55,null,0]
[{"$f":"IF(F59=[1]مايو!$J58,\"ok\",\"error\")","v":"ok"},{"$f":"F59-[1]مايو!$J58","v":0},{"$f":"IF([1]مايو!$J58>0,[1]مايو!$C58,\" \")","v":" "},56,null,0]
[{"$f":"IF(F60=[1]مايو!$J59,\"ok\",\"error\")","v":"ok"},{"$f":"F60-[1]مايو!$J59","v":0},{"$f":"IF([1]مايو!$J59>0,[1]مايو!$C59,\" \")","v":" "},57,null,0]
[{"$f":"IF(F61=[1]مايو!$J60,\"ok\",\"error\")","v":"ok"},{"$f":"F61-[1]مايو!$J60","v":0},{"$f":"IF([1]مايو!$J60>0,[1]مايو!$C60,\" \")","v":" "},58,null,0]
[{"$f":"IF(F62=[1]مايو!$J61,\"ok\",\"error\")","v":"ok"},{"$f":"F62-[1]مايو!$J61","v":0},{"$f":"IF([1]مايو!$J61>0,[1]مايو!$C61,\" \")","v":" "},59,null,0]
[{"$f":"IF(F63=[1]مايو!$J62,\"ok\",\"error\")","v":"ok"},{"$f":"F63-[1]مايو!$J62","v":0},{"$f":"IF([1]مايو!$J62>0,[1]مايو!$C62,\" \")","v":" "},60,null,0]
[{"$f":"IF(F64=[1]مايو!$J63,\"ok\",\"error\")","v":"ok"},{"$f":"F64-[1]مايو!$J63","v":0},{"$f":"IF([1]مايو!$J63>0,[1]مايو!$C63,\" \")","v":" "},61,null,0]
[{"$f":"IF(F65=[1]مايو!$J64,\"ok\",\"error\")","v":"ok"},{"$f":"F65-[1]مايو!$J64","v":0},{"$f":"IF([1]مايو!$J64>0,[1]مايو!$C64,\" \")","v":" "},62,null,0]
[{"$f":"IF(F66=[1]مايو!$J65,\"ok\",\"error\")","v":"ok"},{"$f":"F66-[1]مايو!$J65","v":0},{"$f":"IF([1]مايو!$J65>0,[1]مايو!$C65,\" \")","v":" "},63,null,0]
[{"$f":"IF(F67=[1]مايو!$J66,\"ok\",\"error\")","v":"ok"},{"$f":"F67-[1]مايو!$J66","v":0},{"$f":"IF([1]مايو!$J66>0,[1]مايو!$C66,\" \")","v":" "},64,null,0]
[{"$f":"IF(F68=[1]مايو!$J67,\"ok\",\"error\")","v":"ok"},{"$f":"F68-[1]مايو!$J67","v":0},{"$f":"IF([1]مايو!$J67>0,[1]مايو!$C67,\" \")","v":" "},65,null,{"$f":"SUM(G68:AX68)","v":0}]
[{"$f":"IF(F69=[1]مايو!$J68,\"ok\",\"error\")","v":"ok"},{"$f":"F69-[1]مايو!$J68","v":0},{"$f":"IF([1]مايو!$J68>0,[1]مايو!$C68,\" \")","v":" "},66,null,0]
[{"$f":"IF(F70=[1]مايو!$J69,\"ok\",\"error\")","v":"ok"},{"$f":"F70-[1]مايو!$J69","v":0},{"$f":"IF([1]مايو!$J69>0,[1]مايو!$C69,\" \")","v":" "},67,null,0]
[{"$f":"IF(F71=[1]مايو!$J70,\"ok\",\"error\")","v":"ok"},{"$f":"F71-[1]مايو!$J70","v":0},{"$f":"IF([1]مايو!$J70>0,[1]مايو!$C70,\" \")","v":" "},68,null,0]
[{"$f":"IF(F72=[1]مايو!$J71,\"ok\",\"error\")","v":"ok"},{"$f":"F72-[1]مايو!$J71","v":0},{"$f":"IF([1]مايو!$J71>0,[1]مايو!$C71,\" \")","v":" "},69,null,0]
[{"$f":"IF(F73=[1]مايو!$J72,\"ok\",\"error\")","v":"ok"},{"$f":"F73-[1]مايو!$J72","v":0},{"$f":"IF([1]مايو!$J72>0,[1]مايو!$C72,\" \")","v":" "},70,null,0]
[{"$f":"IF(F74=[1]مايو!$J73,\"ok\",\"error\")","v":"ok"},{"$f":"F74-[1]مايو!$J73","v":0},{"$f":"IF([1]مايو!$J73>0,[1]مايو!$C73,\" \")","v":" "},71,null,0]
[{"$f":"IF(F75=[1]مايو!$J74,\"ok\",\"error\")","v":"ok"},{"$f":"F75-[1]مايو!$J74","v":0},{"$f":"IF([1]مايو!$J74>0,[1]مايو!$C74,\" \")","v":" "},72,null,0]
[{"$f":"IF(F76=[1]مايو!$J75,\"ok\",\"error\")","v":"ok"},{"$f":"F76-[1]مايو!$J75","v":0},{"$f":"IF([1]مايو!$J75>0,[1]مايو!$C75,\" \")","v":" "},73,null,0]
[{"$f":"IF(F77=[1]مايو!$J76,\"ok\",\"error\")","v":"ok"},{"$f":"F77-[1]مايو!$J76","v":0},{"$f":"IF([1]مايو!$J76>0,[1]مايو!$C76,\" \")","v":" "},74,null,0]
[{"$f":"IF(F78=[1]مايو!$J77,\"ok\",\"error\")","v":"ok"},{"$f":"F78-[1]مايو!$J77","v":0},{"$f":"IF([1]مايو!$J77>0,[1]مايو!$C77,\" \")","v":" "},75,null,0]
[{"$f":"IF(F79=[1]مايو!$J78,\"ok\",\"error\")","v":"ok"},{"$f":"F79-[1]مايو!$J78","v":0},{"$f":"IF([1]مايو!$J78>0,[1]مايو!$C78,\" \")","v":" "},76,null,0]
[{"$f":"IF(F80=[1]مايو!$J79,\"ok\",\"error\")","v":"ok"},{"$f":"F80-[1]مايو!$J79","v":0},{"$f":"IF([1]مايو!$J79>0,[1]مايو!$C79,\" \")","v":" "},77,null,0]
[{"$f":"IF(F81=[1]مايو!$J80,\"ok\",\"error\")","v":"ok"},{"$f":"F81-[1]مايو!$J80","v":0},{"$f":"IF([1]مايو!$J80>0,[1]مايو!$C80,\" \")","v":" "},78,null,0]
[{"$f":"IF(F82=[1]مايو!$J81,\"ok\",\"error\")","v":"ok"},{"$f":"F82-[1]مايو!$J81","v":0},{"$f":"IF([1]مايو!$J81>0,[1]مايو!$C81,\" \")","v":" "},79,null,0]
[{"$f":"IF(F83=[1]مايو!$J82,\"ok\",\"error\")","v":"ok"},{"$f":"F83-[1]مايو!$J82","v":0},{"$f":"IF([1]مايو!$J82>0,[1]مايو!$C82,\" \")","v":" "},80,null,0]
[{"$f":"IF(F84=[1]مايو!$J83,\"ok\",\"error\")","v":"ok"},{"$f":"F84-[1]مايو!$J83","v":0},{"$f":"IF([1]مايو!$J83>0,[1]مايو!$C83,\" \")","v":" "},81,null,0]
[{"$f":"IF(F85=[1]مايو!$J84,\"ok\",\"error\")","v":"ok"},{"$f":"F85-[1]مايو!$J84","v":0},{"$f":"IF([1]مايو!$J84>0,[1]مايو!$C84,\" \")","v":" "},82,null,0]
[{"$f":"IF(F86=[1]مايو!$J85,\"ok\",\"error\")","v":"ok"},{"$f":"F86-[1]مايو!$J85","v":0},{"$f":"IF([1]مايو!$J85>0,[1]مايو!$C85,\" \")","v":" "},83,null,0]
[{"$f":"IF(F87=[1]مايو!$J86,\"ok\",\"error\")","v":"ok"},{"$f":"F87-[1]مايو!$J86","v":0},{"$f":"IF([1]مايو!$J86>0,[1]مايو!$C86,\" \")","v":" "},84,null,0]
[{"$f":"IF(F88=[1]مايو!$J87,\"ok\",\"error\")","v":"ok"},{"$f":"F88-[1]مايو!$J87","v":0},{"$f":"IF([1]مايو!$J87>0,[1]مايو!$C87,\" \")","v":" "},85,null,0]
[{"$f":"IF(F89=[1]مايو!$J88,\"ok\",\"error\")","v":"ok"},{"$f":"F89-[1]مايو!$J88","v":0},{"$f":"IF([1]مايو!$J88>0,[1]مايو!$C88,\" \")","v":" "},86,null,0]
[{"$f":"IF(F90=[1]مايو!$J89,\"ok\",\"error\")","v":"ok"},{"$f":"F90-[1]مايو!$J89","v":0},{"$f":"IF([1]مايو!$J89>0,[1]مايو!$C89,\" \")","v":" "},87,null,0]
[{"$f":"IF(F91=[1]مايو!$J90,\"ok\",\"error\")","v":"ok"},{"$f":"F91-[1]مايو!$J90","v":0},{"$f":"IF([1]مايو!$J90>0,[1]مايو!$C90,\" \")","v":" "},88,null,0]
[{"$f":"IF(F92=[1]مايو!$J91,\"ok\",\"error\")","v":"ok"},{"$f":"F92-[1]مايو!$J91","v":0},{"$f":"IF([1]مايو!$J91>0,[1]مايو!$C91,\" \")","v":" "},89,null,0]
[{"$f":"IF(F93=[1]مايو!$J92,\"ok\",\"error\")","v":"ok"},{"$f":"F93-[1]مايو!$J92","v":0},{"$f":"IF([1]مايو!$J92>0,[1]مايو!$C92,\" \")","v":" "},90,null,0]
[{"$f":"IF(F94=[1]مايو!$J93,\"ok\",\"error\")","v":"ok"},{"$f":"F94-[1]مايو!$J93","v":0},{"$f":"IF([1]مايو!$J93>0,[1]مايو!$C93,\" \")","v":" "},91,null,0]
[{"$f":"IF(F95=[1]مايو!$J94,\"ok\",\"error\")","v":"ok"},{"$f":"F95-[1]مايو!$J94","v":0},{"$f":"IF([1]مايو!$J94>0,[1]مايو!$C94,\" \")","v":" "},92,null,0]
[{"$f":"IF(F96=[1]مايو!$J95,\"ok\",\"error\")","v":"ok"},{"$f":"F96-[1]مايو!$J95","v":0},{"$f":"IF([1]مايو!$J95>0,[1]مايو!$C95,\" \")","v":" "},93,null,0]
[{"$f":"IF(F97=[1]مايو!$J96,\"ok\",\"error\")","v":"ok"},{"$f":"F97-[1]مايو!$J96","v":0},{"$f":"IF([1]مايو!$J96>0,[1]مايو!$C96,\" \")","v":" "},94,null,0]
[{"$f":"IF(F98=[1]مايو!$J97,\"ok\",\"error\")","v":"ok"},{"$f":"F98-[1]مايو!$J97","v":0},{"$f":"IF([1]مايو!$J97>0,[1]مايو!$C97,\" \")","v":" "},95,null,0]
[{"$f":"IF(F99=[1]مايو!$J98,\"ok\",\"error\")","v":"ok"},{"$f":"F99-[1]مايو!$J98","v":0},{"$f":"IF([1]مايو!$J98>0,[1]مايو!$C98,\" \")","v":" "},96,null,0]
[{"$f":"IF(F100=[1]مايو!$J99,\"ok\",\"error\")","v":"ok"},{"$f":"F100-[1]مايو!$J99","v":0},{"$f":"IF([1]مايو!$J99>0,[1]مايو!$C99,\" \")","v":" "},97,null,{"$f":"SUM(G100:AX100)","v":0}]
[{"$f":"IF(F101=[1]مايو!$J100,\"ok\",\"error\")","v":"ok"},{"$f":"F101-[1]مايو!$J100","v":0},{"$f":"IF([1]مايو!$J100>0,[1]مايو!$C100,\" \")","v":" "},98,null,{"$f":"SUM(G101:AX101)","v":0}]
[{"$f":"IF(F102=[1]مايو!$J101,\"ok\",\"error\")","v":"ok"},{"$f":"F102-[1]مايو!$J101","v":0},{"$f":"IF([1]مايو!$J101>0,[1]مايو!$C101,\" \")","v":" "},99,null,{"$f":"SUM(G102:AX102)","v":0}]
[{"$f":"IF(F103=[1]مايو!$J102,\"ok\",\"error\")","v":"ok"},{"$f":"F103-[1]مايو!$J102","v":0},{"$f":"IF([1]مايو!$J102>0,[1]مايو!$C102,\" \")","v":" "},100,null,{"$f":"SUM(G103:AX103)","v":0}]
[{"$f":"IF(F104=[1]مايو!$J103,\"ok\",\"error\")","v":"ok"},{"$f":"F104-[1]مايو!$J103","v":0},"الإجمالى",null,null,{"$f":"SUM(F4:F103)","v":0},0,0,0,0,0,0,0,0,0,0,0,0,0,0,0,0,0,0,0,0,0,0,0,0,0,0,0,0,0]
[]
[null,null,null,null,"؟",{"$f":"F104-[1]مايو!$J$103","v":0}]

{"sheet":"يونيو","index":5,"n_rows":106,"n_cols":35,"rows_kept":106,"cut":false,"hidden":false,"merged":[[1,38,2,38],[1,39,2,39],[1,10,2,10],[1,8,2,8],[1,34,2,34],[1,35,2,35],[1,36,2,36],[1,37,2,37],[1,30,2,30],[1,31,2,31],[1,32,2,32],[1,33,2,33],[1,26,2,26],[1,27,2,27],[1,28,2,28],[1,29,2,29],[1,22,2,22],[1,23,2,23],[1,24,2,24],[1,25,2,25],[1,18,2,18],[1,19,2,19],[1,20,2,20],[1,21,2,21],[1,15,2,15],[1,16,2,16],[1,17,2,17],[1,9,2,9],[1,11,2,11],[1,12,2,12],[1,13,2,13],[103,2,103,4],[1,2,2,2],[1,3,2,3],[1,4,2,4],[1,14,2,14],[0,2,0,14],[1,0,2,1],[1,5,2,5],[1,6,2,6],[1,7,2,7]]}
[null,null,"تحليـــــــــــــــــل مصـــــــــــــــروفات التشغيـــــــــــــــل عن شهـــــــــر يــــــــونيــــــــو لعام 201"]
["OR",null,"التاريخ","رقم القيد","البيان","الإجمالى",{"$f":"مايو!G2","v":"صيانة\nواصلاح\nوقطع غيار"},{"$f":"مايو!H2","v":"خامات تشغيل"},{"$f":"مايو!I2","v":"م سيارات"},{"$f":"مايو!J2","v":"كهرباء"},{"$f":"مايو!K2","v":"م نظافة"},{"$f":"مايو!L2","v":"مياه"},{"$f":"مايو!M2","v":"تأمينات"},{"$f":"مايو!N2","v":"أجور"},{"$f":"مايو!O2","v":0},{"$f":"مايو!P2","v":0},{"$f":"مايو!Q2","v":0},{"$f":"مايو!R2","v":0},{"$f":"مايو!S2","v":0},{"$f":"مايو!T2","v":0},{"$f":"مايو!U2","v":0},{"$f":"مايو!V2","v":0},{"$f":"مايو!W2","v":0},{"$f":"مايو!X2","v":0},{"$f":"مايو!Y2","v":0},{"$f":"مايو!Z2","v":0},{"$f":"مايو!AA2","v":0},{"$f":"مايو!AB2","v":0},{"$f":"مايو!AC2","v":0},{"$f":"مايو!AD2","v":0}]
[]
[{"$f":"IF(F4=[1]يونيو!$J3,\"ok\",\"error\")","v":"ok"},{"$f":"F4-[1]يونيو!$J3","v":0},{"$f":"IF([1]يونيو!$J3>0,[1]يونيو!$C3,\" \")","v":" "},1,null,{"$f":"SUM(G4:AX4)","v":0}]
[{"$f":"IF(F5=[1]يونيو!$J4,\"ok\",\"error\")","v":"ok"},{"$f":"F5-[1]يونيو!$J4","v":0},{"$f":"IF([1]يونيو!$J4>0,[1]يونيو!$C4,\" \")","v":" "},2,null,0]
[{"$f":"IF(F6=[1]يونيو!$J5,\"ok\",\"error\")","v":"ok"},{"$f":"F6-[1]يونيو!$J5","v":0},{"$f":"IF([1]يونيو!$J5>0,[1]يونيو!$C5,\" \")","v":" "},3,null,0]
[{"$f":"IF(F7=[1]يونيو!$J6,\"ok\",\"error\")","v":"ok"},{"$f":"F7-[1]يونيو!$J6","v":0},{"$f":"IF([1]يونيو!$J6>0,[1]يونيو!$C6,\" \")","v":" "},4,null,0]
[{"$f":"IF(F8=[1]يونيو!$J7,\"ok\",\"error\")","v":"ok"},{"$f":"F8-[1]يونيو!$J7","v":0},{"$f":"IF([1]يونيو!$J7>0,[1]يونيو!$C7,\" \")","v":" "},5,null,0]
[{"$f":"IF(F9=[1]يونيو!$J8,\"ok\",\"error\")","v":"ok"},{"$f":"F9-[1]يونيو!$J8","v":0},{"$f":"IF([1]يونيو!$J8>0,[1]يونيو!$C8,\" \")","v":" "},6,null,0]
[{"$f":"IF(F10=[1]يونيو!$J9,\"ok\",\"error\")","v":"ok"},{"$f":"F10-[1]يونيو!$J9","v":0},{"$f":"IF([1]يونيو!$J9>0,[1]يونيو!$C9,\" \")","v":" "},7,null,0]
[{"$f":"IF(F11=[1]يونيو!$J10,\"ok\",\"error\")","v":"ok"},{"$f":"F11-[1]يونيو!$J10","v":0},{"$f":"IF([1]يونيو!$J10>0,[1]يونيو!$C10,\" \")","v":" "},8,null,0]
[{"$f":"IF(F12=[1]يونيو!$J11,\"ok\",\"error\")","v":"ok"},{"$f":"F12-[1]يونيو!$J11","v":0},{"$f":"IF([1]يونيو!$J11>0,[1]يونيو!$C11,\" \")","v":" "},9,null,0]
[{"$f":"IF(F13=[1]يونيو!$J12,\"ok\",\"error\")","v":"ok"},{"$f":"F13-[1]يونيو!$J12","v":0},{"$f":"IF([1]يونيو!$J12>0,[1]يونيو!$C12,\" \")","v":" "},10,null,0]
[{"$f":"IF(F14=[1]يونيو!$J13,\"ok\",\"error\")","v":"ok"},{"$f":"F14-[1]يونيو!$J13","v":0},{"$f":"IF([1]يونيو!$J13>0,[1]يونيو!$C13,\" \")","v":" "},11,null,0]
[{"$f":"IF(F15=[1]يونيو!$J14,\"ok\",\"error\")","v":"ok"},{"$f":"F15-[1]يونيو!$J14","v":0},{"$f":"IF([1]يونيو!$J14>0,[1]يونيو!$C14,\" \")","v":" "},12,null,0]
[{"$f":"IF(F16=[1]يونيو!$J15,\"ok\",\"error\")","v":"ok"},{"$f":"F16-[1]يونيو!$J15","v":0},{"$f":"IF([1]يونيو!$J15>0,[1]يونيو!$C15,\" \")","v":" "},13,null,0]
[{"$f":"IF(F17=[1]يونيو!$J16,\"ok\",\"error\")","v":"ok"},{"$f":"F17-[1]يونيو!$J16","v":0},{"$f":"IF([1]يونيو!$J16>0,[1]يونيو!$C16,\" \")","v":" "},14,null,0]
[{"$f":"IF(F18=[1]يونيو!$J17,\"ok\",\"error\")","v":"ok"},{"$f":"F18-[1]يونيو!$J17","v":0},{"$f":"IF([1]يونيو!$J17>0,[1]يونيو!$C17,\" \")","v":" "},15,null,0]
[{"$f":"IF(F19=[1]يونيو!$J18,\"ok\",\"error\")","v":"ok"},{"$f":"F19-[1]يونيو!$J18","v":0},{"$f":"IF([1]يونيو!$J18>0,[1]يونيو!$C18,\" \")","v":" "},16,null,0]
[{"$f":"IF(F20=[1]يونيو!$J19,\"ok\",\"error\")","v":"ok"},{"$f":"F20-[1]يونيو!$J19","v":0},{"$f":"IF([1]يونيو!$J19>0,[1]يونيو!$C19,\" \")","v":" "},17,null,0]
[{"$f":"IF(F21=[1]يونيو!$J20,\"ok\",\"error\")","v":"ok"},{"$f":"F21-[1]يونيو!$J20","v":0},{"$f":"IF([1]يونيو!$J20>0,[1]يونيو!$C20,\" \")","v":" "},18,null,0]
[{"$f":"IF(F22=[1]يونيو!$J21,\"ok\",\"error\")","v":"ok"},{"$f":"F22-[1]يونيو!$J21","v":0},{"$f":"IF([1]يونيو!$J21>0,[1]يونيو!$C21,\" \")","v":" "},19,null,0]
[{"$f":"IF(F23=[1]يونيو!$J22,\"ok\",\"error\")","v":"ok"},{"$f":"F23-[1]يونيو!$J22","v":0},{"$f":"IF([1]يونيو!$J22>0,[1]يونيو!$C22,\" \")","v":" "},20,null,0]
[{"$f":"IF(F24=[1]يونيو!$J23,\"ok\",\"error\")","v":"ok"},{"$f":"F24-[1]يونيو!$J23","v":0},{"$f":"IF([1]يونيو!$J23>0,[1]يونيو!$C23,\" \")","v":" "},21,null,0]
[{"$f":"IF(F25=[1]يونيو!$J24,\"ok\",\"error\")","v":"ok"},{"$f":"F25-[1]يونيو!$J24","v":0},{"$f":"IF([1]يونيو!$J24>0,[1]يونيو!$C24,\" \")","v":" "},22,null,0]
[{"$f":"IF(F26=[1]يونيو!$J25,\"ok\",\"error\")","v":"ok"},{"$f":"F26-[1]يونيو!$J25","v":0},{"$f":"IF([1]يونيو!$J25>0,[1]يونيو!$C25,\" \")","v":" "},23,null,0]
[{"$f":"IF(F27=[1]يونيو!$J26,\"ok\",\"error\")","v":"ok"},{"$f":"F27-[1]يونيو!$J26","v":0},{"$f":"IF([1]يونيو!$J26>0,[1]يونيو!$C26,\" \")","v":" "},24,null,0]
[{"$f":"IF(F28=[1]يونيو!$J27,\"ok\",\"error\")","v":"ok"},{"$f":"F28-[1]يونيو!$J27","v":0},{"$f":"IF([1]يونيو!$J27>0,[1]يونيو!$C27,\" \")","v":" "},25,null,0]
[{"$f":"IF(F29=[1]يونيو!$J28,\"ok\",\"error\")","v":"ok"},{"$f":"F29-[1]يونيو!$J28","v":0},{"$f":"IF([1]يونيو!$J28>0,[1]يونيو!$C28,\" \")","v":" "},26,null,0]
[{"$f":"IF(F30=[1]يونيو!$J29,\"ok\",\"error\")","v":"ok"},{"$f":"F30-[1]يونيو!$J29","v":0},{"$f":"IF([1]يونيو!$J29>0,[1]يونيو!$C29,\" \")","v":" "},27,null,0]
[{"$f":"IF(F31=[1]يونيو!$J30,\"ok\",\"error\")","v":"ok"},{"$f":"F31-[1]يونيو!$J30","v":0},{"$f":"IF([1]يونيو!$J30>0,[1]يونيو!$C30,\" \")","v":" "},28,null,0]
[{"$f":"IF(F32=[1]يونيو!$J31,\"ok\",\"error\")","v":"ok"},{"$f":"F32-[1]يونيو!$J31","v":0},{"$f":"IF([1]يونيو!$J31>0,[1]يونيو!$C31,\" \")","v":" "},29,null,0]
[{"$f":"IF(F33=[1]يونيو!$J32,\"ok\",\"error\")","v":"ok"},{"$f":"F33-[1]يونيو!$J32","v":0},{"$f":"IF([1]يونيو!$J32>0,[1]يونيو!$C32,\" \")","v":" "},30,null,0]
[{"$f":"IF(F34=[1]يونيو!$J33,\"ok\",\"error\")","v":"ok"},{"$f":"F34-[1]يونيو!$J33","v":0},{"$f":"IF([1]يونيو!$J33>0,[1]يونيو!$C33,\" \")","v":" "},31,null,0]
[{"$f":"IF(F35=[1]يونيو!$J34,\"ok\",\"error\")","v":"ok"},{"$f":"F35-[1]يونيو!$J34","v":0},{"$f":"IF([1]يونيو!$J34>0,[1]يونيو!$C34,\" \")","v":" "},32,null,0]
[{"$f":"IF(F36=[1]يونيو!$J35,\"ok\",\"error\")","v":"ok"},{"$f":"F36-[1]يونيو!$J35","v":0},{"$f":"IF([1]يونيو!$J35>0,[1]يونيو!$C35,\" \")","v":" "},33,null,{"$f":"SUM(G36:AX36)","v":0}]
[{"$f":"IF(F37=[1]يونيو!$J36,\"ok\",\"error\")","v":"ok"},{"$f":"F37-[1]يونيو!$J36","v":0},{"$f":"IF([1]يونيو!$J36>0,[1]يونيو!$C36,\" \")","v":" "},34,null,0]
[{"$f":"IF(F38=[1]يونيو!$J37,\"ok\",\"error\")","v":"ok"},{"$f":"F38-[1]يونيو!$J37","v":0},{"$f":"IF([1]يونيو!$J37>0,[1]يونيو!$C37,\" \")","v":" "},35,null,0]
[{"$f":"IF(F39=[1]يونيو!$J38,\"ok\",\"error\")","v":"ok"},{"$f":"F39-[1]يونيو!$J38","v":0},{"$f":"IF([1]يونيو!$J38>0,[1]يونيو!$C38,\" \")","v":" "},36,null,0]
[{"$f":"IF(F40=[1]يونيو!$J39,\"ok\",\"error\")","v":"ok"},{"$f":"F40-[1]يونيو!$J39","v":0},{"$f":"IF([1]يونيو!$J39>0,[1]يونيو!$C39,\" \")","v":" "},37,null,0]
[{"$f":"IF(F41=[1]يونيو!$J40,\"ok\",\"error\")","v":"ok"},{"$f":"F41-[1]يونيو!$J40","v":0},{"$f":"IF([1]يونيو!$J40>0,[1]يونيو!$C40,\" \")","v":" "},38,null,0]
[{"$f":"IF(F42=[1]يونيو!$J41,\"ok\",\"error\")","v":"ok"},{"$f":"F42-[1]يونيو!$J41","v":0},{"$f":"IF([1]يونيو!$J41>0,[1]يونيو!$C41,\" \")","v":" "},39,null,0]
[{"$f":"IF(F43=[1]يونيو!$J42,\"ok\",\"error\")","v":"ok"},{"$f":"F43-[1]يونيو!$J42","v":0},{"$f":"IF([1]يونيو!$J42>0,[1]يونيو!$C42,\" \")","v":" "},40,null,0]
[{"$f":"IF(F44=[1]يونيو!$J43,\"ok\",\"error\")","v":"ok"},{"$f":"F44-[1]يونيو!$J43","v":0},{"$f":"IF([1]يونيو!$J43>0,[1]يونيو!$C43,\" \")","v":" "},41,null,0]
[{"$f":"IF(F45=[1]يونيو!$J44,\"ok\",\"error\")","v":"ok"},{"$f":"F45-[1]يونيو!$J44","v":0},{"$f":"IF([1]يونيو!$J44>0,[1]يونيو!$C44,\" \")","v":" "},42,null,0]
[{"$f":"IF(F46=[1]يونيو!$J45,\"ok\",\"error\")","v":"ok"},{"$f":"F46-[1]يونيو!$J45","v":0},{"$f":"IF([1]يونيو!$J45>0,[1]يونيو!$C45,\" \")","v":" "},43,null,0]
[{"$f":"IF(F47=[1]يونيو!$J46,\"ok\",\"error\")","v":"ok"},{"$f":"F47-[1]يونيو!$J46","v":0},{"$f":"IF([1]يونيو!$J46>0,[1]يونيو!$C46,\" \")","v":" "},44,null,0]
[{"$f":"IF(F48=[1]يونيو!$J47,\"ok\",\"error\")","v":"ok"},{"$f":"F48-[1]يونيو!$J47","v":0},{"$f":"IF([1]يونيو!$J47>0,[1]يونيو!$C47,\" \")","v":" "},45,null,0]
[{"$f":"IF(F49=[1]يونيو!$J48,\"ok\",\"error\")","v":"ok"},{"$f":"F49-[1]يونيو!$J48","v":0},{"$f":"IF([1]يونيو!$J48>0,[1]يونيو!$C48,\" \")","v":" "},46,null,0]
[{"$f":"IF(F50=[1]يونيو!$J49,\"ok\",\"error\")","v":"ok"},{"$f":"F50-[1]يونيو!$J49","v":0},{"$f":"IF([1]يونيو!$J49>0,[1]يونيو!$C49,\" \")","v":" "},47,null,0]
[{"$f":"IF(F51=[1]يونيو!$J50,\"ok\",\"error\")","v":"ok"},{"$f":"F51-[1]يونيو!$J50","v":0},{"$f":"IF([1]يونيو!$J50>0,[1]يونيو!$C50,\" \")","v":" "},48,null,0]
[{"$f":"IF(F52=[1]يونيو!$J51,\"ok\",\"error\")","v":"ok"},{"$f":"F52-[1]يونيو!$J51","v":0},{"$f":"IF([1]يونيو!$J51>0,[1]يونيو!$C51,\" \")","v":" "},49,null,0]
[{"$f":"IF(F53=[1]يونيو!$J52,\"ok\",\"error\")","v":"ok"},{"$f":"F53-[1]يونيو!$J52","v":0},{"$f":"IF([1]يونيو!$J52>0,[1]يونيو!$C52,\" \")","v":" "},50,null,0]
[{"$f":"IF(F54=[1]يونيو!$J53,\"ok\",\"error\")","v":"ok"},{"$f":"F54-[1]يونيو!$J53","v":0},{"$f":"IF([1]يونيو!$J53>0,[1]يونيو!$C53,\" \")","v":" "},51,null,0]
[{"$f":"IF(F55=[1]يونيو!$J54,\"ok\",\"error\")","v":"ok"},{"$f":"F55-[1]يونيو!$J54","v":0},{"$f":"IF([1]يونيو!$J54>0,[1]يونيو!$C54,\" \")","v":" "},52,null,0]
[{"$f":"IF(F56=[1]يونيو!$J55,\"ok\",\"error\")","v":"ok"},{"$f":"F56-[1]يونيو!$J55","v":0},{"$f":"IF([1]يونيو!$J55>0,[1]يونيو!$C55,\" \")","v":" "},53,null,0]
[{"$f":"IF(F57=[1]يونيو!$J56,\"ok\",\"error\")","v":"ok"},{"$f":"F57-[1]يونيو!$J56","v":0},{"$f":"IF([1]يونيو!$J56>0,[1]يونيو!$C56,\" \")","v":" "},54,null,0]
[{"$f":"IF(F58=[1]يونيو!$J57,\"ok\",\"error\")","v":"ok"},{"$f":"F58-[1]يونيو!$J57","v":0},{"$f":"IF([1]يونيو!$J57>0,[1]يونيو!$C57,\" \")","v":" "},55,null,0]
[{"$f":"IF(F59=[1]يونيو!$J58,\"ok\",\"error\")","v":"ok"},{"$f":"F59-[1]يونيو!$J58","v":0},{"$f":"IF([1]يونيو!$J58>0,[1]يونيو!$C58,\" \")","v":" "},56,null,0]
[{"$f":"IF(F60=[1]يونيو!$J59,\"ok\",\"error\")","v":"ok"},{"$f":"F60-[1]يونيو!$J59","v":0},{"$f":"IF([1]يونيو!$J59>0,[1]يونيو!$C59,\" \")","v":" "},57,null,0]
[{"$f":"IF(F61=[1]يونيو!$J60,\"ok\",\"error\")","v":"ok"},{"$f":"F61-[1]يونيو!$J60","v":0},{"$f":"IF([1]يونيو!$J60>0,[1]يونيو!$C60,\" \")","v":" "},58,null,0]
[{"$f":"IF(F62=[1]يونيو!$J61,\"ok\",\"error\")","v":"ok"},{"$f":"F62-[1]يونيو!$J61","v":0},{"$f":"IF([1]يونيو!$J61>0,[1]يونيو!$C61,\" \")","v":" "},59,null,0]
[{"$f":"IF(F63=[1]يونيو!$J62,\"ok\",\"error\")","v":"ok"},{"$f":"F63-[1]يونيو!$J62","v":0},{"$f":"IF([1]يونيو!$J62>0,[1]يونيو!$C62,\" \")","v":" "},60,null,0]
[{"$f":"IF(F64=[1]يونيو!$J63,\"ok\",\"error\")","v":"ok"},{"$f":"F64-[1]يونيو!$J63","v":0},{"$f":"IF([1]يونيو!$J63>0,[1]يونيو!$C63,\" \")","v":" "},61,null,0]
[{"$f":"IF(F65=[1]يونيو!$J64,\"ok\",\"error\")","v":"ok"},{"$f":"F65-[1]يونيو!$J64","v":0},{"$f":"IF([1]يونيو!$J64>0,[1]يونيو!$C64,\" \")","v":" "},62,null,0]
[{"$f":"IF(F66=[1]يونيو!$J65,\"ok\",\"error\")","v":"ok"},{"$f":"F66-[1]يونيو!$J65","v":0},{"$f":"IF([1]يونيو!$J65>0,[1]يونيو!$C65,\" \")","v":" "},63,null,0]
[{"$f":"IF(F67=[1]يونيو!$J66,\"ok\",\"error\")","v":"ok"},{"$f":"F67-[1]يونيو!$J66","v":0},{"$f":"IF([1]يونيو!$J66>0,[1]يونيو!$C66,\" \")","v":" "},64,null,0]
[{"$f":"IF(F68=[1]يونيو!$J67,\"ok\",\"error\")","v":"ok"},{"$f":"F68-[1]يونيو!$J67","v":0},{"$f":"IF([1]يونيو!$J67>0,[1]يونيو!$C67,\" \")","v":" "},65,null,{"$f":"SUM(G68:AX68)","v":0}]
[{"$f":"IF(F69=[1]يونيو!$J68,\"ok\",\"error\")","v":"ok"},{"$f":"F69-[1]يونيو!$J68","v":0},{"$f":"IF([1]يونيو!$J68>0,[1]يونيو!$C68,\" \")","v":" "},66,null,0]
[{"$f":"IF(F70=[1]يونيو!$J69,\"ok\",\"error\")","v":"ok"},{"$f":"F70-[1]يونيو!$J69","v":0},{"$f":"IF([1]يونيو!$J69>0,[1]يونيو!$C69,\" \")","v":" "},67,null,0]
[{"$f":"IF(F71=[1]يونيو!$J70,\"ok\",\"error\")","v":"ok"},{"$f":"F71-[1]يونيو!$J70","v":0},{"$f":"IF([1]يونيو!$J70>0,[1]يونيو!$C70,\" \")","v":" "},68,null,0]
[{"$f":"IF(F72=[1]يونيو!$J71,\"ok\",\"error\")","v":"ok"},{"$f":"F72-[1]يونيو!$J71","v":0},{"$f":"IF([1]يونيو!$J71>0,[1]يونيو!$C71,\" \")","v":" "},69,null,0]
[{"$f":"IF(F73=[1]يونيو!$J72,\"ok\",\"error\")","v":"ok"},{"$f":"F73-[1]يونيو!$J72","v":0},{"$f":"IF([1]يونيو!$J72>0,[1]يونيو!$C72,\" \")","v":" "},70,null,0]
[{"$f":"IF(F74=[1]يونيو!$J73,\"ok\",\"error\")","v":"ok"},{"$f":"F74-[1]يونيو!$J73","v":0},{"$f":"IF([1]يونيو!$J73>0,[1]يونيو!$C73,\" \")","v":" "},71,null,0]
[{"$f":"IF(F75=[1]يونيو!$J74,\"ok\",\"error\")","v":"ok"},{"$f":"F75-[1]يونيو!$J74","v":0},{"$f":"IF([1]يونيو!$J74>0,[1]يونيو!$C74,\" \")","v":" "},72,null,0]
[{"$f":"IF(F76=[1]يونيو!$J75,\"ok\",\"error\")","v":"ok"},{"$f":"F76-[1]يونيو!$J75","v":0},{"$f":"IF([1]يونيو!$J75>0,[1]يونيو!$C75,\" \")","v":" "},73,null,0]
[{"$f":"IF(F77=[1]يونيو!$J76,\"ok\",\"error\")","v":"ok"},{"$f":"F77-[1]يونيو!$J76","v":0},{"$f":"IF([1]يونيو!$J76>0,[1]يونيو!$C76,\" \")","v":" "},74,null,0]
[{"$f":"IF(F78=[1]يونيو!$J77,\"ok\",\"error\")","v":"ok"},{"$f":"F78-[1]يونيو!$J77","v":0},{"$f":"IF([1]يونيو!$J77>0,[1]يونيو!$C77,\" \")","v":" "},75,null,0]
[{"$f":"IF(F79=[1]يونيو!$J78,\"ok\",\"error\")","v":"ok"},{"$f":"F79-[1]يونيو!$J78","v":0},{"$f":"IF([1]يونيو!$J78>0,[1]يونيو!$C78,\" \")","v":" "},76,null,0]
[{"$f":"IF(F80=[1]يونيو!$J79,\"ok\",\"error\")","v":"ok"},{"$f":"F80-[1]يونيو!$J79","v":0},{"$f":"IF([1]يونيو!$J79>0,[1]يونيو!$C79,\" \")","v":" "},77,null,0]
[{"$f":"IF(F81=[1]يونيو!$J80,\"ok\",\"error\")","v":"ok"},{"$f":"F81-[1]يونيو!$J80","v":0},{"$f":"IF([1]يونيو!$J80>0,[1]يونيو!$C80,\" \")","v":" "},78,null,0]
[{"$f":"IF(F82=[1]يونيو!$J81,\"ok\",\"error\")","v":"ok"},{"$f":"F82-[1]يونيو!$J81","v":0},{"$f":"IF([1]يونيو!$J81>0,[1]يونيو!$C81,\" \")","v":" "},79,null,0]
[{"$f":"IF(F83=[1]يونيو!$J82,\"ok\",\"error\")","v":"ok"},{"$f":"F83-[1]يونيو!$J82","v":0},{"$f":"IF([1]يونيو!$J82>0,[1]يونيو!$C82,\" \")","v":" "},80,null,0]
[{"$f":"IF(F84=[1]يونيو!$J83,\"ok\",\"error\")","v":"ok"},{"$f":"F84-[1]يونيو!$J83","v":0},{"$f":"IF([1]يونيو!$J83>0,[1]يونيو!$C83,\" \")","v":" "},81,null,0]
[{"$f":"IF(F85=[1]يونيو!$J84,\"ok\",\"error\")","v":"ok"},{"$f":"F85-[1]يونيو!$J84","v":0},{"$f":"IF([1]يونيو!$J84>0,[1]يونيو!$C84,\" \")","v":" "},82,null,0]
[{"$f":"IF(F86=[1]يونيو!$J85,\"ok\",\"error\")","v":"ok"},{"$f":"F86-[1]يونيو!$J85","v":0},{"$f":"IF([1]يونيو!$J85>0,[1]يونيو!$C85,\" \")","v":" "},83,null,0]
[{"$f":"IF(F87=[1]يونيو!$J86,\"ok\",\"error\")","v":"ok"},{"$f":"F87-[1]يونيو!$J86","v":0},{"$f":"IF([1]يونيو!$J86>0,[1]يونيو!$C86,\" \")","v":" "},84,null,0]
[{"$f":"IF(F88=[1]يونيو!$J87,\"ok\",\"error\")","v":"ok"},{"$f":"F88-[1]يونيو!$J87","v":0},{"$f":"IF([1]يونيو!$J87>0,[1]يونيو!$C87,\" \")","v":" "},85,null,0]
[{"$f":"IF(F89=[1]يونيو!$J88,\"ok\",\"error\")","v":"ok"},{"$f":"F89-[1]يونيو!$J88","v":0},{"$f":"IF([1]يونيو!$J88>0,[1]يونيو!$C88,\" \")","v":" "},86,null,0]
[{"$f":"IF(F90=[1]يونيو!$J89,\"ok\",\"error\")","v":"ok"},{"$f":"F90-[1]يونيو!$J89","v":0},{"$f":"IF([1]يونيو!$J89>0,[1]يونيو!$C89,\" \")","v":" "},87,null,0]
[{"$f":"IF(F91=[1]يونيو!$J90,\"ok\",\"error\")","v":"ok"},{"$f":"F91-[1]يونيو!$J90","v":0},{"$f":"IF([1]يونيو!$J90>0,[1]يونيو!$C90,\" \")","v":" "},88,null,0]
[{"$f":"IF(F92=[1]يونيو!$J91,\"ok\",\"error\")","v":"ok"},{"$f":"F92-[1]يونيو!$J91","v":0},{"$f":"IF([1]يونيو!$J91>0,[1]يونيو!$C91,\" \")","v":" "},89,null,0]
[{"$f":"IF(F93=[1]يونيو!$J92,\"ok\",\"error\")","v":"ok"},{"$f":"F93-[1]يونيو!$J92","v":0},{"$f":"IF([1]يونيو!$J92>0,[1]يونيو!$C92,\" \")","v":" "},90,null,0]
[{"$f":"IF(F94=[1]يونيو!$J93,\"ok\",\"error\")","v":"ok"},{"$f":"F94-[1]يونيو!$J93","v":0},{"$f":"IF([1]يونيو!$J93>0,[1]يونيو!$C93,\" \")","v":" "},91,null,0]
[{"$f":"IF(F95=[1]يونيو!$J94,\"ok\",\"error\")","v":"ok"},{"$f":"F95-[1]يونيو!$J94","v":0},{"$f":"IF([1]يونيو!$J94>0,[1]يونيو!$C94,\" \")","v":" "},92,null,0]
[{"$f":"IF(F96=[1]يونيو!$J95,\"ok\",\"error\")","v":"ok"},{"$f":"F96-[1]يونيو!$J95","v":0},{"$f":"IF([1]يونيو!$J95>0,[1]يونيو!$C95,\" \")","v":" "},93,null,0]
[{"$f":"IF(F97=[1]يونيو!$J96,\"ok\",\"error\")","v":"ok"},{"$f":"F97-[1]يونيو!$J96","v":0},{"$f":"IF([1]يونيو!$J96>0,[1]يونيو!$C96,\" \")","v":" "},94,null,0]
[{"$f":"IF(F98=[1]يونيو!$J97,\"ok\",\"error\")","v":"ok"},{"$f":"F98-[1]يونيو!$J97","v":0},{"$f":"IF([1]يونيو!$J97>0,[1]يونيو!$C97,\" \")","v":" "},95,null,0]
[{"$f":"IF(F99=[1]يونيو!$J98,\"ok\",\"error\")","v":"ok"},{"$f":"F99-[1]يونيو!$J98","v":0},{"$f":"IF([1]يونيو!$J98>0,[1]يونيو!$C98,\" \")","v":" "},96,null,0]
[{"$f":"IF(F100=[1]يونيو!$J99,\"ok\",\"error\")","v":"ok"},{"$f":"F100-[1]يونيو!$J99","v":0},{"$f":"IF([1]يونيو!$J99>0,[1]يونيو!$C99,\" \")","v":" "},97,null,{"$f":"SUM(G100:AX100)","v":0}]
[{"$f":"IF(F101=[1]يونيو!$J100,\"ok\",\"error\")","v":"ok"},{"$f":"F101-[1]يونيو!$J100","v":0},{"$f":"IF([1]يونيو!$J100>0,[1]يونيو!$C100,\" \")","v":" "},98,null,{"$f":"SUM(G101:AX101)","v":0}]
[{"$f":"IF(F102=[1]يونيو!$J101,\"ok\",\"error\")","v":"ok"},{"$f":"F102-[1]يونيو!$J101","v":0},{"$f":"IF([1]يونيو!$J101>0,[1]يونيو!$C101,\" \")","v":" "},99,null,{"$f":"SUM(G102:AX102)","v":0}]
[{"$f":"IF(F103=[1]يونيو!$J102,\"ok\",\"error\")","v":"ok"},{"$f":"F103-[1]يونيو!$J102","v":0},{"$f":"IF([1]يونيو!$J102>0,[1]يونيو!$C102,\" \")","v":" "},100,null,{"$f":"SUM(G103:AX103)","v":0}]
[{"$f":"IF(F104=[1]يونيو!$J103,\"ok\",\"error\")","v":"ok"},{"$f":"F104-[1]يونيو!$J103","v":0},"الإجمالى",null,null,{"$f":"SUM(F4:F103)","v":0},0,0,0,0,0,0,0,0,0,0,0,0,0,0,0,0,0,0,0,0,0,0,0,0,0,0,0,0,0]
[]
[null,null,null,null,"؟",{"$f":"F104-[1]يونيو!$J$103","v":0}]

{"sheet":"يوليو","index":6,"n_rows":106,"n_cols":35,"rows_kept":106,"cut":false,"hidden":false,"merged":[[1,7,2,7],[1,9,2,9],[103,2,103,4],[1,2,2,2],[1,3,2,3],[1,4,2,4],[1,5,2,5],[1,6,2,6],[1,22,2,22],[1,11,2,11],[1,12,2,12],[1,13,2,13],[1,14,2,14],[1,15,2,15],[1,16,2,16],[1,17,2,17],[1,18,2,18],[1,19,2,19],[1,20,2,20],[1,21,2,21],[1,33,2,33],[1,26,2,26],[1,27,2,27],[1,28,2,28],[1,29,2,29],[0,2,0,14],[1,0,2,1],[1,38,2,38],[1,39,2,39],[1,10,2,10],[1,8,2,8],[1,34,2,34],[1,35,2,35],[1,36,2,36],[1,37,2,37],[1,30,2,30],[1,23,2,23],[1,24,2,24],[1,25,2,25],[1,31,2,31],[1,32,2,32]]}
[null,null,"تحليـــــــــــــــــل مصـــــــــــــــروفات التشغيـــــــــــــــل عن شهـــــــــر يولــــــــــيو لعام 201"]
["OR",null,"التاريخ","رقم القيد","البيان","الإجمالى",{"$f":"يونيو!G2","v":"صيانة\nواصلاح\nوقطع غيار"},{"$f":"يونيو!H2","v":"خامات تشغيل"},{"$f":"يونيو!I2","v":"م سيارات"},{"$f":"يونيو!J2","v":"كهرباء"},{"$f":"يونيو!K2","v":"م نظافة"},{"$f":"يونيو!L2","v":"مياه"},{"$f":"يونيو!M2","v":"تأمينات"},{"$f":"يونيو!N2","v":"أجور"},{"$f":"يونيو!O2","v":0},{"$f":"يونيو!P2","v":0},{"$f":"يونيو!Q2","v":0},{"$f":"يونيو!R2","v":0},{"$f":"يونيو!S2","v":0},{"$f":"يونيو!T2","v":0},{"$f":"يونيو!U2","v":0},{"$f":"يونيو!V2","v":0},{"$f":"يونيو!W2","v":0},{"$f":"يونيو!X2","v":0},{"$f":"يونيو!Y2","v":0},{"$f":"يونيو!Z2","v":0},{"$f":"يونيو!AA2","v":0},{"$f":"يونيو!AB2","v":0},{"$f":"يونيو!AC2","v":0},{"$f":"يونيو!AD2","v":0}]
[]
[{"$f":"IF(F4=[1]يوليو!$J3,\"ok\",\"error\")","v":"ok"},{"$f":"F4-[1]يوليو!$J3","v":0},{"$f":"IF([1]يوليو!$J3>0,[1]يوليو!$C3,\" \")","v":" "},1,null,{"$f":"SUM(G4:AX4)","v":0}]
[{"$f":"IF(F5=[1]يوليو!$J4,\"ok\",\"error\")","v":"ok"},{"$f":"F5-[1]يوليو!$J4","v":0},{"$f":"IF([1]يوليو!$J4>0,[1]يوليو!$C4,\" \")","v":" "},2,null,0]
[{"$f":"IF(F6=[1]يوليو!$J5,\"ok\",\"error\")","v":"ok"},{"$f":"F6-[1]يوليو!$J5","v":0},{"$f":"IF([1]يوليو!$J5>0,[1]يوليو!$C5,\" \")","v":" "},3,null,0]
[{"$f":"IF(F7=[1]يوليو!$J6,\"ok\",\"error\")","v":"ok"},{"$f":"F7-[1]يوليو!$J6","v":0},{"$f":"IF([1]يوليو!$J6>0,[1]يوليو!$C6,\" \")","v":" "},4,null,0]
[{"$f":"IF(F8=[1]يوليو!$J7,\"ok\",\"error\")","v":"ok"},{"$f":"F8-[1]يوليو!$J7","v":0},{"$f":"IF([1]يوليو!$J7>0,[1]يوليو!$C7,\" \")","v":" "},5,null,0]
[{"$f":"IF(F9=[1]يوليو!$J8,\"ok\",\"error\")","v":"ok"},{"$f":"F9-[1]يوليو!$J8","v":0},{"$f":"IF([1]يوليو!$J8>0,[1]يوليو!$C8,\" \")","v":" "},6,null,0]
[{"$f":"IF(F10=[1]يوليو!$J9,\"ok\",\"error\")","v":"ok"},{"$f":"F10-[1]يوليو!$J9","v":0},{"$f":"IF([1]يوليو!$J9>0,[1]يوليو!$C9,\" \")","v":" "},7,null,0]
[{"$f":"IF(F11=[1]يوليو!$J10,\"ok\",\"error\")","v":"ok"},{"$f":"F11-[1]يوليو!$J10","v":0},{"$f":"IF([1]يوليو!$J10>0,[1]يوليو!$C10,\" \")","v":" "},8,null,0]
[{"$f":"IF(F12=[1]يوليو!$J11,\"ok\",\"error\")","v":"ok"},{"$f":"F12-[1]يوليو!$J11","v":0},{"$f":"IF([1]يوليو!$J11>0,[1]يوليو!$C11,\" \")","v":" "},9,null,0]
[{"$f":"IF(F13=[1]يوليو!$J12,\"ok\",\"error\")","v":"ok"},{"$f":"F13-[1]يوليو!$J12","v":0},{"$f":"IF([1]يوليو!$J12>0,[1]يوليو!$C12,\" \")","v":" "},10,null,0]
[{"$f":"IF(F14=[1]يوليو!$J13,\"ok\",\"error\")","v":"ok"},{"$f":"F14-[1]يوليو!$J13","v":0},{"$f":"IF([1]يوليو!$J13>0,[1]يوليو!$C13,\" \")","v":" "},11,null,0]
[{"$f":"IF(F15=[1]يوليو!$J14,\"ok\",\"error\")","v":"ok"},{"$f":"F15-[1]يوليو!$J14","v":0},{"$f":"IF([1]يوليو!$J14>0,[1]يوليو!$C14,\" \")","v":" "},12,null,0]
[{"$f":"IF(F16=[1]يوليو!$J15,\"ok\",\"error\")","v":"ok"},{"$f":"F16-[1]يوليو!$J15","v":0},{"$f":"IF([1]يوليو!$J15>0,[1]يوليو!$C15,\" \")","v":" "},13,null,0]
[{"$f":"IF(F17=[1]يوليو!$J16,\"ok\",\"error\")","v":"ok"},{"$f":"F17-[1]يوليو!$J16","v":0},{"$f":"IF([1]يوليو!$J16>0,[1]يوليو!$C16,\" \")","v":" "},14,null,0]
[{"$f":"IF(F18=[1]يوليو!$J17,\"ok\",\"error\")","v":"ok"},{"$f":"F18-[1]يوليو!$J17","v":0},{"$f":"IF([1]يوليو!$J17>0,[1]يوليو!$C17,\" \")","v":" "},15,null,0]
[{"$f":"IF(F19=[1]يوليو!$J18,\"ok\",\"error\")","v":"ok"},{"$f":"F19-[1]يوليو!$J18","v":0},{"$f":"IF([1]يوليو!$J18>0,[1]يوليو!$C18,\" \")","v":" "},16,null,0]
[{"$f":"IF(F20=[1]يوليو!$J19,\"ok\",\"error\")","v":"ok"},{"$f":"F20-[1]يوليو!$J19","v":0},{"$f":"IF([1]يوليو!$J19>0,[1]يوليو!$C19,\" \")","v":" "},17,null,0]
[{"$f":"IF(F21=[1]يوليو!$J20,\"ok\",\"error\")","v":"ok"},{"$f":"F21-[1]يوليو!$J20","v":0},{"$f":"IF([1]يوليو!$J20>0,[1]يوليو!$C20,\" \")","v":" "},18,null,0]
[{"$f":"IF(F22=[1]يوليو!$J21,\"ok\",\"error\")","v":"ok"},{"$f":"F22-[1]يوليو!$J21","v":0},{"$f":"IF([1]يوليو!$J21>0,[1]يوليو!$C21,\" \")","v":" "},19,null,0]
[{"$f":"IF(F23=[1]يوليو!$J22,\"ok\",\"error\")","v":"ok"},{"$f":"F23-[1]يوليو!$J22","v":0},{"$f":"IF([1]يوليو!$J22>0,[1]يوليو!$C22,\" \")","v":" "},20,null,0]
[{"$f":"IF(F24=[1]يوليو!$J23,\"ok\",\"error\")","v":"ok"},{"$f":"F24-[1]يوليو!$J23","v":0},{"$f":"IF([1]يوليو!$J23>0,[1]يوليو!$C23,\" \")","v":" "},21,null,0]
[{"$f":"IF(F25=[1]يوليو!$J24,\"ok\",\"error\")","v":"ok"},{"$f":"F25-[1]يوليو!$J24","v":0},{"$f":"IF([1]يوليو!$J24>0,[1]يوليو!$C24,\" \")","v":" "},22,null,0]
[{"$f":"IF(F26=[1]يوليو!$J25,\"ok\",\"error\")","v":"ok"},{"$f":"F26-[1]يوليو!$J25","v":0},{"$f":"IF([1]يوليو!$J25>0,[1]يوليو!$C25,\" \")","v":" "},23,null,0]
[{"$f":"IF(F27=[1]يوليو!$J26,\"ok\",\"error\")","v":"ok"},{"$f":"F27-[1]يوليو!$J26","v":0},{"$f":"IF([1]يوليو!$J26>0,[1]يوليو!$C26,\" \")","v":" "},24,null,0]
[{"$f":"IF(F28=[1]يوليو!$J27,\"ok\",\"error\")","v":"ok"},{"$f":"F28-[1]يوليو!$J27","v":0},{"$f":"IF([1]يوليو!$J27>0,[1]يوليو!$C27,\" \")","v":" "},25,null,0]
[{"$f":"IF(F29=[1]يوليو!$J28,\"ok\",\"error\")","v":"ok"},{"$f":"F29-[1]يوليو!$J28","v":0},{"$f":"IF([1]يوليو!$J28>0,[1]يوليو!$C28,\" \")","v":" "},26,null,0]
[{"$f":"IF(F30=[1]يوليو!$J29,\"ok\",\"error\")","v":"ok"},{"$f":"F30-[1]يوليو!$J29","v":0},{"$f":"IF([1]يوليو!$J29>0,[1]يوليو!$C29,\" \")","v":" "},27,null,0]
[{"$f":"IF(F31=[1]يوليو!$J30,\"ok\",\"error\")","v":"ok"},{"$f":"F31-[1]يوليو!$J30","v":0},{"$f":"IF([1]يوليو!$J30>0,[1]يوليو!$C30,\" \")","v":" "},28,null,0]
[{"$f":"IF(F32=[1]يوليو!$J31,\"ok\",\"error\")","v":"ok"},{"$f":"F32-[1]يوليو!$J31","v":0},{"$f":"IF([1]يوليو!$J31>0,[1]يوليو!$C31,\" \")","v":" "},29,null,0]
[{"$f":"IF(F33=[1]يوليو!$J32,\"ok\",\"error\")","v":"ok"},{"$f":"F33-[1]يوليو!$J32","v":0},{"$f":"IF([1]يوليو!$J32>0,[1]يوليو!$C32,\" \")","v":" "},30,null,0]
[{"$f":"IF(F34=[1]يوليو!$J33,\"ok\",\"error\")","v":"ok"},{"$f":"F34-[1]يوليو!$J33","v":0},{"$f":"IF([1]يوليو!$J33>0,[1]يوليو!$C33,\" \")","v":" "},31,null,0]
[{"$f":"IF(F35=[1]يوليو!$J34,\"ok\",\"error\")","v":"ok"},{"$f":"F35-[1]يوليو!$J34","v":0},{"$f":"IF([1]يوليو!$J34>0,[1]يوليو!$C34,\" \")","v":" "},32,null,0]
[{"$f":"IF(F36=[1]يوليو!$J35,\"ok\",\"error\")","v":"ok"},{"$f":"F36-[1]يوليو!$J35","v":0},{"$f":"IF([1]يوليو!$J35>0,[1]يوليو!$C35,\" \")","v":" "},33,null,{"$f":"SUM(G36:AX36)","v":0}]
[{"$f":"IF(F37=[1]يوليو!$J36,\"ok\",\"error\")","v":"ok"},{"$f":"F37-[1]يوليو!$J36","v":0},{"$f":"IF([1]يوليو!$J36>0,[1]يوليو!$C36,\" \")","v":" "},34,null,0]
[{"$f":"IF(F38=[1]يوليو!$J37,\"ok\",\"error\")","v":"ok"},{"$f":"F38-[1]يوليو!$J37","v":0},{"$f":"IF([1]يوليو!$J37>0,[1]يوليو!$C37,\" \")","v":" "},35,null,0]
[{"$f":"IF(F39=[1]يوليو!$J38,\"ok\",\"error\")","v":"ok"},{"$f":"F39-[1]يوليو!$J38","v":0},{"$f":"IF([1]يوليو!$J38>0,[1]يوليو!$C38,\" \")","v":" "},36,null,0]
[{"$f":"IF(F40=[1]يوليو!$J39,\"ok\",\"error\")","v":"ok"},{"$f":"F40-[1]يوليو!$J39","v":0},{"$f":"IF([1]يوليو!$J39>0,[1]يوليو!$C39,\" \")","v":" "},37,null,0]
[{"$f":"IF(F41=[1]يوليو!$J40,\"ok\",\"error\")","v":"ok"},{"$f":"F41-[1]يوليو!$J40","v":0},{"$f":"IF([1]يوليو!$J40>0,[1]يوليو!$C40,\" \")","v":" "},38,null,0]
[{"$f":"IF(F42=[1]يوليو!$J41,\"ok\",\"error\")","v":"ok"},{"$f":"F42-[1]يوليو!$J41","v":0},{"$f":"IF([1]يوليو!$J41>0,[1]يوليو!$C41,\" \")","v":" "},39,null,0]
[{"$f":"IF(F43=[1]يوليو!$J42,\"ok\",\"error\")","v":"ok"},{"$f":"F43-[1]يوليو!$J42","v":0},{"$f":"IF([1]يوليو!$J42>0,[1]يوليو!$C42,\" \")","v":" "},40,null,0]
[{"$f":"IF(F44=[1]يوليو!$J43,\"ok\",\"error\")","v":"ok"},{"$f":"F44-[1]يوليو!$J43","v":0},{"$f":"IF([1]يوليو!$J43>0,[1]يوليو!$C43,\" \")","v":" "},41,null,0]
[{"$f":"IF(F45=[1]يوليو!$J44,\"ok\",\"error\")","v":"ok"},{"$f":"F45-[1]يوليو!$J44","v":0},{"$f":"IF([1]يوليو!$J44>0,[1]يوليو!$C44,\" \")","v":" "},42,null,0]
[{"$f":"IF(F46=[1]يوليو!$J45,\"ok\",\"error\")","v":"ok"},{"$f":"F46-[1]يوليو!$J45","v":0},{"$f":"IF([1]يوليو!$J45>0,[1]يوليو!$C45,\" \")","v":" "},43,null,0]
[{"$f":"IF(F47=[1]يوليو!$J46,\"ok\",\"error\")","v":"ok"},{"$f":"F47-[1]يوليو!$J46","v":0},{"$f":"IF([1]يوليو!$J46>0,[1]يوليو!$C46,\" \")","v":" "},44,null,0]
[{"$f":"IF(F48=[1]يوليو!$J47,\"ok\",\"error\")","v":"ok"},{"$f":"F48-[1]يوليو!$J47","v":0},{"$f":"IF([1]يوليو!$J47>0,[1]يوليو!$C47,\" \")","v":" "},45,null,0]
[{"$f":"IF(F49=[1]يوليو!$J48,\"ok\",\"error\")","v":"ok"},{"$f":"F49-[1]يوليو!$J48","v":0},{"$f":"IF([1]يوليو!$J48>0,[1]يوليو!$C48,\" \")","v":" "},46,null,0]
[{"$f":"IF(F50=[1]يوليو!$J49,\"ok\",\"error\")","v":"ok"},{"$f":"F50-[1]يوليو!$J49","v":0},{"$f":"IF([1]يوليو!$J49>0,[1]يوليو!$C49,\" \")","v":" "},47,null,0]
[{"$f":"IF(F51=[1]يوليو!$J50,\"ok\",\"error\")","v":"ok"},{"$f":"F51-[1]يوليو!$J50","v":0},{"$f":"IF([1]يوليو!$J50>0,[1]يوليو!$C50,\" \")","v":" "},48,null,0]
[{"$f":"IF(F52=[1]يوليو!$J51,\"ok\",\"error\")","v":"ok"},{"$f":"F52-[1]يوليو!$J51","v":0},{"$f":"IF([1]يوليو!$J51>0,[1]يوليو!$C51,\" \")","v":" "},49,null,0]
[{"$f":"IF(F53=[1]يوليو!$J52,\"ok\",\"error\")","v":"ok"},{"$f":"F53-[1]يوليو!$J52","v":0},{"$f":"IF([1]يوليو!$J52>0,[1]يوليو!$C52,\" \")","v":" "},50,null,0]
[{"$f":"IF(F54=[1]يوليو!$J53,\"ok\",\"error\")","v":"ok"},{"$f":"F54-[1]يوليو!$J53","v":0},{"$f":"IF([1]يوليو!$J53>0,[1]يوليو!$C53,\" \")","v":" "},51,null,0]
[{"$f":"IF(F55=[1]يوليو!$J54,\"ok\",\"error\")","v":"ok"},{"$f":"F55-[1]يوليو!$J54","v":0},{"$f":"IF([1]يوليو!$J54>0,[1]يوليو!$C54,\" \")","v":" "},52,null,0]
[{"$f":"IF(F56=[1]يوليو!$J55,\"ok\",\"error\")","v":"ok"},{"$f":"F56-[1]يوليو!$J55","v":0},{"$f":"IF([1]يوليو!$J55>0,[1]يوليو!$C55,\" \")","v":" "},53,null,0]
[{"$f":"IF(F57=[1]يوليو!$J56,\"ok\",\"error\")","v":"ok"},{"$f":"F57-[1]يوليو!$J56","v":0},{"$f":"IF([1]يوليو!$J56>0,[1]يوليو!$C56,\" \")","v":" "},54,null,0]
[{"$f":"IF(F58=[1]يوليو!$J57,\"ok\",\"error\")","v":"ok"},{"$f":"F58-[1]يوليو!$J57","v":0},{"$f":"IF([1]يوليو!$J57>0,[1]يوليو!$C57,\" \")","v":" "},55,null,0]
[{"$f":"IF(F59=[1]يوليو!$J58,\"ok\",\"error\")","v":"ok"},{"$f":"F59-[1]يوليو!$J58","v":0},{"$f":"IF([1]يوليو!$J58>0,[1]يوليو!$C58,\" \")","v":" "},56,null,0]
[{"$f":"IF(F60=[1]يوليو!$J59,\"ok\",\"error\")","v":"ok"},{"$f":"F60-[1]يوليو!$J59","v":0},{"$f":"IF([1]يوليو!$J59>0,[1]يوليو!$C59,\" \")","v":" "},57,null,0]
[{"$f":"IF(F61=[1]يوليو!$J60,\"ok\",\"error\")","v":"ok"},{"$f":"F61-[1]يوليو!$J60","v":0},{"$f":"IF([1]يوليو!$J60>0,[1]يوليو!$C60,\" \")","v":" "},58,null,0]
[{"$f":"IF(F62=[1]يوليو!$J61,\"ok\",\"error\")","v":"ok"},{"$f":"F62-[1]يوليو!$J61","v":0},{"$f":"IF([1]يوليو!$J61>0,[1]يوليو!$C61,\" \")","v":" "},59,null,0]
[{"$f":"IF(F63=[1]يوليو!$J62,\"ok\",\"error\")","v":"ok"},{"$f":"F63-[1]يوليو!$J62","v":0},{"$f":"IF([1]يوليو!$J62>0,[1]يوليو!$C62,\" \")","v":" "},60,null,0]
[{"$f":"IF(F64=[1]يوليو!$J63,\"ok\",\"error\")","v":"ok"},{"$f":"F64-[1]يوليو!$J63","v":0},{"$f":"IF([1]يوليو!$J63>0,[1]يوليو!$C63,\" \")","v":" "},61,null,0]
[{"$f":"IF(F65=[1]يوليو!$J64,\"ok\",\"error\")","v":"ok"},{"$f":"F65-[1]يوليو!$J64","v":0},{"$f":"IF([1]يوليو!$J64>0,[1]يوليو!$C64,\" \")","v":" "},62,null,0]
[{"$f":"IF(F66=[1]يوليو!$J65,\"ok\",\"error\")","v":"ok"},{"$f":"F66-[1]يوليو!$J65","v":0},{"$f":"IF([1]يوليو!$J65>0,[1]يوليو!$C65,\" \")","v":" "},63,null,0]
[{"$f":"IF(F67=[1]يوليو!$J66,\"ok\",\"error\")","v":"ok"},{"$f":"F67-[1]يوليو!$J66","v":0},{"$f":"IF([1]يوليو!$J66>0,[1]يوليو!$C66,\" \")","v":" "},64,null,0]
[{"$f":"IF(F68=[1]يوليو!$J67,\"ok\",\"error\")","v":"ok"},{"$f":"F68-[1]يوليو!$J67","v":0},{"$f":"IF([1]يوليو!$J67>0,[1]يوليو!$C67,\" \")","v":" "},65,null,{"$f":"SUM(G68:AX68)","v":0}]
[{"$f":"IF(F69=[1]يوليو!$J68,\"ok\",\"error\")","v":"ok"},{"$f":"F69-[1]يوليو!$J68","v":0},{"$f":"IF([1]يوليو!$J68>0,[1]يوليو!$C68,\" \")","v":" "},66,null,0]
[{"$f":"IF(F70=[1]يوليو!$J69,\"ok\",\"error\")","v":"ok"},{"$f":"F70-[1]يوليو!$J69","v":0},{"$f":"IF([1]يوليو!$J69>0,[1]يوليو!$C69,\" \")","v":" "},67,null,0]
[{"$f":"IF(F71=[1]يوليو!$J70,\"ok\",\"error\")","v":"ok"},{"$f":"F71-[1]يوليو!$J70","v":0},{"$f":"IF([1]يوليو!$J70>0,[1]يوليو!$C70,\" \")","v":" "},68,null,0]
[{"$f":"IF(F72=[1]يوليو!$J71,\"ok\",\"error\")","v":"ok"},{"$f":"F72-[1]يوليو!$J71","v":0},{"$f":"IF([1]يوليو!$J71>0,[1]يوليو!$C71,\" \")","v":" "},69,null,0]
[{"$f":"IF(F73=[1]يوليو!$J72,\"ok\",\"error\")","v":"ok"},{"$f":"F73-[1]يوليو!$J72","v":0},{"$f":"IF([1]يوليو!$J72>0,[1]يوليو!$C72,\" \")","v":" "},70,null,0]
[{"$f":"IF(F74=[1]يوليو!$J73,\"ok\",\"error\")","v":"ok"},{"$f":"F74-[1]يوليو!$J73","v":0},{"$f":"IF([1]يوليو!$J73>0,[1]يوليو!$C73,\" \")","v":" "},71,null,0]
[{"$f":"IF(F75=[1]يوليو!$J74,\"ok\",\"error\")","v":"ok"},{"$f":"F75-[1]يوليو!$J74","v":0},{"$f":"IF([1]يوليو!$J74>0,[1]يوليو!$C74,\" \")","v":" "},72,null,0]
[{"$f":"IF(F76=[1]يوليو!$J75,\"ok\",\"error\")","v":"ok"},{"$f":"F76-[1]يوليو!$J75","v":0},{"$f":"IF([1]يوليو!$J75>0,[1]يوليو!$C75,\" \")","v":" "},73,null,0]
[{"$f":"IF(F77=[1]يوليو!$J76,\"ok\",\"error\")","v":"ok"},{"$f":"F77-[1]يوليو!$J76","v":0},{"$f":"IF([1]يوليو!$J76>0,[1]يوليو!$C76,\" \")","v":" "},74,null,0]
[{"$f":"IF(F78=[1]يوليو!$J77,\"ok\",\"error\")","v":"ok"},{"$f":"F78-[1]يوليو!$J77","v":0},{"$f":"IF([1]يوليو!$J77>0,[1]يوليو!$C77,\" \")","v":" "},75,null,0]
[{"$f":"IF(F79=[1]يوليو!$J78,\"ok\",\"error\")","v":"ok"},{"$f":"F79-[1]يوليو!$J78","v":0},{"$f":"IF([1]يوليو!$J78>0,[1]يوليو!$C78,\" \")","v":" "},76,null,0]
[{"$f":"IF(F80=[1]يوليو!$J79,\"ok\",\"error\")","v":"ok"},{"$f":"F80-[1]يوليو!$J79","v":0},{"$f":"IF([1]يوليو!$J79>0,[1]يوليو!$C79,\" \")","v":" "},77,null,0]
[{"$f":"IF(F81=[1]يوليو!$J80,\"ok\",\"error\")","v":"ok"},{"$f":"F81-[1]يوليو!$J80","v":0},{"$f":"IF([1]يوليو!$J80>0,[1]يوليو!$C80,\" \")","v":" "},78,null,0]
[{"$f":"IF(F82=[1]يوليو!$J81,\"ok\",\"error\")","v":"ok"},{"$f":"F82-[1]يوليو!$J81","v":0},{"$f":"IF([1]يوليو!$J81>0,[1]يوليو!$C81,\" \")","v":" "},79,null,0]
[{"$f":"IF(F83=[1]يوليو!$J82,\"ok\",\"error\")","v":"ok"},{"$f":"F83-[1]يوليو!$J82","v":0},{"$f":"IF([1]يوليو!$J82>0,[1]يوليو!$C82,\" \")","v":" "},80,null,0]
[{"$f":"IF(F84=[1]يوليو!$J83,\"ok\",\"error\")","v":"ok"},{"$f":"F84-[1]يوليو!$J83","v":0},{"$f":"IF([1]يوليو!$J83>0,[1]يوليو!$C83,\" \")","v":" "},81,null,0]
[{"$f":"IF(F85=[1]يوليو!$J84,\"ok\",\"error\")","v":"ok"},{"$f":"F85-[1]يوليو!$J84","v":0},{"$f":"IF([1]يوليو!$J84>0,[1]يوليو!$C84,\" \")","v":" "},82,null,0]
[{"$f":"IF(F86=[1]يوليو!$J85,\"ok\",\"error\")","v":"ok"},{"$f":"F86-[1]يوليو!$J85","v":0},{"$f":"IF([1]يوليو!$J85>0,[1]يوليو!$C85,\" \")","v":" "},83,null,0]
[{"$f":"IF(F87=[1]يوليو!$J86,\"ok\",\"error\")","v":"ok"},{"$f":"F87-[1]يوليو!$J86","v":0},{"$f":"IF([1]يوليو!$J86>0,[1]يوليو!$C86,\" \")","v":" "},84,null,0]
[{"$f":"IF(F88=[1]يوليو!$J87,\"ok\",\"error\")","v":"ok"},{"$f":"F88-[1]يوليو!$J87","v":0},{"$f":"IF([1]يوليو!$J87>0,[1]يوليو!$C87,\" \")","v":" "},85,null,0]
[{"$f":"IF(F89=[1]يوليو!$J88,\"ok\",\"error\")","v":"ok"},{"$f":"F89-[1]يوليو!$J88","v":0},{"$f":"IF([1]يوليو!$J88>0,[1]يوليو!$C88,\" \")","v":" "},86,null,0]
[{"$f":"IF(F90=[1]يوليو!$J89,\"ok\",\"error\")","v":"ok"},{"$f":"F90-[1]يوليو!$J89","v":0},{"$f":"IF([1]يوليو!$J89>0,[1]يوليو!$C89,\" \")","v":" "},87,null,0]
[{"$f":"IF(F91=[1]يوليو!$J90,\"ok\",\"error\")","v":"ok"},{"$f":"F91-[1]يوليو!$J90","v":0},{"$f":"IF([1]يوليو!$J90>0,[1]يوليو!$C90,\" \")","v":" "},88,null,0]
[{"$f":"IF(F92=[1]يوليو!$J91,\"ok\",\"error\")","v":"ok"},{"$f":"F92-[1]يوليو!$J91","v":0},{"$f":"IF([1]يوليو!$J91>0,[1]يوليو!$C91,\" \")","v":" "},89,null,0]
[{"$f":"IF(F93=[1]يوليو!$J92,\"ok\",\"error\")","v":"ok"},{"$f":"F93-[1]يوليو!$J92","v":0},{"$f":"IF([1]يوليو!$J92>0,[1]يوليو!$C92,\" \")","v":" "},90,null,0]
[{"$f":"IF(F94=[1]يوليو!$J93,\"ok\",\"error\")","v":"ok"},{"$f":"F94-[1]يوليو!$J93","v":0},{"$f":"IF([1]يوليو!$J93>0,[1]يوليو!$C93,\" \")","v":" "},91,null,0]
[{"$f":"IF(F95=[1]يوليو!$J94,\"ok\",\"error\")","v":"ok"},{"$f":"F95-[1]يوليو!$J94","v":0},{"$f":"IF([1]يوليو!$J94>0,[1]يوليو!$C94,\" \")","v":" "},92,null,0]
[{"$f":"IF(F96=[1]يوليو!$J95,\"ok\",\"error\")","v":"ok"},{"$f":"F96-[1]يوليو!$J95","v":0},{"$f":"IF([1]يوليو!$J95>0,[1]يوليو!$C95,\" \")","v":" "},93,null,0]
[{"$f":"IF(F97=[1]يوليو!$J96,\"ok\",\"error\")","v":"ok"},{"$f":"F97-[1]يوليو!$J96","v":0},{"$f":"IF([1]يوليو!$J96>0,[1]يوليو!$C96,\" \")","v":" "},94,null,0]
[{"$f":"IF(F98=[1]يوليو!$J97,\"ok\",\"error\")","v":"ok"},{"$f":"F98-[1]يوليو!$J97","v":0},{"$f":"IF([1]يوليو!$J97>0,[1]يوليو!$C97,\" \")","v":" "},95,null,0]
[{"$f":"IF(F99=[1]يوليو!$J98,\"ok\",\"error\")","v":"ok"},{"$f":"F99-[1]يوليو!$J98","v":0},{"$f":"IF([1]يوليو!$J98>0,[1]يوليو!$C98,\" \")","v":" "},96,null,0]
[{"$f":"IF(F100=[1]يوليو!$J99,\"ok\",\"error\")","v":"ok"},{"$f":"F100-[1]يوليو!$J99","v":0},{"$f":"IF([1]يوليو!$J99>0,[1]يوليو!$C99,\" \")","v":" "},97,null,{"$f":"SUM(G100:AX100)","v":0}]
[{"$f":"IF(F101=[1]يوليو!$J100,\"ok\",\"error\")","v":"ok"},{"$f":"F101-[1]يوليو!$J100","v":0},{"$f":"IF([1]يوليو!$J100>0,[1]يوليو!$C100,\" \")","v":" "},98,null,{"$f":"SUM(G101:AX101)","v":0}]
[{"$f":"IF(F102=[1]يوليو!$J101,\"ok\",\"error\")","v":"ok"},{"$f":"F102-[1]يوليو!$J101","v":0},{"$f":"IF([1]يوليو!$J101>0,[1]يوليو!$C101,\" \")","v":" "},99,null,{"$f":"SUM(G102:AX102)","v":0}]
[{"$f":"IF(F103=[1]يوليو!$J102,\"ok\",\"error\")","v":"ok"},{"$f":"F103-[1]يوليو!$J102","v":0},{"$f":"IF([1]يوليو!$J102>0,[1]يوليو!$C102,\" \")","v":" "},100,null,{"$f":"SUM(G103:AX103)","v":0}]
[{"$f":"IF(F104=[1]يوليو!$J103,\"ok\",\"error\")","v":"ok"},{"$f":"F104-[1]يوليو!$J103","v":0},"الإجمالى",null,null,{"$f":"SUM(F4:F103)","v":0},0,0,0,0,0,0,0,0,0,0,0,0,0,0,0,0,0,0,0,0,0,0,0,0,0,0,0,0,0]
[]
[null,null,null,null,"؟",{"$f":"F104-[1]يوليو!$J$103","v":0}]

{"sheet":"أغسطس","index":7,"n_rows":106,"n_cols":35,"rows_kept":106,"cut":false,"hidden":false,"merged":[[1,38,2,38],[1,39,2,39],[1,10,2,10],[1,8,2,8],[1,34,2,34],[1,35,2,35],[1,36,2,36],[1,37,2,37],[1,30,2,30],[1,31,2,31],[1,32,2,32],[1,33,2,33],[1,26,2,26],[1,27,2,27],[1,28,2,28],[1,29,2,29],[1,22,2,22],[1,23,2,23],[1,24,2,24],[1,25,2,25],[1,18,2,18],[1,19,2,19],[1,20,2,20],[1,21,2,21],[1,15,2,15],[1,16,2,16],[1,17,2,17],[1,9,2,9],[1,11,2,11],[1,12,2,12],[1,13,2,13],[103,2,103,4],[1,2,2,2],[1,3,2,3],[1,4,2,4],[1,14,2,14],[0,2,0,14],[1,0,2,1],[1,5,2,5],[1,6,2,6],[1,7,2,7]]}
[null,null,"تحليـــــــــــــــــل مصـــــــــــــــروفات التشغيـــــــــــــــل عن شهـــــــــر أغســــــــــــطس لعام 201"]
["OR",null,"التاريخ","رقم القيد","البيان","الإجمالى",{"$f":"يوليو!G2","v":"صيانة\nواصلاح\nوقطع غيار"},{"$f":"يوليو!H2","v":"خامات تشغيل"},{"$f":"يوليو!I2","v":"م سيارات"},{"$f":"يوليو!J2","v":"كهرباء"},{"$f":"يوليو!K2","v":"م نظافة"},{"$f":"يوليو!L2","v":"مياه"},{"$f":"يوليو!M2","v":"تأمينات"},{"$f":"يوليو!N2","v":"أجور"},{"$f":"يوليو!O2","v":0},{"$f":"يوليو!P2","v":0},{"$f":"يوليو!Q2","v":0},{"$f":"يوليو!R2","v":0},{"$f":"يوليو!S2","v":0},{"$f":"يوليو!T2","v":0},{"$f":"يوليو!U2","v":0},{"$f":"يوليو!V2","v":0},{"$f":"يوليو!W2","v":0},{"$f":"يوليو!X2","v":0},{"$f":"يوليو!Y2","v":0},{"$f":"يوليو!Z2","v":0},{"$f":"يوليو!AA2","v":0},{"$f":"يوليو!AB2","v":0},{"$f":"يوليو!AC2","v":0},{"$f":"يوليو!AD2","v":0}]
[]
[{"$f":"IF(F4=[1]أغسطس!$J3,\"ok\",\"error\")","v":"ok"},{"$f":"F4-[1]أغسطس!$J3","v":0},{"$f":"IF([1]أغسطس!$J3>0,[1]أغسطس!$C3,\" \")","v":" "},1,null,{"$f":"SUM(G4:AX4)","v":0}]
[{"$f":"IF(F5=[1]أغسطس!$J4,\"ok\",\"error\")","v":"ok"},{"$f":"F5-[1]أغسطس!$J4","v":0},{"$f":"IF([1]أغسطس!$J4>0,[1]أغسطس!$C4,\" \")","v":" "},2,null,0]
[{"$f":"IF(F6=[1]أغسطس!$J5,\"ok\",\"error\")","v":"ok"},{"$f":"F6-[1]أغسطس!$J5","v":0},{"$f":"IF([1]أغسطس!$J5>0,[1]أغسطس!$C5,\" \")","v":" "},3,null,0]
[{"$f":"IF(F7=[1]أغسطس!$J6,\"ok\",\"error\")","v":"ok"},{"$f":"F7-[1]أغسطس!$J6","v":0},{"$f":"IF([1]أغسطس!$J6>0,[1]أغسطس!$C6,\" \")","v":" "},4,null,0]
[{"$f":"IF(F8=[1]أغسطس!$J7,\"ok\",\"error\")","v":"ok"},{"$f":"F8-[1]أغسطس!$J7","v":0},{"$f":"IF([1]أغسطس!$J7>0,[1]أغسطس!$C7,\" \")","v":" "},5,null,0]
[{"$f":"IF(F9=[1]أغسطس!$J8,\"ok\",\"error\")","v":"ok"},{"$f":"F9-[1]أغسطس!$J8","v":0},{"$f":"IF([1]أغسطس!$J8>0,[1]أغسطس!$C8,\" \")","v":" "},6,null,0]
[{"$f":"IF(F10=[1]أغسطس!$J9,\"ok\",\"error\")","v":"ok"},{"$f":"F10-[1]أغسطس!$J9","v":0},{"$f":"IF([1]أغسطس!$J9>0,[1]أغسطس!$C9,\" \")","v":" "},7,null,0]
[{"$f":"IF(F11=[1]أغسطس!$J10,\"ok\",\"error\")","v":"ok"},{"$f":"F11-[1]أغسطس!$J10","v":0},{"$f":"IF([1]أغسطس!$J10>0,[1]أغسطس!$C10,\" \")","v":" "},8,null,0]
[{"$f":"IF(F12=[1]أغسطس!$J11,\"ok\",\"error\")","v":"ok"},{"$f":"F12-[1]أغسطس!$J11","v":0},{"$f":"IF([1]أغسطس!$J11>0,[1]أغسطس!$C11,\" \")","v":" "},9,null,0]
[{"$f":"IF(F13=[1]أغسطس!$J12,\"ok\",\"error\")","v":"ok"},{"$f":"F13-[1]أغسطس!$J12","v":0},{"$f":"IF([1]أغسطس!$J12>0,[1]أغسطس!$C12,\" \")","v":" "},10,null,0]
[{"$f":"IF(F14=[1]أغسطس!$J13,\"ok\",\"error\")","v":"ok"},{"$f":"F14-[1]أغسطس!$J13","v":0},{"$f":"IF([1]أغسطس!$J13>0,[1]أغسطس!$C13,\" \")","v":" "},11,null,0]
[{"$f":"IF(F15=[1]أغسطس!$J14,\"ok\",\"error\")","v":"ok"},{"$f":"F15-[1]أغسطس!$J14","v":0},{"$f":"IF([1]أغسطس!$J14>0,[1]أغسطس!$C14,\" \")","v":" "},12,null,0]
[{"$f":"IF(F16=[1]أغسطس!$J15,\"ok\",\"error\")","v":"ok"},{"$f":"F16-[1]أغسطس!$J15","v":0},{"$f":"IF([1]أغسطس!$J15>0,[1]أغسطس!$C15,\" \")","v":" "},13,null,0]
[{"$f":"IF(F17=[1]أغسطس!$J16,\"ok\",\"error\")","v":"ok"},{"$f":"F17-[1]أغسطس!$J16","v":0},{"$f":"IF([1]أغسطس!$J16>0,[1]أغسطس!$C16,\" \")","v":" "},14,null,0]
[{"$f":"IF(F18=[1]أغسطس!$J17,\"ok\",\"error\")","v":"ok"},{"$f":"F18-[1]أغسطس!$J17","v":0},{"$f":"IF([1]أغسطس!$J17>0,[1]أغسطس!$C17,\" \")","v":" "},15,null,0]
[{"$f":"IF(F19=[1]أغسطس!$J18,\"ok\",\"error\")","v":"ok"},{"$f":"F19-[1]أغسطس!$J18","v":0},{"$f":"IF([1]أغسطس!$J18>0,[1]أغسطس!$C18,\" \")","v":" "},16,null,0]
[{"$f":"IF(F20=[1]أغسطس!$J19,\"ok\",\"error\")","v":"ok"},{"$f":"F20-[1]أغسطس!$J19","v":0},{"$f":"IF([1]أغسطس!$J19>0,[1]أغسطس!$C19,\" \")","v":" "},17,null,0]
[{"$f":"IF(F21=[1]أغسطس!$J20,\"ok\",\"error\")","v":"ok"},{"$f":"F21-[1]أغسطس!$J20","v":0},{"$f":"IF([1]أغسطس!$J20>0,[1]أغسطس!$C20,\" \")","v":" "},18,null,0]
[{"$f":"IF(F22=[1]أغسطس!$J21,\"ok\",\"error\")","v":"ok"},{"$f":"F22-[1]أغسطس!$J21","v":0},{"$f":"IF([1]أغسطس!$J21>0,[1]أغسطس!$C21,\" \")","v":" "},19,null,0]
[{"$f":"IF(F23=[1]أغسطس!$J22,\"ok\",\"error\")","v":"ok"},{"$f":"F23-[1]أغسطس!$J22","v":0},{"$f":"IF([1]أغسطس!$J22>0,[1]أغسطس!$C22,\" \")","v":" "},20,null,0]
[{"$f":"IF(F24=[1]أغسطس!$J23,\"ok\",\"error\")","v":"ok"},{"$f":"F24-[1]أغسطس!$J23","v":0},{"$f":"IF([1]أغسطس!$J23>0,[1]أغسطس!$C23,\" \")","v":" "},21,null,0]
[{"$f":"IF(F25=[1]أغسطس!$J24,\"ok\",\"error\")","v":"ok"},{"$f":"F25-[1]أغسطس!$J24","v":0},{"$f":"IF([1]أغسطس!$J24>0,[1]أغسطس!$C24,\" \")","v":" "},22,null,0]
[{"$f":"IF(F26=[1]أغسطس!$J25,\"ok\",\"error\")","v":"ok"},{"$f":"F26-[1]أغسطس!$J25","v":0},{"$f":"IF([1]أغسطس!$J25>0,[1]أغسطس!$C25,\" \")","v":" "},23,null,0]
[{"$f":"IF(F27=[1]أغسطس!$J26,\"ok\",\"error\")","v":"ok"},{"$f":"F27-[1]أغسطس!$J26","v":0},{"$f":"IF([1]أغسطس!$J26>0,[1]أغسطس!$C26,\" \")","v":" "},24,null,0]
[{"$f":"IF(F28=[1]أغسطس!$J27,\"ok\",\"error\")","v":"ok"},{"$f":"F28-[1]أغسطس!$J27","v":0},{"$f":"IF([1]أغسطس!$J27>0,[1]أغسطس!$C27,\" \")","v":" "},25,null,0]
[{"$f":"IF(F29=[1]أغسطس!$J28,\"ok\",\"error\")","v":"ok"},{"$f":"F29-[1]أغسطس!$J28","v":0},{"$f":"IF([1]أغسطس!$J28>0,[1]أغسطس!$C28,\" \")","v":" "},26,null,0]
[{"$f":"IF(F30=[1]أغسطس!$J29,\"ok\",\"error\")","v":"ok"},{"$f":"F30-[1]أغسطس!$J29","v":0},{"$f":"IF([1]أغسطس!$J29>0,[1]أغسطس!$C29,\" \")","v":" "},27,null,0]
[{"$f":"IF(F31=[1]أغسطس!$J30,\"ok\",\"error\")","v":"ok"},{"$f":"F31-[1]أغسطس!$J30","v":0},{"$f":"IF([1]أغسطس!$J30>0,[1]أغسطس!$C30,\" \")","v":" "},28,null,0]
[{"$f":"IF(F32=[1]أغسطس!$J31,\"ok\",\"error\")","v":"ok"},{"$f":"F32-[1]أغسطس!$J31","v":0},{"$f":"IF([1]أغسطس!$J31>0,[1]أغسطس!$C31,\" \")","v":" "},29,null,0]
[{"$f":"IF(F33=[1]أغسطس!$J32,\"ok\",\"error\")","v":"ok"},{"$f":"F33-[1]أغسطس!$J32","v":0},{"$f":"IF([1]أغسطس!$J32>0,[1]أغسطس!$C32,\" \")","v":" "},30,null,0]
[{"$f":"IF(F34=[1]أغسطس!$J33,\"ok\",\"error\")","v":"ok"},{"$f":"F34-[1]أغسطس!$J33","v":0},{"$f":"IF([1]أغسطس!$J33>0,[1]أغسطس!$C33,\" \")","v":" "},31,null,0]
[{"$f":"IF(F35=[1]أغسطس!$J34,\"ok\",\"error\")","v":"ok"},{"$f":"F35-[1]أغسطس!$J34","v":0},{"$f":"IF([1]أغسطس!$J34>0,[1]أغسطس!$C34,\" \")","v":" "},32,null,0]
[{"$f":"IF(F36=[1]أغسطس!$J35,\"ok\",\"error\")","v":"ok"},{"$f":"F36-[1]أغسطس!$J35","v":0},{"$f":"IF([1]أغسطس!$J35>0,[1]أغسطس!$C35,\" \")","v":" "},33,null,{"$f":"SUM(G36:AX36)","v":0}]
[{"$f":"IF(F37=[1]أغسطس!$J36,\"ok\",\"error\")","v":"ok"},{"$f":"F37-[1]أغسطس!$J36","v":0},{"$f":"IF([1]أغسطس!$J36>0,[1]أغسطس!$C36,\" \")","v":" "},34,null,0]
[{"$f":"IF(F38=[1]أغسطس!$J37,\"ok\",\"error\")","v":"ok"},{"$f":"F38-[1]أغسطس!$J37","v":0},{"$f":"IF([1]أغسطس!$J37>0,[1]أغسطس!$C37,\" \")","v":" "},35,null,0]
[{"$f":"IF(F39=[1]أغسطس!$J38,\"ok\",\"error\")","v":"ok"},{"$f":"F39-[1]أغسطس!$J38","v":0},{"$f":"IF([1]أغسطس!$J38>0,[1]أغسطس!$C38,\" \")","v":" "},36,null,0]
[{"$f":"IF(F40=[1]أغسطس!$J39,\"ok\",\"error\")","v":"ok"},{"$f":"F40-[1]أغسطس!$J39","v":0},{"$f":"IF([1]أغسطس!$J39>0,[1]أغسطس!$C39,\" \")","v":" "},37,null,0]
[{"$f":"IF(F41=[1]أغسطس!$J40,\"ok\",\"error\")","v":"ok"},{"$f":"F41-[1]أغسطس!$J40","v":0},{"$f":"IF([1]أغسطس!$J40>0,[1]أغسطس!$C40,\" \")","v":" "},38,null,0]
[{"$f":"IF(F42=[1]أغسطس!$J41,\"ok\",\"error\")","v":"ok"},{"$f":"F42-[1]أغسطس!$J41","v":0},{"$f":"IF([1]أغسطس!$J41>0,[1]أغسطس!$C41,\" \")","v":" "},39,null,0]
[{"$f":"IF(F43=[1]أغسطس!$J42,\"ok\",\"error\")","v":"ok"},{"$f":"F43-[1]أغسطس!$J42","v":0},{"$f":"IF([1]أغسطس!$J42>0,[1]أغسطس!$C42,\" \")","v":" "},40,null,0]
[{"$f":"IF(F44=[1]أغسطس!$J43,\"ok\",\"error\")","v":"ok"},{"$f":"F44-[1]أغسطس!$J43","v":0},{"$f":"IF([1]أغسطس!$J43>0,[1]أغسطس!$C43,\" \")","v":" "},41,null,0]
[{"$f":"IF(F45=[1]أغسطس!$J44,\"ok\",\"error\")","v":"ok"},{"$f":"F45-[1]أغسطس!$J44","v":0},{"$f":"IF([1]أغسطس!$J44>0,[1]أغسطس!$C44,\" \")","v":" "},42,null,0]
[{"$f":"IF(F46=[1]أغسطس!$J45,\"ok\",\"error\")","v":"ok"},{"$f":"F46-[1]أغسطس!$J45","v":0},{"$f":"IF([1]أغسطس!$J45>0,[1]أغسطس!$C45,\" \")","v":" "},43,null,0]
[{"$f":"IF(F47=[1]أغسطس!$J46,\"ok\",\"error\")","v":"ok"},{"$f":"F47-[1]أغسطس!$J46","v":0},{"$f":"IF([1]أغسطس!$J46>0,[1]أغسطس!$C46,\" \")","v":" "},44,null,0]
[{"$f":"IF(F48=[1]أغسطس!$J47,\"ok\",\"error\")","v":"ok"},{"$f":"F48-[1]أغسطس!$J47","v":0},{"$f":"IF([1]أغسطس!$J47>0,[1]أغسطس!$C47,\" \")","v":" "},45,null,0]
[{"$f":"IF(F49=[1]أغسطس!$J48,\"ok\",\"error\")","v":"ok"},{"$f":"F49-[1]أغسطس!$J48","v":0},{"$f":"IF([1]أغسطس!$J48>0,[1]أغسطس!$C48,\" \")","v":" "},46,null,0]
[{"$f":"IF(F50=[1]أغسطس!$J49,\"ok\",\"error\")","v":"ok"},{"$f":"F50-[1]أغسطس!$J49","v":0},{"$f":"IF([1]أغسطس!$J49>0,[1]أغسطس!$C49,\" \")","v":" "},47,null,0]
[{"$f":"IF(F51=[1]أغسطس!$J50,\"ok\",\"error\")","v":"ok"},{"$f":"F51-[1]أغسطس!$J50","v":0},{"$f":"IF([1]أغسطس!$J50>0,[1]أغسطس!$C50,\" \")","v":" "},48,null,0]
[{"$f":"IF(F52=[1]أغسطس!$J51,\"ok\",\"error\")","v":"ok"},{"$f":"F52-[1]أغسطس!$J51","v":0},{"$f":"IF([1]أغسطس!$J51>0,[1]أغسطس!$C51,\" \")","v":" "},49,null,0]
[{"$f":"IF(F53=[1]أغسطس!$J52,\"ok\",\"error\")","v":"ok"},{"$f":"F53-[1]أغسطس!$J52","v":0},{"$f":"IF([1]أغسطس!$J52>0,[1]أغسطس!$C52,\" \")","v":" "},50,null,0]
[{"$f":"IF(F54=[1]أغسطس!$J53,\"ok\",\"error\")","v":"ok"},{"$f":"F54-[1]أغسطس!$J53","v":0},{"$f":"IF([1]أغسطس!$J53>0,[1]أغسطس!$C53,\" \")","v":" "},51,null,0]
[{"$f":"IF(F55=[1]أغسطس!$J54,\"ok\",\"error\")","v":"ok"},{"$f":"F55-[1]أغسطس!$J54","v":0},{"$f":"IF([1]أغسطس!$J54>0,[1]أغسطس!$C54,\" \")","v":" "},52,null,0]
[{"$f":"IF(F56=[1]أغسطس!$J55,\"ok\",\"error\")","v":"ok"},{"$f":"F56-[1]أغسطس!$J55","v":0},{"$f":"IF([1]أغسطس!$J55>0,[1]أغسطس!$C55,\" \")","v":" "},53,null,0]
[{"$f":"IF(F57=[1]أغسطس!$J56,\"ok\",\"error\")","v":"ok"},{"$f":"F57-[1]أغسطس!$J56","v":0},{"$f":"IF([1]أغسطس!$J56>0,[1]أغسطس!$C56,\" \")","v":" "},54,null,0]
[{"$f":"IF(F58=[1]أغسطس!$J57,\"ok\",\"error\")","v":"ok"},{"$f":"F58-[1]أغسطس!$J57","v":0},{"$f":"IF([1]أغسطس!$J57>0,[1]أغسطس!$C57,\" \")","v":" "},55,null,0]
[{"$f":"IF(F59=[1]أغسطس!$J58,\"ok\",\"error\")","v":"ok"},{"$f":"F59-[1]أغسطس!$J58","v":0},{"$f":"IF([1]أغسطس!$J58>0,[1]أغسطس!$C58,\" \")","v":" "},56,null,0]
[{"$f":"IF(F60=[1]أغسطس!$J59,\"ok\",\"error\")","v":"ok"},{"$f":"F60-[1]أغسطس!$J59","v":0},{"$f":"IF([1]أغسطس!$J59>0,[1]أغسطس!$C59,\" \")","v":" "},57,null,0]
[{"$f":"IF(F61=[1]أغسطس!$J60,\"ok\",\"error\")","v":"ok"},{"$f":"F61-[1]أغسطس!$J60","v":0},{"$f":"IF([1]أغسطس!$J60>0,[1]أغسطس!$C60,\" \")","v":" "},58,null,0]
[{"$f":"IF(F62=[1]أغسطس!$J61,\"ok\",\"error\")","v":"ok"},{"$f":"F62-[1]أغسطس!$J61","v":0},{"$f":"IF([1]أغسطس!$J61>0,[1]أغسطس!$C61,\" \")","v":" "},59,null,0]
[{"$f":"IF(F63=[1]أغسطس!$J62,\"ok\",\"error\")","v":"ok"},{"$f":"F63-[1]أغسطس!$J62","v":0},{"$f":"IF([1]أغسطس!$J62>0,[1]أغسطس!$C62,\" \")","v":" "},60,null,0]
[{"$f":"IF(F64=[1]أغسطس!$J63,\"ok\",\"error\")","v":"ok"},{"$f":"F64-[1]أغسطس!$J63","v":0},{"$f":"IF([1]أغسطس!$J63>0,[1]أغسطس!$C63,\" \")","v":" "},61,null,0]
[{"$f":"IF(F65=[1]أغسطس!$J64,\"ok\",\"error\")","v":"ok"},{"$f":"F65-[1]أغسطس!$J64","v":0},{"$f":"IF([1]أغسطس!$J64>0,[1]أغسطس!$C64,\" \")","v":" "},62,null,0]
[{"$f":"IF(F66=[1]أغسطس!$J65,\"ok\",\"error\")","v":"ok"},{"$f":"F66-[1]أغسطس!$J65","v":0},{"$f":"IF([1]أغسطس!$J65>0,[1]أغسطس!$C65,\" \")","v":" "},63,null,0]
[{"$f":"IF(F67=[1]أغسطس!$J66,\"ok\",\"error\")","v":"ok"},{"$f":"F67-[1]أغسطس!$J66","v":0},{"$f":"IF([1]أغسطس!$J66>0,[1]أغسطس!$C66,\" \")","v":" "},64,null,0]
[{"$f":"IF(F68=[1]أغسطس!$J67,\"ok\",\"error\")","v":"ok"},{"$f":"F68-[1]أغسطس!$J67","v":0},{"$f":"IF([1]أغسطس!$J67>0,[1]أغسطس!$C67,\" \")","v":" "},65,null,{"$f":"SUM(G68:AX68)","v":0}]
[{"$f":"IF(F69=[1]أغسطس!$J68,\"ok\",\"error\")","v":"ok"},{"$f":"F69-[1]أغسطس!$J68","v":0},{"$f":"IF([1]أغسطس!$J68>0,[1]أغسطس!$C68,\" \")","v":" "},66,null,0]
[{"$f":"IF(F70=[1]أغسطس!$J69,\"ok\",\"error\")","v":"ok"},{"$f":"F70-[1]أغسطس!$J69","v":0},{"$f":"IF([1]أغسطس!$J69>0,[1]أغسطس!$C69,\" \")","v":" "},67,null,0]
[{"$f":"IF(F71=[1]أغسطس!$J70,\"ok\",\"error\")","v":"ok"},{"$f":"F71-[1]أغسطس!$J70","v":0},{"$f":"IF([1]أغسطس!$J70>0,[1]أغسطس!$C70,\" \")","v":" "},68,null,0]
[{"$f":"IF(F72=[1]أغسطس!$J71,\"ok\",\"error\")","v":"ok"},{"$f":"F72-[1]أغسطس!$J71","v":0},{"$f":"IF([1]أغسطس!$J71>0,[1]أغسطس!$C71,\" \")","v":" "},69,null,0]
[{"$f":"IF(F73=[1]أغسطس!$J72,\"ok\",\"error\")","v":"ok"},{"$f":"F73-[1]أغسطس!$J72","v":0},{"$f":"IF([1]أغسطس!$J72>0,[1]أغسطس!$C72,\" \")","v":" "},70,null,0]
[{"$f":"IF(F74=[1]أغسطس!$J73,\"ok\",\"error\")","v":"ok"},{"$f":"F74-[1]أغسطس!$J73","v":0},{"$f":"IF([1]أغسطس!$J73>0,[1]أغسطس!$C73,\" \")","v":" "},71,null,0]
[{"$f":"IF(F75=[1]أغسطس!$J74,\"ok\",\"error\")","v":"ok"},{"$f":"F75-[1]أغسطس!$J74","v":0},{"$f":"IF([1]أغسطس!$J74>0,[1]أغسطس!$C74,\" \")","v":" "},72,null,0]
[{"$f":"IF(F76=[1]أغسطس!$J75,\"ok\",\"error\")","v":"ok"},{"$f":"F76-[1]أغسطس!$J75","v":0},{"$f":"IF([1]أغسطس!$J75>0,[1]أغسطس!$C75,\" \")","v":" "},73,null,0]
[{"$f":"IF(F77=[1]أغسطس!$J76,\"ok\",\"error\")","v":"ok"},{"$f":"F77-[1]أغسطس!$J76","v":0},{"$f":"IF([1]أغسطس!$J76>0,[1]أغسطس!$C76,\" \")","v":" "},74,null,0]
[{"$f":"IF(F78=[1]أغسطس!$J77,\"ok\",\"error\")","v":"ok"},{"$f":"F78-[1]أغسطس!$J77","v":0},{"$f":"IF([1]أغسطس!$J77>0,[1]أغسطس!$C77,\" \")","v":" "},75,null,0]
[{"$f":"IF(F79=[1]أغسطس!$J78,\"ok\",\"error\")","v":"ok"},{"$f":"F79-[1]أغسطس!$J78","v":0},{"$f":"IF([1]أغسطس!$J78>0,[1]أغسطس!$C78,\" \")","v":" "},76,null,0]
[{"$f":"IF(F80=[1]أغسطس!$J79,\"ok\",\"error\")","v":"ok"},{"$f":"F80-[1]أغسطس!$J79","v":0},{"$f":"IF([1]أغسطس!$J79>0,[1]أغسطس!$C79,\" \")","v":" "},77,null,0]
[{"$f":"IF(F81=[1]أغسطس!$J80,\"ok\",\"error\")","v":"ok"},{"$f":"F81-[1]أغسطس!$J80","v":0},{"$f":"IF([1]أغسطس!$J80>0,[1]أغسطس!$C80,\" \")","v":" "},78,null,0]
[{"$f":"IF(F82=[1]أغسطس!$J81,\"ok\",\"error\")","v":"ok"},{"$f":"F82-[1]أغسطس!$J81","v":0},{"$f":"IF([1]أغسطس!$J81>0,[1]أغسطس!$C81,\" \")","v":" "},79,null,0]
[{"$f":"IF(F83=[1]أغسطس!$J82,\"ok\",\"error\")","v":"ok"},{"$f":"F83-[1]أغسطس!$J82","v":0},{"$f":"IF([1]أغسطس!$J82>0,[1]أغسطس!$C82,\" \")","v":" "},80,null,0]
[{"$f":"IF(F84=[1]أغسطس!$J83,\"ok\",\"error\")","v":"ok"},{"$f":"F84-[1]أغسطس!$J83","v":0},{"$f":"IF([1]أغسطس!$J83>0,[1]أغسطس!$C83,\" \")","v":" "},81,null,0]
[{"$f":"IF(F85=[1]أغسطس!$J84,\"ok\",\"error\")","v":"ok"},{"$f":"F85-[1]أغسطس!$J84","v":0},{"$f":"IF([1]أغسطس!$J84>0,[1]أغسطس!$C84,\" \")","v":" "},82,null,0]
[{"$f":"IF(F86=[1]أغسطس!$J85,\"ok\",\"error\")","v":"ok"},{"$f":"F86-[1]أغسطس!$J85","v":0},{"$f":"IF([1]أغسطس!$J85>0,[1]أغسطس!$C85,\" \")","v":" "},83,null,0]
[{"$f":"IF(F87=[1]أغسطس!$J86,\"ok\",\"error\")","v":"ok"},{"$f":"F87-[1]أغسطس!$J86","v":0},{"$f":"IF([1]أغسطس!$J86>0,[1]أغسطس!$C86,\" \")","v":" "},84,null,0]
[{"$f":"IF(F88=[1]أغسطس!$J87,\"ok\",\"error\")","v":"ok"},{"$f":"F88-[1]أغسطس!$J87","v":0},{"$f":"IF([1]أغسطس!$J87>0,[1]أغسطس!$C87,\" \")","v":" "},85,null,0]
[{"$f":"IF(F89=[1]أغسطس!$J88,\"ok\",\"error\")","v":"ok"},{"$f":"F89-[1]أغسطس!$J88","v":0},{"$f":"IF([1]أغسطس!$J88>0,[1]أغسطس!$C88,\" \")","v":" "},86,null,0]
[{"$f":"IF(F90=[1]أغسطس!$J89,\"ok\",\"error\")","v":"ok"},{"$f":"F90-[1]أغسطس!$J89","v":0},{"$f":"IF([1]أغسطس!$J89>0,[1]أغسطس!$C89,\" \")","v":" "},87,null,0]
[{"$f":"IF(F91=[1]أغسطس!$J90,\"ok\",\"error\")","v":"ok"},{"$f":"F91-[1]أغسطس!$J90","v":0},{"$f":"IF([1]أغسطس!$J90>0,[1]أغسطس!$C90,\" \")","v":" "},88,null,0]
[{"$f":"IF(F92=[1]أغسطس!$J91,\"ok\",\"error\")","v":"ok"},{"$f":"F92-[1]أغسطس!$J91","v":0},{"$f":"IF([1]أغسطس!$J91>0,[1]أغسطس!$C91,\" \")","v":" "},89,null,0]
[{"$f":"IF(F93=[1]أغسطس!$J92,\"ok\",\"error\")","v":"ok"},{"$f":"F93-[1]أغسطس!$J92","v":0},{"$f":"IF([1]أغسطس!$J92>0,[1]أغسطس!$C92,\" \")","v":" "},90,null,0]
[{"$f":"IF(F94=[1]أغسطس!$J93,\"ok\",\"error\")","v":"ok"},{"$f":"F94-[1]أغسطس!$J93","v":0},{"$f":"IF([1]أغسطس!$J93>0,[1]أغسطس!$C93,\" \")","v":" "},91,null,0]
[{"$f":"IF(F95=[1]أغسطس!$J94,\"ok\",\"error\")","v":"ok"},{"$f":"F95-[1]أغسطس!$J94","v":0},{"$f":"IF([1]أغسطس!$J94>0,[1]أغسطس!$C94,\" \")","v":" "},92,null,0]
[{"$f":"IF(F96=[1]أغسطس!$J95,\"ok\",\"error\")","v":"ok"},{"$f":"F96-[1]أغسطس!$J95","v":0},{"$f":"IF([1]أغسطس!$J95>0,[1]أغسطس!$C95,\" \")","v":" "},93,null,0]
[{"$f":"IF(F97=[1]أغسطس!$J96,\"ok\",\"error\")","v":"ok"},{"$f":"F97-[1]أغسطس!$J96","v":0},{"$f":"IF([1]أغسطس!$J96>0,[1]أغسطس!$C96,\" \")","v":" "},94,null,0]
[{"$f":"IF(F98=[1]أغسطس!$J97,\"ok\",\"error\")","v":"ok"},{"$f":"F98-[1]أغسطس!$J97","v":0},{"$f":"IF([1]أغسطس!$J97>0,[1]أغسطس!$C97,\" \")","v":" "},95,null,0]
[{"$f":"IF(F99=[1]أغسطس!$J98,\"ok\",\"error\")","v":"ok"},{"$f":"F99-[1]أغسطس!$J98","v":0},{"$f":"IF([1]أغسطس!$J98>0,[1]أغسطس!$C98,\" \")","v":" "},96,null,0]
[{"$f":"IF(F100=[1]أغسطس!$J99,\"ok\",\"error\")","v":"ok"},{"$f":"F100-[1]أغسطس!$J99","v":0},{"$f":"IF([1]أغسطس!$J99>0,[1]أغسطس!$C99,\" \")","v":" "},97,null,{"$f":"SUM(G100:AX100)","v":0}]
[{"$f":"IF(F101=[1]أغسطس!$J100,\"ok\",\"error\")","v":"ok"},{"$f":"F101-[1]أغسطس!$J100","v":0},{"$f":"IF([1]أغسطس!$J100>0,[1]أغسطس!$C100,\" \")","v":" "},98,null,{"$f":"SUM(G101:AX101)","v":0}]
[{"$f":"IF(F102=[1]أغسطس!$J101,\"ok\",\"error\")","v":"ok"},{"$f":"F102-[1]أغسطس!$J101","v":0},{"$f":"IF([1]أغسطس!$J101>0,[1]أغسطس!$C101,\" \")","v":" "},99,null,{"$f":"SUM(G102:AX102)","v":0}]
[{"$f":"IF(F103=[1]أغسطس!$J102,\"ok\",\"error\")","v":"ok"},{"$f":"F103-[1]أغسطس!$J102","v":0},{"$f":"IF([1]أغسطس!$J102>0,[1]أغسطس!$C102,\" \")","v":" "},100,null,{"$f":"SUM(G103:AX103)","v":0}]
[{"$f":"IF(F104=[1]أغسطس!$J103,\"ok\",\"error\")","v":"ok"},{"$f":"F104-[1]أغسطس!$J103","v":0},"الإجمالى",null,null,{"$f":"SUM(F4:F103)","v":0},0,0,0,0,0,0,0,0,0,0,0,0,0,0,0,0,0,0,0,0,0,0,0,0,0,0,0,0,0]
[]
[null,null,null,null,"؟",{"$f":"F104-[1]أغسطس!$J$103","v":0}]

{"sheet":"سبتمبر","index":8,"n_rows":106,"n_cols":35,"rows_kept":106,"cut":false,"hidden":false,"merged":[[1,7,2,7],[1,9,2,9],[103,2,103,4],[1,2,2,2],[1,3,2,3],[1,4,2,4],[1,5,2,5],[1,6,2,6],[1,22,2,22],[1,11,2,11],[1,12,2,12],[1,13,2,13],[1,14,2,14],[1,15,2,15],[1,16,2,16],[1,17,2,17],[1,18,2,18],[1,19,2,19],[1,20,2,20],[1,21,2,21],[1,33,2,33],[1,26,2,26],[1,27,2,27],[1,28,2,28],[1,29,2,29],[0,2,0,14],[1,0,2,1],[1,38,2,38],[1,39,2,39],[1,10,2,10],[1,8,2,8],[1,34,2,34],[1,35,2,35],[1,36,2,36],[1,37,2,37],[1,30,2,30],[1,23,2,23],[1,24,2,24],[1,25,2,25],[1,31,2,31],[1,32,2,32]]}
[null,null,"تحليـــــــــــــــــل مصـــــــــــــــروفات التشغيـــــــــــــــل عن شهـــــــــر سبتمبــــــــــر لعام 201"]
["OR",null,"التاريخ","رقم القيد","البيان","الإجمالى",{"$f":"أغسطس!G2","v":"صيانة\nواصلاح\nوقطع غيار"},{"$f":"أغسطس!H2","v":"خامات تشغيل"},{"$f":"أغسطس!I2","v":"م سيارات"},{"$f":"أغسطس!J2","v":"كهرباء"},{"$f":"أغسطس!K2","v":"م نظافة"},{"$f":"أغسطس!L2","v":"مياه"},{"$f":"أغسطس!M2","v":"تأمينات"},{"$f":"أغسطس!N2","v":"أجور"},{"$f":"أغسطس!O2","v":0},{"$f":"أغسطس!P2","v":0},{"$f":"أغسطس!Q2","v":0},{"$f":"أغسطس!R2","v":0},{"$f":"أغسطس!S2","v":0},{"$f":"أغسطس!T2","v":0},{"$f":"أغسطس!U2","v":0},{"$f":"أغسطس!V2","v":0},{"$f":"أغسطس!W2","v":0},{"$f":"أغسطس!X2","v":0},{"$f":"أغسطس!Y2","v":0},{"$f":"أغسطس!Z2","v":0},{"$f":"أغسطس!AA2","v":0},{"$f":"أغسطس!AB2","v":0},{"$f":"أغسطس!AC2","v":0},{"$f":"أغسطس!AD2","v":0}]
[]
[{"$f":"IF(F4=[1]سبتمبر!$J3,\"ok\",\"error\")","v":"ok"},{"$f":"F4-[1]سبتمبر!$J3","v":0},{"$f":"IF([1]سبتمبر!$J3>0,[1]سبتمبر!$C3,\" \")","v":" "},1,null,{"$f":"SUM(G4:AX4)","v":0}]
[{"$f":"IF(F5=[1]سبتمبر!$J4,\"ok\",\"error\")","v":"ok"},{"$f":"F5-[1]سبتمبر!$J4","v":0},{"$f":"IF([1]سبتمبر!$J4>0,[1]سبتمبر!$C4,\" \")","v":" "},2,null,0]
[{"$f":"IF(F6=[1]سبتمبر!$J5,\"ok\",\"error\")","v":"ok"},{"$f":"F6-[1]سبتمبر!$J5","v":0},{"$f":"IF([1]سبتمبر!$J5>0,[1]سبتمبر!$C5,\" \")","v":" "},3,null,0]
[{"$f":"IF(F7=[1]سبتمبر!$J6,\"ok\",\"error\")","v":"ok"},{"$f":"F7-[1]سبتمبر!$J6","v":0},{"$f":"IF([1]سبتمبر!$J6>0,[1]سبتمبر!$C6,\" \")","v":" "},4,null,0]
[{"$f":"IF(F8=[1]سبتمبر!$J7,\"ok\",\"error\")","v":"ok"},{"$f":"F8-[1]سبتمبر!$J7","v":0},{"$f":"IF([1]سبتمبر!$J7>0,[1]سبتمبر!$C7,\" \")","v":" "},5,null,0]
[{"$f":"IF(F9=[1]سبتمبر!$J8,\"ok\",\"error\")","v":"ok"},{"$f":"F9-[1]سبتمبر!$J8","v":0},{"$f":"IF([1]سبتمبر!$J8>0,[1]سبتمبر!$C8,\" \")","v":" "},6,null,0]
[{"$f":"IF(F10=[1]سبتمبر!$J9,\"ok\",\"error\")","v":"ok"},{"$f":"F10-[1]سبتمبر!$J9","v":0},{"$f":"IF([1]سبتمبر!$J9>0,[1]سبتمبر!$C9,\" \")","v":" "},7,null,0]
[{"$f":"IF(F11=[1]سبتمبر!$J10,\"ok\",\"error\")","v":"ok"},{"$f":"F11-[1]سبتمبر!$J10","v":0},{"$f":"IF([1]سبتمبر!$J10>0,[1]سبتمبر!$C10,\" \")","v":" "},8,null,0]
[{"$f":"IF(F12=[1]سبتمبر!$J11,\"ok\",\"error\")","v":"ok"},{"$f":"F12-[1]سبتمبر!$J11","v":0},{"$f":"IF([1]سبتمبر!$J11>0,[1]سبتمبر!$C11,\" \")","v":" "},9,null,0]
[{"$f":"IF(F13=[1]سبتمبر!$J12,\"ok\",\"error\")","v":"ok"},{"$f":"F13-[1]سبتمبر!$J12","v":0},{"$f":"IF([1]سبتمبر!$J12>0,[1]سبتمبر!$C12,\" \")","v":" "},10,null,0]
[{"$f":"IF(F14=[1]سبتمبر!$J13,\"ok\",\"error\")","v":"ok"},{"$f":"F14-[1]سبتمبر!$J13","v":0},{"$f":"IF([1]سبتمبر!$J13>0,[1]سبتمبر!$C13,\" \")","v":" "},11,null,0]
[{"$f":"IF(F15=[1]سبتمبر!$J14,\"ok\",\"error\")","v":"ok"},{"$f":"F15-[1]سبتمبر!$J14","v":0},{"$f":"IF([1]سبتمبر!$J14>0,[1]سبتمبر!$C14,\" \")","v":" "},12,null,0]
[{"$f":"IF(F16=[1]سبتمبر!$J15,\"ok\",\"error\")","v":"ok"},{"$f":"F16-[1]سبتمبر!$J15","v":0},{"$f":"IF([1]سبتمبر!$J15>0,[1]سبتمبر!$C15,\" \")","v":" "},13,null,0]
[{"$f":"IF(F17=[1]سبتمبر!$J16,\"ok\",\"error\")","v":"ok"},{"$f":"F17-[1]سبتمبر!$J16","v":0},{"$f":"IF([1]سبتمبر!$J16>0,[1]سبتمبر!$C16,\" \")","v":" "},14,null,0]
[{"$f":"IF(F18=[1]سبتمبر!$J17,\"ok\",\"error\")","v":"ok"},{"$f":"F18-[1]سبتمبر!$J17","v":0},{"$f":"IF([1]سبتمبر!$J17>0,[1]سبتمبر!$C17,\" \")","v":" "},15,null,0]
[{"$f":"IF(F19=[1]سبتمبر!$J18,\"ok\",\"error\")","v":"ok"},{"$f":"F19-[1]سبتمبر!$J18","v":0},{"$f":"IF([1]سبتمبر!$J18>0,[1]سبتمبر!$C18,\" \")","v":" "},16,null,0]
[{"$f":"IF(F20=[1]سبتمبر!$J19,\"ok\",\"error\")","v":"ok"},{"$f":"F20-[1]سبتمبر!$J19","v":0},{"$f":"IF([1]سبتمبر!$J19>0,[1]سبتمبر!$C19,\" \")","v":" "},17,null,0]
[{"$f":"IF(F21=[1]سبتمبر!$J20,\"ok\",\"error\")","v":"ok"},{"$f":"F21-[1]سبتمبر!$J20","v":0},{"$f":"IF([1]سبتمبر!$J20>0,[1]سبتمبر!$C20,\" \")","v":" "},18,null,0]
[{"$f":"IF(F22=[1]سبتمبر!$J21,\"ok\",\"error\")","v":"ok"},{"$f":"F22-[1]سبتمبر!$J21","v":0},{"$f":"IF([1]سبتمبر!$J21>0,[1]سبتمبر!$C21,\" \")","v":" "},19,null,0]
[{"$f":"IF(F23=[1]سبتمبر!$J22,\"ok\",\"error\")","v":"ok"},{"$f":"F23-[1]سبتمبر!$J22","v":0},{"$f":"IF([1]سبتمبر!$J22>0,[1]سبتمبر!$C22,\" \")","v":" "},20,null,0]
[{"$f":"IF(F24=[1]سبتمبر!$J23,\"ok\",\"error\")","v":"ok"},{"$f":"F24-[1]سبتمبر!$J23","v":0},{"$f":"IF([1]سبتمبر!$J23>0,[1]سبتمبر!$C23,\" \")","v":" "},21,null,0]
[{"$f":"IF(F25=[1]سبتمبر!$J24,\"ok\",\"error\")","v":"ok"},{"$f":"F25-[1]سبتمبر!$J24","v":0},{"$f":"IF([1]سبتمبر!$J24>0,[1]سبتمبر!$C24,\" \")","v":" "},22,null,0]
[{"$f":"IF(F26=[1]سبتمبر!$J25,\"ok\",\"error\")","v":"ok"},{"$f":"F26-[1]سبتمبر!$J25","v":0},{"$f":"IF([1]سبتمبر!$J25>0,[1]سبتمبر!$C25,\" \")","v":" "},23,null,0]
[{"$f":"IF(F27=[1]سبتمبر!$J26,\"ok\",\"error\")","v":"ok"},{"$f":"F27-[1]سبتمبر!$J26","v":0},{"$f":"IF([1]سبتمبر!$J26>0,[1]سبتمبر!$C26,\" \")","v":" "},24,null,0]
[{"$f":"IF(F28=[1]سبتمبر!$J27,\"ok\",\"error\")","v":"ok"},{"$f":"F28-[1]سبتمبر!$J27","v":0},{"$f":"IF([1]سبتمبر!$J27>0,[1]سبتمبر!$C27,\" \")","v":" "},25,null,0]
[{"$f":"IF(F29=[1]سبتمبر!$J28,\"ok\",\"error\")","v":"ok"},{"$f":"F29-[1]سبتمبر!$J28","v":0},{"$f":"IF([1]سبتمبر!$J28>0,[1]سبتمبر!$C28,\" \")","v":" "},26,null,0]
[{"$f":"IF(F30=[1]سبتمبر!$J29,\"ok\",\"error\")","v":"ok"},{"$f":"F30-[1]سبتمبر!$J29","v":0},{"$f":"IF([1]سبتمبر!$J29>0,[1]سبتمبر!$C29,\" \")","v":" "},27,null,0]
[{"$f":"IF(F31=[1]سبتمبر!$J30,\"ok\",\"error\")","v":"ok"},{"$f":"F31-[1]سبتمبر!$J30","v":0},{"$f":"IF([1]سبتمبر!$J30>0,[1]سبتمبر!$C30,\" \")","v":" "},28,null,0]
[{"$f":"IF(F32=[1]سبتمبر!$J31,\"ok\",\"error\")","v":"ok"},{"$f":"F32-[1]سبتمبر!$J31","v":0},{"$f":"IF([1]سبتمبر!$J31>0,[1]سبتمبر!$C31,\" \")","v":" "},29,null,0]
[{"$f":"IF(F33=[1]سبتمبر!$J32,\"ok\",\"error\")","v":"ok"},{"$f":"F33-[1]سبتمبر!$J32","v":0},{"$f":"IF([1]سبتمبر!$J32>0,[1]سبتمبر!$C32,\" \")","v":" "},30,null,0]
[{"$f":"IF(F34=[1]سبتمبر!$J33,\"ok\",\"error\")","v":"ok"},{"$f":"F34-[1]سبتمبر!$J33","v":0},{"$f":"IF([1]سبتمبر!$J33>0,[1]سبتمبر!$C33,\" \")","v":" "},31,null,0]
[{"$f":"IF(F35=[1]سبتمبر!$J34,\"ok\",\"error\")","v":"ok"},{"$f":"F35-[1]سبتمبر!$J34","v":0},{"$f":"IF([1]سبتمبر!$J34>0,[1]سبتمبر!$C34,\" \")","v":" "},32,null,0]
[{"$f":"IF(F36=[1]سبتمبر!$J35,\"ok\",\"error\")","v":"ok"},{"$f":"F36-[1]سبتمبر!$J35","v":0},{"$f":"IF([1]سبتمبر!$J35>0,[1]سبتمبر!$C35,\" \")","v":" "},33,null,{"$f":"SUM(G36:AX36)","v":0}]
[{"$f":"IF(F37=[1]سبتمبر!$J36,\"ok\",\"error\")","v":"ok"},{"$f":"F37-[1]سبتمبر!$J36","v":0},{"$f":"IF([1]سبتمبر!$J36>0,[1]سبتمبر!$C36,\" \")","v":" "},34,null,0]
[{"$f":"IF(F38=[1]سبتمبر!$J37,\"ok\",\"error\")","v":"ok"},{"$f":"F38-[1]سبتمبر!$J37","v":0},{"$f":"IF([1]سبتمبر!$J37>0,[1]سبتمبر!$C37,\" \")","v":" "},35,null,0]
[{"$f":"IF(F39=[1]سبتمبر!$J38,\"ok\",\"error\")","v":"ok"},{"$f":"F39-[1]سبتمبر!$J38","v":0},{"$f":"IF([1]سبتمبر!$J38>0,[1]سبتمبر!$C38,\" \")","v":" "},36,null,0]
[{"$f":"IF(F40=[1]سبتمبر!$J39,\"ok\",\"error\")","v":"ok"},{"$f":"F40-[1]سبتمبر!$J39","v":0},{"$f":"IF([1]سبتمبر!$J39>0,[1]سبتمبر!$C39,\" \")","v":" "},37,null,0]
[{"$f":"IF(F41=[1]سبتمبر!$J40,\"ok\",\"error\")","v":"ok"},{"$f":"F41-[1]سبتمبر!$J40","v":0},{"$f":"IF([1]سبتمبر!$J40>0,[1]سبتمبر!$C40,\" \")","v":" "},38,null,0]
[{"$f":"IF(F42=[1]سبتمبر!$J41,\"ok\",\"error\")","v":"ok"},{"$f":"F42-[1]سبتمبر!$J41","v":0},{"$f":"IF([1]سبتمبر!$J41>0,[1]سبتمبر!$C41,\" \")","v":" "},39,null,0]
[{"$f":"IF(F43=[1]سبتمبر!$J42,\"ok\",\"error\")","v":"ok"},{"$f":"F43-[1]سبتمبر!$J42","v":0},{"$f":"IF([1]سبتمبر!$J42>0,[1]سبتمبر!$C42,\" \")","v":" "},40,null,0]
[{"$f":"IF(F44=[1]سبتمبر!$J43,\"ok\",\"error\")","v":"ok"},{"$f":"F44-[1]سبتمبر!$J43","v":0},{"$f":"IF([1]سبتمبر!$J43>0,[1]سبتمبر!$C43,\" \")","v":" "},41,null,0]
[{"$f":"IF(F45=[1]سبتمبر!$J44,\"ok\",\"error\")","v":"ok"},{"$f":"F45-[1]سبتمبر!$J44","v":0},{"$f":"IF([1]سبتمبر!$J44>0,[1]سبتمبر!$C44,\" \")","v":" "},42,null,0]
[{"$f":"IF(F46=[1]سبتمبر!$J45,\"ok\",\"error\")","v":"ok"},{"$f":"F46-[1]سبتمبر!$J45","v":0},{"$f":"IF([1]سبتمبر!$J45>0,[1]سبتمبر!$C45,\" \")","v":" "},43,null,0]
[{"$f":"IF(F47=[1]سبتمبر!$J46,\"ok\",\"error\")","v":"ok"},{"$f":"F47-[1]سبتمبر!$J46","v":0},{"$f":"IF([1]سبتمبر!$J46>0,[1]سبتمبر!$C46,\" \")","v":" "},44,null,0]
[{"$f":"IF(F48=[1]سبتمبر!$J47,\"ok\",\"error\")","v":"ok"},{"$f":"F48-[1]سبتمبر!$J47","v":0},{"$f":"IF([1]سبتمبر!$J47>0,[1]سبتمبر!$C47,\" \")","v":" "},45,null,0]
[{"$f":"IF(F49=[1]سبتمبر!$J48,\"ok\",\"error\")","v":"ok"},{"$f":"F49-[1]سبتمبر!$J48","v":0},{"$f":"IF([1]سبتمبر!$J48>0,[1]سبتمبر!$C48,\" \")","v":" "},46,null,0]
[{"$f":"IF(F50=[1]سبتمبر!$J49,\"ok\",\"error\")","v":"ok"},{"$f":"F50-[1]سبتمبر!$J49","v":0},{"$f":"IF([1]سبتمبر!$J49>0,[1]سبتمبر!$C49,\" \")","v":" "},47,null,0]
[{"$f":"IF(F51=[1]سبتمبر!$J50,\"ok\",\"error\")","v":"ok"},{"$f":"F51-[1]سبتمبر!$J50","v":0},{"$f":"IF([1]سبتمبر!$J50>0,[1]سبتمبر!$C50,\" \")","v":" "},48,null,0]
[{"$f":"IF(F52=[1]سبتمبر!$J51,\"ok\",\"error\")","v":"ok"},{"$f":"F52-[1]سبتمبر!$J51","v":0},{"$f":"IF([1]سبتمبر!$J51>0,[1]سبتمبر!$C51,\" \")","v":" "},49,null,0]
[{"$f":"IF(F53=[1]سبتمبر!$J52,\"ok\",\"error\")","v":"ok"},{"$f":"F53-[1]سبتمبر!$J52","v":0},{"$f":"IF([1]سبتمبر!$J52>0,[1]سبتمبر!$C52,\" \")","v":" "},50,null,0]
[{"$f":"IF(F54=[1]سبتمبر!$J53,\"ok\",\"error\")","v":"ok"},{"$f":"F54-[1]سبتمبر!$J53","v":0},{"$f":"IF([1]سبتمبر!$J53>0,[1]سبتمبر!$C53,\" \")","v":" "},51,null,0]
[{"$f":"IF(F55=[1]سبتمبر!$J54,\"ok\",\"error\")","v":"ok"},{"$f":"F55-[1]سبتمبر!$J54","v":0},{"$f":"IF([1]سبتمبر!$J54>0,[1]سبتمبر!$C54,\" \")","v":" "},52,null,0]
[{"$f":"IF(F56=[1]سبتمبر!$J55,\"ok\",\"error\")","v":"ok"},{"$f":"F56-[1]سبتمبر!$J55","v":0},{"$f":"IF([1]سبتمبر!$J55>0,[1]سبتمبر!$C55,\" \")","v":" "},53,null,0]
[{"$f":"IF(F57=[1]سبتمبر!$J56,\"ok\",\"error\")","v":"ok"},{"$f":"F57-[1]سبتمبر!$J56","v":0},{"$f":"IF([1]سبتمبر!$J56>0,[1]سبتمبر!$C56,\" \")","v":" "},54,null,0]
[{"$f":"IF(F58=[1]سبتمبر!$J57,\"ok\",\"error\")","v":"ok"},{"$f":"F58-[1]سبتمبر!$J57","v":0},{"$f":"IF([1]سبتمبر!$J57>0,[1]سبتمبر!$C57,\" \")","v":" "},55,null,0]
[{"$f":"IF(F59=[1]سبتمبر!$J58,\"ok\",\"error\")","v":"ok"},{"$f":"F59-[1]سبتمبر!$J58","v":0},{"$f":"IF([1]سبتمبر!$J58>0,[1]سبتمبر!$C58,\" \")","v":" "},56,null,0]
[{"$f":"IF(F60=[1]سبتمبر!$J59,\"ok\",\"error\")","v":"ok"},{"$f":"F60-[1]سبتمبر!$J59","v":0},{"$f":"IF([1]سبتمبر!$J59>0,[1]سبتمبر!$C59,\" \")","v":" "},57,null,0]
[{"$f":"IF(F61=[1]سبتمبر!$J60,\"ok\",\"error\")","v":"ok"},{"$f":"F61-[1]سبتمبر!$J60","v":0},{"$f":"IF([1]سبتمبر!$J60>0,[1]سبتمبر!$C60,\" \")","v":" "},58,null,0]
[{"$f":"IF(F62=[1]سبتمبر!$J61,\"ok\",\"error\")","v":"ok"},{"$f":"F62-[1]سبتمبر!$J61","v":0},{"$f":"IF([1]سبتمبر!$J61>0,[1]سبتمبر!$C61,\" \")","v":" "},59,null,0]
[{"$f":"IF(F63=[1]سبتمبر!$J62,\"ok\",\"error\")","v":"ok"},{"$f":"F63-[1]سبتمبر!$J62","v":0},{"$f":"IF([1]سبتمبر!$J62>0,[1]سبتمبر!$C62,\" \")","v":" "},60,null,0]
[{"$f":"IF(F64=[1]سبتمبر!$J63,\"ok\",\"error\")","v":"ok"},{"$f":"F64-[1]سبتمبر!$J63","v":0},{"$f":"IF([1]سبتمبر!$J63>0,[1]سبتمبر!$C63,\" \")","v":" "},61,null,0]
[{"$f":"IF(F65=[1]سبتمبر!$J64,\"ok\",\"error\")","v":"ok"},{"$f":"F65-[1]سبتمبر!$J64","v":0},{"$f":"IF([1]سبتمبر!$J64>0,[1]سبتمبر!$C64,\" \")","v":" "},62,null,0]
[{"$f":"IF(F66=[1]سبتمبر!$J65,\"ok\",\"error\")","v":"ok"},{"$f":"F66-[1]سبتمبر!$J65","v":0},{"$f":"IF([1]سبتمبر!$J65>0,[1]سبتمبر!$C65,\" \")","v":" "},63,null,0]
[{"$f":"IF(F67=[1]سبتمبر!$J66,\"ok\",\"error\")","v":"ok"},{"$f":"F67-[1]سبتمبر!$J66","v":0},{"$f":"IF([1]سبتمبر!$J66>0,[1]سبتمبر!$C66,\" \")","v":" "},64,null,0]
[{"$f":"IF(F68=[1]سبتمبر!$J67,\"ok\",\"error\")","v":"ok"},{"$f":"F68-[1]سبتمبر!$J67","v":0},{"$f":"IF([1]سبتمبر!$J67>0,[1]سبتمبر!$C67,\" \")","v":" "},65,null,{"$f":"SUM(G68:AX68)","v":0}]
[{"$f":"IF(F69=[1]سبتمبر!$J68,\"ok\",\"error\")","v":"ok"},{"$f":"F69-[1]سبتمبر!$J68","v":0},{"$f":"IF([1]سبتمبر!$J68>0,[1]سبتمبر!$C68,\" \")","v":" "},66,null,0]
[{"$f":"IF(F70=[1]سبتمبر!$J69,\"ok\",\"error\")","v":"ok"},{"$f":"F70-[1]سبتمبر!$J69","v":0},{"$f":"IF([1]سبتمبر!$J69>0,[1]سبتمبر!$C69,\" \")","v":" "},67,null,0]
[{"$f":"IF(F71=[1]سبتمبر!$J70,\"ok\",\"error\")","v":"ok"},{"$f":"F71-[1]سبتمبر!$J70","v":0},{"$f":"IF([1]سبتمبر!$J70>0,[1]سبتمبر!$C70,\" \")","v":" "},68,null,0]
[{"$f":"IF(F72=[1]سبتمبر!$J71,\"ok\",\"error\")","v":"ok"},{"$f":"F72-[1]سبتمبر!$J71","v":0},{"$f":"IF([1]سبتمبر!$J71>0,[1]سبتمبر!$C71,\" \")","v":" "},69,null,0]
[{"$f":"IF(F73=[1]سبتمبر!$J72,\"ok\",\"error\")","v":"ok"},{"$f":"F73-[1]سبتمبر!$J72","v":0},{"$f":"IF([1]سبتمبر!$J72>0,[1]سبتمبر!$C72,\" \")","v":" "},70,null,0]
[{"$f":"IF(F74=[1]سبتمبر!$J73,\"ok\",\"error\")","v":"ok"},{"$f":"F74-[1]سبتمبر!$J73","v":0},{"$f":"IF([1]سبتمبر!$J73>0,[1]سبتمبر!$C73,\" \")","v":" "},71,null,0]
[{"$f":"IF(F75=[1]سبتمبر!$J74,\"ok\",\"error\")","v":"ok"},{"$f":"F75-[1]سبتمبر!$J74","v":0},{"$f":"IF([1]سبتمبر!$J74>0,[1]سبتمبر!$C74,\" \")","v":" "},72,null,0]
[{"$f":"IF(F76=[1]سبتمبر!$J75,\"ok\",\"error\")","v":"ok"},{"$f":"F76-[1]سبتمبر!$J75","v":0},{"$f":"IF([1]سبتمبر!$J75>0,[1]سبتمبر!$C75,\" \")","v":" "},73,null,0]
[{"$f":"IF(F77=[1]سبتمبر!$J76,\"ok\",\"error\")","v":"ok"},{"$f":"F77-[1]سبتمبر!$J76","v":0},{"$f":"IF([1]سبتمبر!$J76>0,[1]سبتمبر!$C76,\" \")","v":" "},74,null,0]
[{"$f":"IF(F78=[1]سبتمبر!$J77,\"ok\",\"error\")","v":"ok"},{"$f":"F78-[1]سبتمبر!$J77","v":0},{"$f":"IF([1]سبتمبر!$J77>0,[1]سبتمبر!$C77,\" \")","v":" "},75,null,0]
[{"$f":"IF(F79=[1]سبتمبر!$J78,\"ok\",\"error\")","v":"ok"},{"$f":"F79-[1]سبتمبر!$J78","v":0},{"$f":"IF([1]سبتمبر!$J78>0,[1]سبتمبر!$C78,\" \")","v":" "},76,null,0]
[{"$f":"IF(F80=[1]سبتمبر!$J79,\"ok\",\"error\")","v":"ok"},{"$f":"F80-[1]سبتمبر!$J79","v":0},{"$f":"IF([1]سبتمبر!$J79>0,[1]سبتمبر!$C79,\" \")","v":" "},77,null,0]
[{"$f":"IF(F81=[1]سبتمبر!$J80,\"ok\",\"error\")","v":"ok"},{"$f":"F81-[1]سبتمبر!$J80","v":0},{"$f":"IF([1]سبتمبر!$J80>0,[1]سبتمبر!$C80,\" \")","v":" "},78,null,0]
[{"$f":"IF(F82=[1]سبتمبر!$J81,\"ok\",\"error\")","v":"ok"},{"$f":"F82-[1]سبتمبر!$J81","v":0},{"$f":"IF([1]سبتمبر!$J81>0,[1]سبتمبر!$C81,\" \")","v":" "},79,null,0]
[{"$f":"IF(F83=[1]سبتمبر!$J82,\"ok\",\"error\")","v":"ok"},{"$f":"F83-[1]سبتمبر!$J82","v":0},{"$f":"IF([1]سبتمبر!$J82>0,[1]سبتمبر!$C82,\" \")","v":" "},80,null,0]
[{"$f":"IF(F84=[1]سبتمبر!$J83,\"ok\",\"error\")","v":"ok"},{"$f":"F84-[1]سبتمبر!$J83","v":0},{"$f":"IF([1]سبتمبر!$J83>0,[1]سبتمبر!$C83,\" \")","v":" "},81,null,0]
[{"$f":"IF(F85=[1]سبتمبر!$J84,\"ok\",\"error\")","v":"ok"},{"$f":"F85-[1]سبتمبر!$J84","v":0},{"$f":"IF([1]سبتمبر!$J84>0,[1]سبتمبر!$C84,\" \")","v":" "},82,null,0]
[{"$f":"IF(F86=[1]سبتمبر!$J85,\"ok\",\"error\")","v":"ok"},{"$f":"F86-[1]سبتمبر!$J85","v":0},{"$f":"IF([1]سبتمبر!$J85>0,[1]سبتمبر!$C85,\" \")","v":" "},83,null,0]
[{"$f":"IF(F87=[1]سبتمبر!$J86,\"ok\",\"error\")","v":"ok"},{"$f":"F87-[1]سبتمبر!$J86","v":0},{"$f":"IF([1]سبتمبر!$J86>0,[1]سبتمبر!$C86,\" \")","v":" "},84,null,0]
[{"$f":"IF(F88=[1]سبتمبر!$J87,\"ok\",\"error\")","v":"ok"},{"$f":"F88-[1]سبتمبر!$J87","v":0},{"$f":"IF([1]سبتمبر!$J87>0,[1]سبتمبر!$C87,\" \")","v":" "},85,null,0]
[{"$f":"IF(F89=[1]سبتمبر!$J88,\"ok\",\"error\")","v":"ok"},{"$f":"F89-[1]سبتمبر!$J88","v":0},{"$f":"IF([1]سبتمبر!$J88>0,[1]سبتمبر!$C88,\" \")","v":" "},86,null,0]
[{"$f":"IF(F90=[1]سبتمبر!$J89,\"ok\",\"error\")","v":"ok"},{"$f":"F90-[1]سبتمبر!$J89","v":0},{"$f":"IF([1]سبتمبر!$J89>0,[1]سبتمبر!$C89,\" \")","v":" "},87,null,0]
[{"$f":"IF(F91=[1]سبتمبر!$J90,\"ok\",\"error\")","v":"ok"},{"$f":"F91-[1]سبتمبر!$J90","v":0},{"$f":"IF([1]سبتمبر!$J90>0,[1]سبتمبر!$C90,\" \")","v":" "},88,null,0]
[{"$f":"IF(F92=[1]سبتمبر!$J91,\"ok\",\"error\")","v":"ok"},{"$f":"F92-[1]سبتمبر!$J91","v":0},{"$f":"IF([1]سبتمبر!$J91>0,[1]سبتمبر!$C91,\" \")","v":" "},89,null,0]
[{"$f":"IF(F93=[1]سبتمبر!$J92,\"ok\",\"error\")","v":"ok"},{"$f":"F93-[1]سبتمبر!$J92","v":0},{"$f":"IF([1]سبتمبر!$J92>0,[1]سبتمبر!$C92,\" \")","v":" "},90,null,0]
[{"$f":"IF(F94=[1]سبتمبر!$J93,\"ok\",\"error\")","v":"ok"},{"$f":"F94-[1]سبتمبر!$J93","v":0},{"$f":"IF([1]سبتمبر!$J93>0,[1]سبتمبر!$C93,\" \")","v":" "},91,null,0]
[{"$f":"IF(F95=[1]سبتمبر!$J94,\"ok\",\"error\")","v":"ok"},{"$f":"F95-[1]سبتمبر!$J94","v":0},{"$f":"IF([1]سبتمبر!$J94>0,[1]سبتمبر!$C94,\" \")","v":" "},92,null,0]
[{"$f":"IF(F96=[1]سبتمبر!$J95,\"ok\",\"error\")","v":"ok"},{"$f":"F96-[1]سبتمبر!$J95","v":0},{"$f":"IF([1]سبتمبر!$J95>0,[1]سبتمبر!$C95,\" \")","v":" "},93,null,0]
[{"$f":"IF(F97=[1]سبتمبر!$J96,\"ok\",\"error\")","v":"ok"},{"$f":"F97-[1]سبتمبر!$J96","v":0},{"$f":"IF([1]سبتمبر!$J96>0,[1]سبتمبر!$C96,\" \")","v":" "},94,null,0]
[{"$f":"IF(F98=[1]سبتمبر!$J97,\"ok\",\"error\")","v":"ok"},{"$f":"F98-[1]سبتمبر!$J97","v":0},{"$f":"IF([1]سبتمبر!$J97>0,[1]سبتمبر!$C97,\" \")","v":" "},95,null,0]
[{"$f":"IF(F99=[1]سبتمبر!$J98,\"ok\",\"error\")","v":"ok"},{"$f":"F99-[1]سبتمبر!$J98","v":0},{"$f":"IF([1]سبتمبر!$J98>0,[1]سبتمبر!$C98,\" \")","v":" "},96,null,0]
[{"$f":"IF(F100=[1]سبتمبر!$J99,\"ok\",\"error\")","v":"ok"},{"$f":"F100-[1]سبتمبر!$J99","v":0},{"$f":"IF([1]سبتمبر!$J99>0,[1]سبتمبر!$C99,\" \")","v":" "},97,null,{"$f":"SUM(G100:AX100)","v":0}]
[{"$f":"IF(F101=[1]سبتمبر!$J100,\"ok\",\"error\")","v":"ok"},{"$f":"F101-[1]سبتمبر!$J100","v":0},{"$f":"IF([1]سبتمبر!$J100>0,[1]سبتمبر!$C100,\" \")","v":" "},98,null,{"$f":"SUM(G101:AX101)","v":0}]
[{"$f":"IF(F102=[1]سبتمبر!$J101,\"ok\",\"error\")","v":"ok"},{"$f":"F102-[1]سبتمبر!$J101","v":0},{"$f":"IF([1]سبتمبر!$J101>0,[1]سبتمبر!$C101,\" \")","v":" "},99,null,{"$f":"SUM(G102:AX102)","v":0}]
[{"$f":"IF(F103=[1]سبتمبر!$J102,\"ok\",\"error\")","v":"ok"},{"$f":"F103-[1]سبتمبر!$J102","v":0},{"$f":"IF([1]سبتمبر!$J102>0,[1]سبتمبر!$C102,\" \")","v":" "},100,null,{"$f":"SUM(G103:AX103)","v":0}]
[{"$f":"IF(F104=[1]سبتمبر!$J103,\"ok\",\"error\")","v":"ok"},{"$f":"F104-[1]سبتمبر!$J103","v":0},"الإجمالى",null,null,{"$f":"SUM(F4:F103)","v":0},0,0,0,0,0,0,0,0,0,0,0,0,0,0,0,0,0,0,0,0,0,0,0,0,0,0,0,0,0]
[]
[null,null,null,null,"؟",{"$f":"F104-[1]سبتمبر!$J$103","v":0}]

{"sheet":"أكتوبر","index":9,"n_rows":106,"n_cols":35,"rows_kept":106,"cut":false,"hidden":false,"merged":[[1,38,2,38],[1,39,2,39],[1,10,2,10],[1,8,2,8],[1,34,2,34],[1,35,2,35],[1,36,2,36],[1,37,2,37],[1,30,2,30],[1,31,2,31],[1,32,2,32],[1,33,2,33],[1,26,2,26],[1,27,2,27],[1,28,2,28],[1,29,2,29],[1,22,2,22],[1,23,2,23],[1,24,2,24],[1,25,2,25],[1,18,2,18],[1,19,2,19],[1,20,2,20],[1,21,2,21],[1,15,2,15],[1,16,2,16],[1,17,2,17],[1,9,2,9],[1,11,2,11],[1,12,2,12],[1,13,2,13],[103,2,103,4],[1,2,2,2],[1,3,2,3],[1,4,2,4],[1,14,2,14],[0,2,0,14],[1,0,2,1],[1,5,2,5],[1,6,2,6],[1,7,2,7]]}
[null,null,"تحليـــــــــــــــــل مصـــــــــــــــروفات التشغيـــــــــــــــل عن شهـــــــــر أكتــــــــوبــــــــر لعام 201"]
["OR",null,"التاريخ","رقم القيد","البيان","الإجمالى",{"$f":"سبتمبر!G2","v":"صيانة\nواصلاح\nوقطع غيار"},{"$f":"سبتمبر!H2","v":"خامات تشغيل"},{"$f":"سبتمبر!I2","v":"م سيارات"},{"$f":"سبتمبر!J2","v":"كهرباء"},{"$f":"سبتمبر!K2","v":"م نظافة"},{"$f":"سبتمبر!L2","v":"مياه"},{"$f":"سبتمبر!M2","v":"تأمينات"},{"$f":"سبتمبر!N2","v":"أجور"},{"$f":"سبتمبر!O2","v":0},{"$f":"سبتمبر!P2","v":0},{"$f":"سبتمبر!Q2","v":0},{"$f":"سبتمبر!R2","v":0},{"$f":"سبتمبر!S2","v":0},{"$f":"سبتمبر!T2","v":0},{"$f":"سبتمبر!U2","v":0},{"$f":"سبتمبر!V2","v":0},{"$f":"سبتمبر!W2","v":0},{"$f":"سبتمبر!X2","v":0},{"$f":"سبتمبر!Y2","v":0},{"$f":"سبتمبر!Z2","v":0},{"$f":"سبتمبر!AA2","v":0},{"$f":"سبتمبر!AB2","v":0},{"$f":"سبتمبر!AC2","v":0},{"$f":"سبتمبر!AD2","v":0}]
[]
[{"$f":"IF(F4=[1]أكتوبر!$J3,\"ok\",\"error\")","v":"ok"},{"$f":"F4-[1]أكتوبر!$J3","v":0},{"$f":"IF([1]أكتوبر!$J3>0,[1]أكتوبر!$C3,\" \")","v":" "},1,null,{"$f":"SUM(G4:AX4)","v":0}]
[{"$f":"IF(F5=[1]أكتوبر!$J4,\"ok\",\"error\")","v":"ok"},{"$f":"F5-[1]أكتوبر!$J4","v":0},{"$f":"IF([1]أكتوبر!$J4>0,[1]أكتوبر!$C4,\" \")","v":" "},2,null,0]
[{"$f":"IF(F6=[1]أكتوبر!$J5,\"ok\",\"error\")","v":"ok"},{"$f":"F6-[1]أكتوبر!$J5","v":0},{"$f":"IF([1]أكتوبر!$J5>0,[1]أكتوبر!$C5,\" \")","v":" "},3,null,0]
[{"$f":"IF(F7=[1]أكتوبر!$J6,\"ok\",\"error\")","v":"ok"},{"$f":"F7-[1]أكتوبر!$J6","v":0},{"$f":"IF([1]أكتوبر!$J6>0,[1]أكتوبر!$C6,\" \")","v":" "},4,null,0]
[{"$f":"IF(F8=[1]أكتوبر!$J7,\"ok\",\"error\")","v":"ok"},{"$f":"F8-[1]أكتوبر!$J7","v":0},{"$f":"IF([1]أكتوبر!$J7>0,[1]أكتوبر!$C7,\" \")","v":" "},5,null,0]
[{"$f":"IF(F9=[1]أكتوبر!$J8,\"ok\",\"error\")","v":"ok"},{"$f":"F9-[1]أكتوبر!$J8","v":0},{"$f":"IF([1]أكتوبر!$J8>0,[1]أكتوبر!$C8,\" \")","v":" "},6,null,0]
[{"$f":"IF(F10=[1]أكتوبر!$J9,\"ok\",\"error\")","v":"ok"},{"$f":"F10-[1]أكتوبر!$J9","v":0},{"$f":"IF([1]أكتوبر!$J9>0,[1]أكتوبر!$C9,\" \")","v":" "},7,null,0]
[{"$f":"IF(F11=[1]أكتوبر!$J10,\"ok\",\"error\")","v":"ok"},{"$f":"F11-[1]أكتوبر!$J10","v":0},{"$f":"IF([1]أكتوبر!$J10>0,[1]أكتوبر!$C10,\" \")","v":" "},8,null,0]
[{"$f":"IF(F12=[1]أكتوبر!$J11,\"ok\",\"error\")","v":"ok"},{"$f":"F12-[1]أكتوبر!$J11","v":0},{"$f":"IF([1]أكتوبر!$J11>0,[1]أكتوبر!$C11,\" \")","v":" "},9,null,0]
[{"$f":"IF(F13=[1]أكتوبر!$J12,\"ok\",\"error\")","v":"ok"},{"$f":"F13-[1]أكتوبر!$J12","v":0},{"$f":"IF([1]أكتوبر!$J12>0,[1]أكتوبر!$C12,\" \")","v":" "},10,null,0]
[{"$f":"IF(F14=[1]أكتوبر!$J13,\"ok\",\"error\")","v":"ok"},{"$f":"F14-[1]أكتوبر!$J13","v":0},{"$f":"IF([1]أكتوبر!$J13>0,[1]أكتوبر!$C13,\" \")","v":" "},11,null,0]
[{"$f":"IF(F15=[1]أكتوبر!$J14,\"ok\",\"error\")","v":"ok"},{"$f":"F15-[1]أكتوبر!$J14","v":0},{"$f":"IF([1]أكتوبر!$J14>0,[1]أكتوبر!$C14,\" \")","v":" "},12,null,0]
[{"$f":"IF(F16=[1]أكتوبر!$J15,\"ok\",\"error\")","v":"ok"},{"$f":"F16-[1]أكتوبر!$J15","v":0},{"$f":"IF([1]أكتوبر!$J15>0,[1]أكتوبر!$C15,\" \")","v":" "},13,null,0]
[{"$f":"IF(F17=[1]أكتوبر!$J16,\"ok\",\"error\")","v":"ok"},{"$f":"F17-[1]أكتوبر!$J16","v":0},{"$f":"IF([1]أكتوبر!$J16>0,[1]أكتوبر!$C16,\" \")","v":" "},14,null,0]
[{"$f":"IF(F18=[1]أكتوبر!$J17,\"ok\",\"error\")","v":"ok"},{"$f":"F18-[1]أكتوبر!$J17","v":0},{"$f":"IF([1]أكتوبر!$J17>0,[1]أكتوبر!$C17,\" \")","v":" "},15,null,0]
[{"$f":"IF(F19=[1]أكتوبر!$J18,\"ok\",\"error\")","v":"ok"},{"$f":"F19-[1]أكتوبر!$J18","v":0},{"$f":"IF([1]أكتوبر!$J18>0,[1]أكتوبر!$C18,\" \")","v":" "},16,null,0]
[{"$f":"IF(F20=[1]أكتوبر!$J19,\"ok\",\"error\")","v":"ok"},{"$f":"F20-[1]أكتوبر!$J19","v":0},{"$f":"IF([1]أكتوبر!$J19>0,[1]أكتوبر!$C19,\" \")","v":" "},17,null,0]
[{"$f":"IF(F21=[1]أكتوبر!$J20,\"ok\",\"error\")","v":"ok"},{"$f":"F21-[1]أكتوبر!$J20","v":0},{"$f":"IF([1]أكتوبر!$J20>0,[1]أكتوبر!$C20,\" \")","v":" "},18,null,0]
[{"$f":"IF(F22=[1]أكتوبر!$J21,\"ok\",\"error\")","v":"ok"},{"$f":"F22-[1]أكتوبر!$J21","v":0},{"$f":"IF([1]أكتوبر!$J21>0,[1]أكتوبر!$C21,\" \")","v":" "},19,null,0]
[{"$f":"IF(F23=[1]أكتوبر!$J22,\"ok\",\"error\")","v":"ok"},{"$f":"F23-[1]أكتوبر!$J22","v":0},{"$f":"IF([1]أكتوبر!$J22>0,[1]أكتوبر!$C22,\" \")","v":" "},20,null,0]
[{"$f":"IF(F24=[1]أكتوبر!$J23,\"ok\",\"error\")","v":"ok"},{"$f":"F24-[1]أكتوبر!$J23","v":0},{"$f":"IF([1]أكتوبر!$J23>0,[1]أكتوبر!$C23,\" \")","v":" "},21,null,0]
[{"$f":"IF(F25=[1]أكتوبر!$J24,\"ok\",\"error\")","v":"ok"},{"$f":"F25-[1]أكتوبر!$J24","v":0},{"$f":"IF([1]أكتوبر!$J24>0,[1]أكتوبر!$C24,\" \")","v":" "},22,null,0]
[{"$f":"IF(F26=[1]أكتوبر!$J25,\"ok\",\"error\")","v":"ok"},{"$f":"F26-[1]أكتوبر!$J25","v":0},{"$f":"IF([1]أكتوبر!$J25>0,[1]أكتوبر!$C25,\" \")","v":" "},23,null,0]
[{"$f":"IF(F27=[1]أكتوبر!$J26,\"ok\",\"error\")","v":"ok"},{"$f":"F27-[1]أكتوبر!$J26","v":0},{"$f":"IF([1]أكتوبر!$J26>0,[1]أكتوبر!$C26,\" \")","v":" "},24,null,0]
[{"$f":"IF(F28=[1]أكتوبر!$J27,\"ok\",\"error\")","v":"ok"},{"$f":"F28-[1]أكتوبر!$J27","v":0},{"$f":"IF([1]أكتوبر!$J27>0,[1]أكتوبر!$C27,\" \")","v":" "},25,null,0]
[{"$f":"IF(F29=[1]أكتوبر!$J28,\"ok\",\"error\")","v":"ok"},{"$f":"F29-[1]أكتوبر!$J28","v":0},{"$f":"IF([1]أكتوبر!$J28>0,[1]أكتوبر!$C28,\" \")","v":" "},26,null,0]
[{"$f":"IF(F30=[1]أكتوبر!$J29,\"ok\",\"error\")","v":"ok"},{"$f":"F30-[1]أكتوبر!$J29","v":0},{"$f":"IF([1]أكتوبر!$J29>0,[1]أكتوبر!$C29,\" \")","v":" "},27,null,0]
[{"$f":"IF(F31=[1]أكتوبر!$J30,\"ok\",\"error\")","v":"ok"},{"$f":"F31-[1]أكتوبر!$J30","v":0},{"$f":"IF([1]أكتوبر!$J30>0,[1]أكتوبر!$C30,\" \")","v":" "},28,null,0]
[{"$f":"IF(F32=[1]أكتوبر!$J31,\"ok\",\"error\")","v":"ok"},{"$f":"F32-[1]أكتوبر!$J31","v":0},{"$f":"IF([1]أكتوبر!$J31>0,[1]أكتوبر!$C31,\" \")","v":" "},29,null,0]
[{"$f":"IF(F33=[1]أكتوبر!$J32,\"ok\",\"error\")","v":"ok"},{"$f":"F33-[1]أكتوبر!$J32","v":0},{"$f":"IF([1]أكتوبر!$J32>0,[1]أكتوبر!$C32,\" \")","v":" "},30,null,0]
[{"$f":"IF(F34=[1]أكتوبر!$J33,\"ok\",\"error\")","v":"ok"},{"$f":"F34-[1]أكتوبر!$J33","v":0},{"$f":"IF([1]أكتوبر!$J33>0,[1]أكتوبر!$C33,\" \")","v":" "},31,null,0]
[{"$f":"IF(F35=[1]أكتوبر!$J34,\"ok\",\"error\")","v":"ok"},{"$f":"F35-[1]أكتوبر!$J34","v":0},{"$f":"IF([1]أكتوبر!$J34>0,[1]أكتوبر!$C34,\" \")","v":" "},32,null,0]
[{"$f":"IF(F36=[1]أكتوبر!$J35,\"ok\",\"error\")","v":"ok"},{"$f":"F36-[1]أكتوبر!$J35","v":0},{"$f":"IF([1]أكتوبر!$J35>0,[1]أكتوبر!$C35,\" \")","v":" "},33,null,{"$f":"SUM(G36:AX36)","v":0}]
[{"$f":"IF(F37=[1]أكتوبر!$J36,\"ok\",\"error\")","v":"ok"},{"$f":"F37-[1]أكتوبر!$J36","v":0},{"$f":"IF([1]أكتوبر!$J36>0,[1]أكتوبر!$C36,\" \")","v":" "},34,null,0]
[{"$f":"IF(F38=[1]أكتوبر!$J37,\"ok\",\"error\")","v":"ok"},{"$f":"F38-[1]أكتوبر!$J37","v":0},{"$f":"IF([1]أكتوبر!$J37>0,[1]أكتوبر!$C37,\" \")","v":" "},35,null,0]
[{"$f":"IF(F39=[1]أكتوبر!$J38,\"ok\",\"error\")","v":"ok"},{"$f":"F39-[1]أكتوبر!$J38","v":0},{"$f":"IF([1]أكتوبر!$J38>0,[1]أكتوبر!$C38,\" \")","v":" "},36,null,0]
[{"$f":"IF(F40=[1]أكتوبر!$J39,\"ok\",\"error\")","v":"ok"},{"$f":"F40-[1]أكتوبر!$J39","v":0},{"$f":"IF([1]أكتوبر!$J39>0,[1]أكتوبر!$C39,\" \")","v":" "},37,null,0]
[{"$f":"IF(F41=[1]أكتوبر!$J40,\"ok\",\"error\")","v":"ok"},{"$f":"F41-[1]أكتوبر!$J40","v":0},{"$f":"IF([1]أكتوبر!$J40>0,[1]أكتوبر!$C40,\" \")","v":" "},38,null,0]
[{"$f":"IF(F42=[1]أكتوبر!$J41,\"ok\",\"error\")","v":"ok"},{"$f":"F42-[1]أكتوبر!$J41","v":0},{"$f":"IF([1]أكتوبر!$J41>0,[1]أكتوبر!$C41,\" \")","v":" "},39,null,0]
[{"$f":"IF(F43=[1]أكتوبر!$J42,\"ok\",\"error\")","v":"ok"},{"$f":"F43-[1]أكتوبر!$J42","v":0},{"$f":"IF([1]أكتوبر!$J42>0,[1]أكتوبر!$C42,\" \")","v":" "},40,null,0]
[{"$f":"IF(F44=[1]أكتوبر!$J43,\"ok\",\"error\")","v":"ok"},{"$f":"F44-[1]أكتوبر!$J43","v":0},{"$f":"IF([1]أكتوبر!$J43>0,[1]أكتوبر!$C43,\" \")","v":" "},41,null,0]
[{"$f":"IF(F45=[1]أكتوبر!$J44,\"ok\",\"error\")","v":"ok"},{"$f":"F45-[1]أكتوبر!$J44","v":0},{"$f":"IF([1]أكتوبر!$J44>0,[1]أكتوبر!$C44,\" \")","v":" "},42,null,0]
[{"$f":"IF(F46=[1]أكتوبر!$J45,\"ok\",\"error\")","v":"ok"},{"$f":"F46-[1]أكتوبر!$J45","v":0},{"$f":"IF([1]أكتوبر!$J45>0,[1]أكتوبر!$C45,\" \")","v":" "},43,null,0]
[{"$f":"IF(F47=[1]أكتوبر!$J46,\"ok\",\"error\")","v":"ok"},{"$f":"F47-[1]أكتوبر!$J46","v":0},{"$f":"IF([1]أكتوبر!$J46>0,[1]أكتوبر!$C46,\" \")","v":" "},44,null,0]
[{"$f":"IF(F48=[1]أكتوبر!$J47,\"ok\",\"error\")","v":"ok"},{"$f":"F48-[1]أكتوبر!$J47","v":0},{"$f":"IF([1]أكتوبر!$J47>0,[1]أكتوبر!$C47,\" \")","v":" "},45,null,0]
[{"$f":"IF(F49=[1]أكتوبر!$J48,\"ok\",\"error\")","v":"ok"},{"$f":"F49-[1]أكتوبر!$J48","v":0},{"$f":"IF([1]أكتوبر!$J48>0,[1]أكتوبر!$C48,\" \")","v":" "},46,null,0]
[{"$f":"IF(F50=[1]أكتوبر!$J49,\"ok\",\"error\")","v":"ok"},{"$f":"F50-[1]أكتوبر!$J49","v":0},{"$f":"IF([1]أكتوبر!$J49>0,[1]أكتوبر!$C49,\" \")","v":" "},47,null,0]
[{"$f":"IF(F51=[1]أكتوبر!$J50,\"ok\",\"error\")","v":"ok"},{"$f":"F51-[1]أكتوبر!$J50","v":0},{"$f":"IF([1]أكتوبر!$J50>0,[1]أكتوبر!$C50,\" \")","v":" "},48,null,0]
[{"$f":"IF(F52=[1]أكتوبر!$J51,\"ok\",\"error\")","v":"ok"},{"$f":"F52-[1]أكتوبر!$J51","v":0},{"$f":"IF([1]أكتوبر!$J51>0,[1]أكتوبر!$C51,\" \")","v":" "},49,null,0]
[{"$f":"IF(F53=[1]أكتوبر!$J52,\"ok\",\"error\")","v":"ok"},{"$f":"F53-[1]أكتوبر!$J52","v":0},{"$f":"IF([1]أكتوبر!$J52>0,[1]أكتوبر!$C52,\" \")","v":" "},50,null,0]
[{"$f":"IF(F54=[1]أكتوبر!$J53,\"ok\",\"error\")","v":"ok"},{"$f":"F54-[1]أكتوبر!$J53","v":0},{"$f":"IF([1]أكتوبر!$J53>0,[1]أكتوبر!$C53,\" \")","v":" "},51,null,0]
[{"$f":"IF(F55=[1]أكتوبر!$J54,\"ok\",\"error\")","v":"ok"},{"$f":"F55-[1]أكتوبر!$J54","v":0},{"$f":"IF([1]أكتوبر!$J54>0,[1]أكتوبر!$C54,\" \")","v":" "},52,null,0]
[{"$f":"IF(F56=[1]أكتوبر!$J55,\"ok\",\"error\")","v":"ok"},{"$f":"F56-[1]أكتوبر!$J55","v":0},{"$f":"IF([1]أكتوبر!$J55>0,[1]أكتوبر!$C55,\" \")","v":" "},53,null,0]
[{"$f":"IF(F57=[1]أكتوبر!$J56,\"ok\",\"error\")","v":"ok"},{"$f":"F57-[1]أكتوبر!$J56","v":0},{"$f":"IF([1]أكتوبر!$J56>0,[1]أكتوبر!$C56,\" \")","v":" "},54,null,0]
[{"$f":"IF(F58=[1]أكتوبر!$J57,\"ok\",\"error\")","v":"ok"},{"$f":"F58-[1]أكتوبر!$J57","v":0},{"$f":"IF([1]أكتوبر!$J57>0,[1]أكتوبر!$C57,\" \")","v":" "},55,null,0]
[{"$f":"IF(F59=[1]أكتوبر!$J58,\"ok\",\"error\")","v":"ok"},{"$f":"F59-[1]أكتوبر!$J58","v":0},{"$f":"IF([1]أكتوبر!$J58>0,[1]أكتوبر!$C58,\" \")","v":" "},56,null,0]
[{"$f":"IF(F60=[1]أكتوبر!$J59,\"ok\",\"error\")","v":"ok"},{"$f":"F60-[1]أكتوبر!$J59","v":0},{"$f":"IF([1]أكتوبر!$J59>0,[1]أكتوبر!$C59,\" \")","v":" "},57,null,0]
[{"$f":"IF(F61=[1]أكتوبر!$J60,\"ok\",\"error\")","v":"ok"},{"$f":"F61-[1]أكتوبر!$J60","v":0},{"$f":"IF([1]أكتوبر!$J60>0,[1]أكتوبر!$C60,\" \")","v":" "},58,null,0]
[{"$f":"IF(F62=[1]أكتوبر!$J61,\"ok\",\"error\")","v":"ok"},{"$f":"F62-[1]أكتوبر!$J61","v":0},{"$f":"IF([1]أكتوبر!$J61>0,[1]أكتوبر!$C61,\" \")","v":" "},59,null,0]
[{"$f":"IF(F63=[1]أكتوبر!$J62,\"ok\",\"error\")","v":"ok"},{"$f":"F63-[1]أكتوبر!$J62","v":0},{"$f":"IF([1]أكتوبر!$J62>0,[1]أكتوبر!$C62,\" \")","v":" "},60,null,0]
[{"$f":"IF(F64=[1]أكتوبر!$J63,\"ok\",\"error\")","v":"ok"},{"$f":"F64-[1]أكتوبر!$J63","v":0},{"$f":"IF([1]أكتوبر!$J63>0,[1]أكتوبر!$C63,\" \")","v":" "},61,null,0]
[{"$f":"IF(F65=[1]أكتوبر!$J64,\"ok\",\"error\")","v":"ok"},{"$f":"F65-[1]أكتوبر!$J64","v":0},{"$f":"IF([1]أكتوبر!$J64>0,[1]أكتوبر!$C64,\" \")","v":" "},62,null,0]
[{"$f":"IF(F66=[1]أكتوبر!$J65,\"ok\",\"error\")","v":"ok"},{"$f":"F66-[1]أكتوبر!$J65","v":0},{"$f":"IF([1]أكتوبر!$J65>0,[1]أكتوبر!$C65,\" \")","v":" "},63,null,0]
[{"$f":"IF(F67=[1]أكتوبر!$J66,\"ok\",\"error\")","v":"ok"},{"$f":"F67-[1]أكتوبر!$J66","v":0},{"$f":"IF([1]أكتوبر!$J66>0,[1]أكتوبر!$C66,\" \")","v":" "},64,null,0]
[{"$f":"IF(F68=[1]أكتوبر!$J67,\"ok\",\"error\")","v":"ok"},{"$f":"F68-[1]أكتوبر!$J67","v":0},{"$f":"IF([1]أكتوبر!$J67>0,[1]أكتوبر!$C67,\" \")","v":" "},65,null,{"$f":"SUM(G68:AX68)","v":0}]
[{"$f":"IF(F69=[1]أكتوبر!$J68,\"ok\",\"error\")","v":"ok"},{"$f":"F69-[1]أكتوبر!$J68","v":0},{"$f":"IF([1]أكتوبر!$J68>0,[1]أكتوبر!$C68,\" \")","v":" "},66,null,0]
[{"$f":"IF(F70=[1]أكتوبر!$J69,\"ok\",\"error\")","v":"ok"},{"$f":"F70-[1]أكتوبر!$J69","v":0},{"$f":"IF([1]أكتوبر!$J69>0,[1]أكتوبر!$C69,\" \")","v":" "},67,null,0]
[{"$f":"IF(F71=[1]أكتوبر!$J70,\"ok\",\"error\")","v":"ok"},{"$f":"F71-[1]أكتوبر!$J70","v":0},{"$f":"IF([1]أكتوبر!$J70>0,[1]أكتوبر!$C70,\" \")","v":" "},68,null,0]
[{"$f":"IF(F72=[1]أكتوبر!$J71,\"ok\",\"error\")","v":"ok"},{"$f":"F72-[1]أكتوبر!$J71","v":0},{"$f":"IF([1]أكتوبر!$J71>0,[1]أكتوبر!$C71,\" \")","v":" "},69,null,0]
[{"$f":"IF(F73=[1]أكتوبر!$J72,\"ok\",\"error\")","v":"ok"},{"$f":"F73-[1]أكتوبر!$J72","v":0},{"$f":"IF([1]أكتوبر!$J72>0,[1]أكتوبر!$C72,\" \")","v":" "},70,null,0]
[{"$f":"IF(F74=[1]أكتوبر!$J73,\"ok\",\"error\")","v":"ok"},{"$f":"F74-[1]أكتوبر!$J73","v":0},{"$f":"IF([1]أكتوبر!$J73>0,[1]أكتوبر!$C73,\" \")","v":" "},71,null,0]
[{"$f":"IF(F75=[1]أكتوبر!$J74,\"ok\",\"error\")","v":"ok"},{"$f":"F75-[1]أكتوبر!$J74","v":0},{"$f":"IF([1]أكتوبر!$J74>0,[1]أكتوبر!$C74,\" \")","v":" "},72,null,0]
[{"$f":"IF(F76=[1]أكتوبر!$J75,\"ok\",\"error\")","v":"ok"},{"$f":"F76-[1]أكتوبر!$J75","v":0},{"$f":"IF([1]أكتوبر!$J75>0,[1]أكتوبر!$C75,\" \")","v":" "},73,null,0]
[{"$f":"IF(F77=[1]أكتوبر!$J76,\"ok\",\"error\")","v":"ok"},{"$f":"F77-[1]أكتوبر!$J76","v":0},{"$f":"IF([1]أكتوبر!$J76>0,[1]أكتوبر!$C76,\" \")","v":" "},74,null,0]
[{"$f":"IF(F78=[1]أكتوبر!$J77,\"ok\",\"error\")","v":"ok"},{"$f":"F78-[1]أكتوبر!$J77","v":0},{"$f":"IF([1]أكتوبر!$J77>0,[1]أكتوبر!$C77,\" \")","v":" "},75,null,0]
[{"$f":"IF(F79=[1]أكتوبر!$J78,\"ok\",\"error\")","v":"ok"},{"$f":"F79-[1]أكتوبر!$J78","v":0},{"$f":"IF([1]أكتوبر!$J78>0,[1]أكتوبر!$C78,\" \")","v":" "},76,null,0]
[{"$f":"IF(F80=[1]أكتوبر!$J79,\"ok\",\"error\")","v":"ok"},{"$f":"F80-[1]أكتوبر!$J79","v":0},{"$f":"IF([1]أكتوبر!$J79>0,[1]أكتوبر!$C79,\" \")","v":" "},77,null,0]
[{"$f":"IF(F81=[1]أكتوبر!$J80,\"ok\",\"error\")","v":"ok"},{"$f":"F81-[1]أكتوبر!$J80","v":0},{"$f":"IF([1]أكتوبر!$J80>0,[1]أكتوبر!$C80,\" \")","v":" "},78,null,0]
[{"$f":"IF(F82=[1]أكتوبر!$J81,\"ok\",\"error\")","v":"ok"},{"$f":"F82-[1]أكتوبر!$J81","v":0},{"$f":"IF([1]أكتوبر!$J81>0,[1]أكتوبر!$C81,\" \")","v":" "},79,null,0]
[{"$f":"IF(F83=[1]أكتوبر!$J82,\"ok\",\"error\")","v":"ok"},{"$f":"F83-[1]أكتوبر!$J82","v":0},{"$f":"IF([1]أكتوبر!$J82>0,[1]أكتوبر!$C82,\" \")","v":" "},80,null,0]
[{"$f":"IF(F84=[1]أكتوبر!$J83,\"ok\",\"error\")","v":"ok"},{"$f":"F84-[1]أكتوبر!$J83","v":0},{"$f":"IF([1]أكتوبر!$J83>0,[1]أكتوبر!$C83,\" \")","v":" "},81,null,0]
[{"$f":"IF(F85=[1]أكتوبر!$J84,\"ok\",\"error\")","v":"ok"},{"$f":"F85-[1]أكتوبر!$J84","v":0},{"$f":"IF([1]أكتوبر!$J84>0,[1]أكتوبر!$C84,\" \")","v":" "},82,null,0]
[{"$f":"IF(F86=[1]أكتوبر!$J85,\"ok\",\"error\")","v":"ok"},{"$f":"F86-[1]أكتوبر!$J85","v":0},{"$f":"IF([1]أكتوبر!$J85>0,[1]أكتوبر!$C85,\" \")","v":" "},83,null,0]
[{"$f":"IF(F87=[1]أكتوبر!$J86,\"ok\",\"error\")","v":"ok"},{"$f":"F87-[1]أكتوبر!$J86","v":0},{"$f":"IF([1]أكتوبر!$J86>0,[1]أكتوبر!$C86,\" \")","v":" "},84,null,0]
[{"$f":"IF(F88=[1]أكتوبر!$J87,\"ok\",\"error\")","v":"ok"},{"$f":"F88-[1]أكتوبر!$J87","v":0},{"$f":"IF([1]أكتوبر!$J87>0,[1]أكتوبر!$C87,\" \")","v":" "},85,null,0]
[{"$f":"IF(F89=[1]أكتوبر!$J88,\"ok\",\"error\")","v":"ok"},{"$f":"F89-[1]أكتوبر!$J88","v":0},{"$f":"IF([1]أكتوبر!$J88>0,[1]أكتوبر!$C88,\" \")","v":" "},86,null,0]
[{"$f":"IF(F90=[1]أكتوبر!$J89,\"ok\",\"error\")","v":"ok"},{"$f":"F90-[1]أكتوبر!$J89","v":0},{"$f":"IF([1]أكتوبر!$J89>0,[1]أكتوبر!$C89,\" \")","v":" "},87,null,0]
[{"$f":"IF(F91=[1]أكتوبر!$J90,\"ok\",\"error\")","v":"ok"},{"$f":"F91-[1]أكتوبر!$J90","v":0},{"$f":"IF([1]أكتوبر!$J90>0,[1]أكتوبر!$C90,\" \")","v":" "},88,null,0]
[{"$f":"IF(F92=[1]أكتوبر!$J91,\"ok\",\"error\")","v":"ok"},{"$f":"F92-[1]أكتوبر!$J91","v":0},{"$f":"IF([1]أكتوبر!$J91>0,[1]أكتوبر!$C91,\" \")","v":" "},89,null,0]
[{"$f":"IF(F93=[1]أكتوبر!$J92,\"ok\",\"error\")","v":"ok"},{"$f":"F93-[1]أكتوبر!$J92","v":0},{"$f":"IF([1]أكتوبر!$J92>0,[1]أكتوبر!$C92,\" \")","v":" "},90,null,0]
[{"$f":"IF(F94=[1]أكتوبر!$J93,\"ok\",\"error\")","v":"ok"},{"$f":"F94-[1]أكتوبر!$J93","v":0},{"$f":"IF([1]أكتوبر!$J93>0,[1]أكتوبر!$C93,\" \")","v":" "},91,null,0]
[{"$f":"IF(F95=[1]أكتوبر!$J94,\"ok\",\"error\")","v":"ok"},{"$f":"F95-[1]أكتوبر!$J94","v":0},{"$f":"IF([1]أكتوبر!$J94>0,[1]أكتوبر!$C94,\" \")","v":" "},92,null,0]
[{"$f":"IF(F96=[1]أكتوبر!$J95,\"ok\",\"error\")","v":"ok"},{"$f":"F96-[1]أكتوبر!$J95","v":0},{"$f":"IF([1]أكتوبر!$J95>0,[1]أكتوبر!$C95,\" \")","v":" "},93,null,0]
[{"$f":"IF(F97=[1]أكتوبر!$J96,\"ok\",\"error\")","v":"ok"},{"$f":"F97-[1]أكتوبر!$J96","v":0},{"$f":"IF([1]أكتوبر!$J96>0,[1]أكتوبر!$C96,\" \")","v":" "},94,null,0]
[{"$f":"IF(F98=[1]أكتوبر!$J97,\"ok\",\"error\")","v":"ok"},{"$f":"F98-[1]أكتوبر!$J97","v":0},{"$f":"IF([1]أكتوبر!$J97>0,[1]أكتوبر!$C97,\" \")","v":" "},95,null,0]
[{"$f":"IF(F99=[1]أكتوبر!$J98,\"ok\",\"error\")","v":"ok"},{"$f":"F99-[1]أكتوبر!$J98","v":0},{"$f":"IF([1]أكتوبر!$J98>0,[1]أكتوبر!$C98,\" \")","v":" "},96,null,0]
[{"$f":"IF(F100=[1]أكتوبر!$J99,\"ok\",\"error\")","v":"ok"},{"$f":"F100-[1]أكتوبر!$J99","v":0},{"$f":"IF([1]أكتوبر!$J99>0,[1]أكتوبر!$C99,\" \")","v":" "},97,null,{"$f":"SUM(G100:AX100)","v":0}]
[{"$f":"IF(F101=[1]أكتوبر!$J100,\"ok\",\"error\")","v":"ok"},{"$f":"F101-[1]أكتوبر!$J100","v":0},{"$f":"IF([1]أكتوبر!$J100>0,[1]أكتوبر!$C100,\" \")","v":" "},98,null,{"$f":"SUM(G101:AX101)","v":0}]
[{"$f":"IF(F102=[1]أكتوبر!$J101,\"ok\",\"error\")","v":"ok"},{"$f":"F102-[1]أكتوبر!$J101","v":0},{"$f":"IF([1]أكتوبر!$J101>0,[1]أكتوبر!$C101,\" \")","v":" "},99,null,{"$f":"SUM(G102:AX102)","v":0}]
[{"$f":"IF(F103=[1]أكتوبر!$J102,\"ok\",\"error\")","v":"ok"},{"$f":"F103-[1]أكتوبر!$J102","v":0},{"$f":"IF([1]أكتوبر!$J102>0,[1]أكتوبر!$C102,\" \")","v":" "},100,null,{"$f":"SUM(G103:AX103)","v":0}]
[{"$f":"IF(F104=[1]أكتوبر!$J103,\"ok\",\"error\")","v":"ok"},{"$f":"F104-[1]أكتوبر!$J103","v":0},"الإجمالى",null,null,{"$f":"SUM(F4:F103)","v":0},0,0,0,0,0,0,0,0,0,0,0,0,0,0,0,0,0,0,0,0,0,0,0,0,0,0,0,0,0]
[]
[null,null,null,null,"؟",{"$f":"F104-[1]أكتوبر!$J$103","v":0}]

{"sheet":"نوفمبر","index":10,"n_rows":106,"n_cols":35,"rows_kept":106,"cut":false,"hidden":false,"merged":[[1,7,2,7],[1,9,2,9],[103,2,103,4],[1,2,2,2],[1,3,2,3],[1,4,2,4],[1,5,2,5],[1,6,2,6],[1,22,2,22],[1,11,2,11],[1,12,2,12],[1,13,2,13],[1,14,2,14],[1,15,2,15],[1,16,2,16],[1,17,2,17],[1,18,2,18],[1,19,2,19],[1,20,2,20],[1,21,2,21],[1,33,2,33],[1,26,2,26],[1,27,2,27],[1,28,2,28],[1,29,2,29],[0,2,0,14],[1,0,2,1],[1,38,2,38],[1,39,2,39],[1,10,2,10],[1,8,2,8],[1,34,2,34],[1,35,2,35],[1,36,2,36],[1,37,2,37],[1,30,2,30],[1,23,2,23],[1,24,2,24],[1,25,2,25],[1,31,2,31],[1,32,2,32]]}
[null,null,"تحليـــــــــــــــــل مصـــــــــــــــروفات التشغيـــــــــــــــل عن شهـــــــــر نوفمبــــــــــر لعام 201"]
["OR",null,"التاريخ","رقم القيد","البيان","الإجمالى",{"$f":"أكتوبر!G2","v":"صيانة\nواصلاح\nوقطع غيار"},{"$f":"أكتوبر!H2","v":"خامات تشغيل"},{"$f":"أكتوبر!I2","v":"م سيارات"},{"$f":"أكتوبر!J2","v":"كهرباء"},{"$f":"أكتوبر!K2","v":"م نظافة"},{"$f":"أكتوبر!L2","v":"مياه"},{"$f":"أكتوبر!M2","v":"تأمينات"},{"$f":"أكتوبر!N2","v":"أجور"},{"$f":"أكتوبر!O2","v":0},{"$f":"أكتوبر!P2","v":0},{"$f":"أكتوبر!Q2","v":0},{"$f":"أكتوبر!R2","v":0},{"$f":"أكتوبر!S2","v":0},{"$f":"أكتوبر!T2","v":0},{"$f":"أكتوبر!U2","v":0},{"$f":"أكتوبر!V2","v":0},{"$f":"أكتوبر!W2","v":0},{"$f":"أكتوبر!X2","v":0},{"$f":"أكتوبر!Y2","v":0},{"$f":"أكتوبر!Z2","v":0},{"$f":"أكتوبر!AA2","v":0},{"$f":"أكتوبر!AB2","v":0},{"$f":"أكتوبر!AC2","v":0},{"$f":"أكتوبر!AD2","v":0}]
[]
[{"$f":"IF(F4=[1]نوفمبر!$J3,\"ok\",\"error\")","v":"ok"},{"$f":"F4-[1]نوفمبر!$J3","v":0},{"$f":"IF([1]نوفمبر!$J3>0,[1]نوفمبر!$C3,\" \")","v":" "},1,null,{"$f":"SUM(G4:AX4)","v":0}]
[{"$f":"IF(F5=[1]نوفمبر!$J4,\"ok\",\"error\")","v":"ok"},{"$f":"F5-[1]نوفمبر!$J4","v":0},{"$f":"IF([1]نوفمبر!$J4>0,[1]نوفمبر!$C4,\" \")","v":" "},2,null,0]
[{"$f":"IF(F6=[1]نوفمبر!$J5,\"ok\",\"error\")","v":"ok"},{"$f":"F6-[1]نوفمبر!$J5","v":0},{"$f":"IF([1]نوفمبر!$J5>0,[1]نوفمبر!$C5,\" \")","v":" "},3,null,0]
[{"$f":"IF(F7=[1]نوفمبر!$J6,\"ok\",\"error\")","v":"ok"},{"$f":"F7-[1]نوفمبر!$J6","v":0},{"$f":"IF([1]نوفمبر!$J6>0,[1]نوفمبر!$C6,\" \")","v":" "},4,null,0]
[{"$f":"IF(F8=[1]نوفمبر!$J7,\"ok\",\"error\")","v":"ok"},{"$f":"F8-[1]نوفمبر!$J7","v":0},{"$f":"IF([1]نوفمبر!$J7>0,[1]نوفمبر!$C7,\" \")","v":" "},5,null,0]
[{"$f":"IF(F9=[1]نوفمبر!$J8,\"ok\",\"error\")","v":"ok"},{"$f":"F9-[1]نوفمبر!$J8","v":0},{"$f":"IF([1]نوفمبر!$J8>0,[1]نوفمبر!$C8,\" \")","v":" "},6,null,0]
[{"$f":"IF(F10=[1]نوفمبر!$J9,\"ok\",\"error\")","v":"ok"},{"$f":"F10-[1]نوفمبر!$J9","v":0},{"$f":"IF([1]نوفمبر!$J9>0,[1]نوفمبر!$C9,\" \")","v":" "},7,null,0]
[{"$f":"IF(F11=[1]نوفمبر!$J10,\"ok\",\"error\")","v":"ok"},{"$f":"F11-[1]نوفمبر!$J10","v":0},{"$f":"IF([1]نوفمبر!$J10>0,[1]نوفمبر!$C10,\" \")","v":" "},8,null,0]
[{"$f":"IF(F12=[1]نوفمبر!$J11,\"ok\",\"error\")","v":"ok"},{"$f":"F12-[1]نوفمبر!$J11","v":0},{"$f":"IF([1]نوفمبر!$J11>0,[1]نوفمبر!$C11,\" \")","v":" "},9,null,0]
[{"$f":"IF(F13=[1]نوفمبر!$J12,\"ok\",\"error\")","v":"ok"},{"$f":"F13-[1]نوفمبر!$J12","v":0},{"$f":"IF([1]نوفمبر!$J12>0,[1]نوفمبر!$C12,\" \")","v":" "},10,null,0]
[{"$f":"IF(F14=[1]نوفمبر!$J13,\"ok\",\"error\")","v":"ok"},{"$f":"F14-[1]نوفمبر!$J13","v":0},{"$f":"IF([1]نوفمبر!$J13>0,[1]نوفمبر!$C13,\" \")","v":" "},11,null,0]
[{"$f":"IF(F15=[1]نوفمبر!$J14,\"ok\",\"error\")","v":"ok"},{"$f":"F15-[1]نوفمبر!$J14","v":0},{"$f":"IF([1]نوفمبر!$J14>0,[1]نوفمبر!$C14,\" \")","v":" "},12,null,0]
[{"$f":"IF(F16=[1]نوفمبر!$J15,\"ok\",\"error\")","v":"ok"},{"$f":"F16-[1]نوفمبر!$J15","v":0},{"$f":"IF([1]نوفمبر!$J15>0,[1]نوفمبر!$C15,\" \")","v":" "},13,null,0]
[{"$f":"IF(F17=[1]نوفمبر!$J16,\"ok\",\"error\")","v":"ok"},{"$f":"F17-[1]نوفمبر!$J16","v":0},{"$f":"IF([1]نوفمبر!$J16>0,[1]نوفمبر!$C16,\" \")","v":" "},14,null,0]
[{"$f":"IF(F18=[1]نوفمبر!$J17,\"ok\",\"error\")","v":"ok"},{"$f":"F18-[1]نوفمبر!$J17","v":0},{"$f":"IF([1]نوفمبر!$J17>0,[1]نوفمبر!$C17,\" \")","v":" "},15,null,0]
[{"$f":"IF(F19=[1]نوفمبر!$J18,\"ok\",\"error\")","v":"ok"},{"$f":"F19-[1]نوفمبر!$J18","v":0},{"$f":"IF([1]نوفمبر!$J18>0,[1]نوفمبر!$C18,\" \")","v":" "},16,null,0]
[{"$f":"IF(F20=[1]نوفمبر!$J19,\"ok\",\"error\")","v":"ok"},{"$f":"F20-[1]نوفمبر!$J19","v":0},{"$f":"IF([1]نوفمبر!$J19>0,[1]نوفمبر!$C19,\" \")","v":" "},17,null,0]
[{"$f":"IF(F21=[1]نوفمبر!$J20,\"ok\",\"error\")","v":"ok"},{"$f":"F21-[1]نوفمبر!$J20","v":0},{"$f":"IF([1]نوفمبر!$J20>0,[1]نوفمبر!$C20,\" \")","v":" "},18,null,0]
[{"$f":"IF(F22=[1]نوفمبر!$J21,\"ok\",\"error\")","v":"ok"},{"$f":"F22-[1]نوفمبر!$J21","v":0},{"$f":"IF([1]نوفمبر!$J21>0,[1]نوفمبر!$C21,\" \")","v":" "},19,null,0]
[{"$f":"IF(F23=[1]نوفمبر!$J22,\"ok\",\"error\")","v":"ok"},{"$f":"F23-[1]نوفمبر!$J22","v":0},{"$f":"IF([1]نوفمبر!$J22>0,[1]نوفمبر!$C22,\" \")","v":" "},20,null,0]
[{"$f":"IF(F24=[1]نوفمبر!$J23,\"ok\",\"error\")","v":"ok"},{"$f":"F24-[1]نوفمبر!$J23","v":0},{"$f":"IF([1]نوفمبر!$J23>0,[1]نوفمبر!$C23,\" \")","v":" "},21,null,0]
[{"$f":"IF(F25=[1]نوفمبر!$J24,\"ok\",\"error\")","v":"ok"},{"$f":"F25-[1]نوفمبر!$J24","v":0},{"$f":"IF([1]نوفمبر!$J24>0,[1]نوفمبر!$C24,\" \")","v":" "},22,null,0]
[{"$f":"IF(F26=[1]نوفمبر!$J25,\"ok\",\"error\")","v":"ok"},{"$f":"F26-[1]نوفمبر!$J25","v":0},{"$f":"IF([1]نوفمبر!$J25>0,[1]نوفمبر!$C25,\" \")","v":" "},23,null,0]
[{"$f":"IF(F27=[1]نوفمبر!$J26,\"ok\",\"error\")","v":"ok"},{"$f":"F27-[1]نوفمبر!$J26","v":0},{"$f":"IF([1]نوفمبر!$J26>0,[1]نوفمبر!$C26,\" \")","v":" "},24,null,0]
[{"$f":"IF(F28=[1]نوفمبر!$J27,\"ok\",\"error\")","v":"ok"},{"$f":"F28-[1]نوفمبر!$J27","v":0},{"$f":"IF([1]نوفمبر!$J27>0,[1]نوفمبر!$C27,\" \")","v":" "},25,null,0]
[{"$f":"IF(F29=[1]نوفمبر!$J28,\"ok\",\"error\")","v":"ok"},{"$f":"F29-[1]نوفمبر!$J28","v":0},{"$f":"IF([1]نوفمبر!$J28>0,[1]نوفمبر!$C28,\" \")","v":" "},26,null,0]
[{"$f":"IF(F30=[1]نوفمبر!$J29,\"ok\",\"error\")","v":"ok"},{"$f":"F30-[1]نوفمبر!$J29","v":0},{"$f":"IF([1]نوفمبر!$J29>0,[1]نوفمبر!$C29,\" \")","v":" "},27,null,0]
[{"$f":"IF(F31=[1]نوفمبر!$J30,\"ok\",\"error\")","v":"ok"},{"$f":"F31-[1]نوفمبر!$J30","v":0},{"$f":"IF([1]نوفمبر!$J30>0,[1]نوفمبر!$C30,\" \")","v":" "},28,null,0]
[{"$f":"IF(F32=[1]نوفمبر!$J31,\"ok\",\"error\")","v":"ok"},{"$f":"F32-[1]نوفمبر!$J31","v":0},{"$f":"IF([1]نوفمبر!$J31>0,[1]نوفمبر!$C31,\" \")","v":" "},29,null,0]
[{"$f":"IF(F33=[1]نوفمبر!$J32,\"ok\",\"error\")","v":"ok"},{"$f":"F33-[1]نوفمبر!$J32","v":0},{"$f":"IF([1]نوفمبر!$J32>0,[1]نوفمبر!$C32,\" \")","v":" "},30,null,0]
[{"$f":"IF(F34=[1]نوفمبر!$J33,\"ok\",\"error\")","v":"ok"},{"$f":"F34-[1]نوفمبر!$J33","v":0},{"$f":"IF([1]نوفمبر!$J33>0,[1]نوفمبر!$C33,\" \")","v":" "},31,null,0]
[{"$f":"IF(F35=[1]نوفمبر!$J34,\"ok\",\"error\")","v":"ok"},{"$f":"F35-[1]نوفمبر!$J34","v":0},{"$f":"IF([1]نوفمبر!$J34>0,[1]نوفمبر!$C34,\" \")","v":" "},32,null,0]
[{"$f":"IF(F36=[1]نوفمبر!$J35,\"ok\",\"error\")","v":"ok"},{"$f":"F36-[1]نوفمبر!$J35","v":0},{"$f":"IF([1]نوفمبر!$J35>0,[1]نوفمبر!$C35,\" \")","v":" "},33,null,{"$f":"SUM(G36:AX36)","v":0}]
[{"$f":"IF(F37=[1]نوفمبر!$J36,\"ok\",\"error\")","v":"ok"},{"$f":"F37-[1]نوفمبر!$J36","v":0},{"$f":"IF([1]نوفمبر!$J36>0,[1]نوفمبر!$C36,\" \")","v":" "},34,null,0]
[{"$f":"IF(F38=[1]نوفمبر!$J37,\"ok\",\"error\")","v":"ok"},{"$f":"F38-[1]نوفمبر!$J37","v":0},{"$f":"IF([1]نوفمبر!$J37>0,[1]نوفمبر!$C37,\" \")","v":" "},35,null,0]
[{"$f":"IF(F39=[1]نوفمبر!$J38,\"ok\",\"error\")","v":"ok"},{"$f":"F39-[1]نوفمبر!$J38","v":0},{"$f":"IF([1]نوفمبر!$J38>0,[1]نوفمبر!$C38,\" \")","v":" "},36,null,0]
[{"$f":"IF(F40=[1]نوفمبر!$J39,\"ok\",\"error\")","v":"ok"},{"$f":"F40-[1]نوفمبر!$J39","v":0},{"$f":"IF([1]نوفمبر!$J39>0,[1]نوفمبر!$C39,\" \")","v":" "},37,null,0]
[{"$f":"IF(F41=[1]نوفمبر!$J40,\"ok\",\"error\")","v":"ok"},{"$f":"F41-[1]نوفمبر!$J40","v":0},{"$f":"IF([1]نوفمبر!$J40>0,[1]نوفمبر!$C40,\" \")","v":" "},38,null,0]
[{"$f":"IF(F42=[1]نوفمبر!$J41,\"ok\",\"error\")","v":"ok"},{"$f":"F42-[1]نوفمبر!$J41","v":0},{"$f":"IF([1]نوفمبر!$J41>0,[1]نوفمبر!$C41,\" \")","v":" "},39,null,0]
[{"$f":"IF(F43=[1]نوفمبر!$J42,\"ok\",\"error\")","v":"ok"},{"$f":"F43-[1]نوفمبر!$J42","v":0},{"$f":"IF([1]نوفمبر!$J42>0,[1]نوفمبر!$C42,\" \")","v":" "},40,null,0]
[{"$f":"IF(F44=[1]نوفمبر!$J43,\"ok\",\"error\")","v":"ok"},{"$f":"F44-[1]نوفمبر!$J43","v":0},{"$f":"IF([1]نوفمبر!$J43>0,[1]نوفمبر!$C43,\" \")","v":" "},41,null,0]
[{"$f":"IF(F45=[1]نوفمبر!$J44,\"ok\",\"error\")","v":"ok"},{"$f":"F45-[1]نوفمبر!$J44","v":0},{"$f":"IF([1]نوفمبر!$J44>0,[1]نوفمبر!$C44,\" \")","v":" "},42,null,0]
[{"$f":"IF(F46=[1]نوفمبر!$J45,\"ok\",\"error\")","v":"ok"},{"$f":"F46-[1]نوفمبر!$J45","v":0},{"$f":"IF([1]نوفمبر!$J45>0,[1]نوفمبر!$C45,\" \")","v":" "},43,null,0]
[{"$f":"IF(F47=[1]نوفمبر!$J46,\"ok\",\"error\")","v":"ok"},{"$f":"F47-[1]نوفمبر!$J46","v":0},{"$f":"IF([1]نوفمبر!$J46>0,[1]نوفمبر!$C46,\" \")","v":" "},44,null,0]
[{"$f":"IF(F48=[1]نوفمبر!$J47,\"ok\",\"error\")","v":"ok"},{"$f":"F48-[1]نوفمبر!$J47","v":0},{"$f":"IF([1]نوفمبر!$J47>0,[1]نوفمبر!$C47,\" \")","v":" "},45,null,0]
[{"$f":"IF(F49=[1]نوفمبر!$J48,\"ok\",\"error\")","v":"ok"},{"$f":"F49-[1]نوفمبر!$J48","v":0},{"$f":"IF([1]نوفمبر!$J48>0,[1]نوفمبر!$C48,\" \")","v":" "},46,null,0]
[{"$f":"IF(F50=[1]نوفمبر!$J49,\"ok\",\"error\")","v":"ok"},{"$f":"F50-[1]نوفمبر!$J49","v":0},{"$f":"IF([1]نوفمبر!$J49>0,[1]نوفمبر!$C49,\" \")","v":" "},47,null,0]
[{"$f":"IF(F51=[1]نوفمبر!$J50,\"ok\",\"error\")","v":"ok"},{"$f":"F51-[1]نوفمبر!$J50","v":0},{"$f":"IF([1]نوفمبر!$J50>0,[1]نوفمبر!$C50,\" \")","v":" "},48,null,0]
[{"$f":"IF(F52=[1]نوفمبر!$J51,\"ok\",\"error\")","v":"ok"},{"$f":"F52-[1]نوفمبر!$J51","v":0},{"$f":"IF([1]نوفمبر!$J51>0,[1]نوفمبر!$C51,\" \")","v":" "},49,null,0]
[{"$f":"IF(F53=[1]نوفمبر!$J52,\"ok\",\"error\")","v":"ok"},{"$f":"F53-[1]نوفمبر!$J52","v":0},{"$f":"IF([1]نوفمبر!$J52>0,[1]نوفمبر!$C52,\" \")","v":" "},50,null,0]
[{"$f":"IF(F54=[1]نوفمبر!$J53,\"ok\",\"error\")","v":"ok"},{"$f":"F54-[1]نوفمبر!$J53","v":0},{"$f":"IF([1]نوفمبر!$J53>0,[1]نوفمبر!$C53,\" \")","v":" "},51,null,0]
[{"$f":"IF(F55=[1]نوفمبر!$J54,\"ok\",\"error\")","v":"ok"},{"$f":"F55-[1]نوفمبر!$J54","v":0},{"$f":"IF([1]نوفمبر!$J54>0,[1]نوفمبر!$C54,\" \")","v":" "},52,null,0]
[{"$f":"IF(F56=[1]نوفمبر!$J55,\"ok\",\"error\")","v":"ok"},{"$f":"F56-[1]نوفمبر!$J55","v":0},{"$f":"IF([1]نوفمبر!$J55>0,[1]نوفمبر!$C55,\" \")","v":" "},53,null,0]
[{"$f":"IF(F57=[1]نوفمبر!$J56,\"ok\",\"error\")","v":"ok"},{"$f":"F57-[1]نوفمبر!$J56","v":0},{"$f":"IF([1]نوفمبر!$J56>0,[1]نوفمبر!$C56,\" \")","v":" "},54,null,0]
[{"$f":"IF(F58=[1]نوفمبر!$J57,\"ok\",\"error\")","v":"ok"},{"$f":"F58-[1]نوفمبر!$J57","v":0},{"$f":"IF([1]نوفمبر!$J57>0,[1]نوفمبر!$C57,\" \")","v":" "},55,null,0]
[{"$f":"IF(F59=[1]نوفمبر!$J58,\"ok\",\"error\")","v":"ok"},{"$f":"F59-[1]نوفمبر!$J58","v":0},{"$f":"IF([1]نوفمبر!$J58>0,[1]نوفمبر!$C58,\" \")","v":" "},56,null,0]
[{"$f":"IF(F60=[1]نوفمبر!$J59,\"ok\",\"error\")","v":"ok"},{"$f":"F60-[1]نوفمبر!$J59","v":0},{"$f":"IF([1]نوفمبر!$J59>0,[1]نوفمبر!$C59,\" \")","v":" "},57,null,0]
[{"$f":"IF(F61=[1]نوفمبر!$J60,\"ok\",\"error\")","v":"ok"},{"$f":"F61-[1]نوفمبر!$J60","v":0},{"$f":"IF([1]نوفمبر!$J60>0,[1]نوفمبر!$C60,\" \")","v":" "},58,null,0]
[{"$f":"IF(F62=[1]نوفمبر!$J61,\"ok\",\"error\")","v":"ok"},{"$f":"F62-[1]نوفمبر!$J61","v":0},{"$f":"IF([1]نوفمبر!$J61>0,[1]نوفمبر!$C61,\" \")","v":" "},59,null,0]
[{"$f":"IF(F63=[1]نوفمبر!$J62,\"ok\",\"error\")","v":"ok"},{"$f":"F63-[1]نوفمبر!$J62","v":0},{"$f":"IF([1]نوفمبر!$J62>0,[1]نوفمبر!$C62,\" \")","v":" "},60,null,0]
[{"$f":"IF(F64=[1]نوفمبر!$J63,\"ok\",\"error\")","v":"ok"},{"$f":"F64-[1]نوفمبر!$J63","v":0},{"$f":"IF([1]نوفمبر!$J63>0,[1]نوفمبر!$C63,\" \")","v":" "},61,null,0]
[{"$f":"IF(F65=[1]نوفمبر!$J64,\"ok\",\"error\")","v":"ok"},{"$f":"F65-[1]نوفمبر!$J64","v":0},{"$f":"IF([1]نوفمبر!$J64>0,[1]نوفمبر!$C64,\" \")","v":" "},62,null,0]
[{"$f":"IF(F66=[1]نوفمبر!$J65,\"ok\",\"error\")","v":"ok"},{"$f":"F66-[1]نوفمبر!$J65","v":0},{"$f":"IF([1]نوفمبر!$J65>0,[1]نوفمبر!$C65,\" \")","v":" "},63,null,0]
[{"$f":"IF(F67=[1]نوفمبر!$J66,\"ok\",\"error\")","v":"ok"},{"$f":"F67-[1]نوفمبر!$J66","v":0},{"$f":"IF([1]نوفمبر!$J66>0,[1]نوفمبر!$C66,\" \")","v":" "},64,null,0]
[{"$f":"IF(F68=[1]نوفمبر!$J67,\"ok\",\"error\")","v":"ok"},{"$f":"F68-[1]نوفمبر!$J67","v":0},{"$f":"IF([1]نوفمبر!$J67>0,[1]نوفمبر!$C67,\" \")","v":" "},65,null,{"$f":"SUM(G68:AX68)","v":0}]
[{"$f":"IF(F69=[1]نوفمبر!$J68,\"ok\",\"error\")","v":"ok"},{"$f":"F69-[1]نوفمبر!$J68","v":0},{"$f":"IF([1]نوفمبر!$J68>0,[1]نوفمبر!$C68,\" \")","v":" "},66,null,0]
[{"$f":"IF(F70=[1]نوفمبر!$J69,\"ok\",\"error\")","v":"ok"},{"$f":"F70-[1]نوفمبر!$J69","v":0},{"$f":"IF([1]نوفمبر!$J69>0,[1]نوفمبر!$C69,\" \")","v":" "},67,null,0]
[{"$f":"IF(F71=[1]نوفمبر!$J70,\"ok\",\"error\")","v":"ok"},{"$f":"F71-[1]نوفمبر!$J70","v":0},{"$f":"IF([1]نوفمبر!$J70>0,[1]نوفمبر!$C70,\" \")","v":" "},68,null,0]
[{"$f":"IF(F72=[1]نوفمبر!$J71,\"ok\",\"error\")","v":"ok"},{"$f":"F72-[1]نوفمبر!$J71","v":0},{"$f":"IF([1]نوفمبر!$J71>0,[1]نوفمبر!$C71,\" \")","v":" "},69,null,0]
[{"$f":"IF(F73=[1]نوفمبر!$J72,\"ok\",\"error\")","v":"ok"},{"$f":"F73-[1]نوفمبر!$J72","v":0},{"$f":"IF([1]نوفمبر!$J72>0,[1]نوفمبر!$C72,\" \")","v":" "},70,null,0]
[{"$f":"IF(F74=[1]نوفمبر!$J73,\"ok\",\"error\")","v":"ok"},{"$f":"F74-[1]نوفمبر!$J73","v":0},{"$f":"IF([1]نوفمبر!$J73>0,[1]نوفمبر!$C73,\" \")","v":" "},71,null,0]
[{"$f":"IF(F75=[1]نوفمبر!$J74,\"ok\",\"error\")","v":"ok"},{"$f":"F75-[1]نوفمبر!$J74","v":0},{"$f":"IF([1]نوفمبر!$J74>0,[1]نوفمبر!$C74,\" \")","v":" "},72,null,0]
[{"$f":"IF(F76=[1]نوفمبر!$J75,\"ok\",\"error\")","v":"ok"},{"$f":"F76-[1]نوفمبر!$J75","v":0},{"$f":"IF([1]نوفمبر!$J75>0,[1]نوفمبر!$C75,\" \")","v":" "},73,null,0]
[{"$f":"IF(F77=[1]نوفمبر!$J76,\"ok\",\"error\")","v":"ok"},{"$f":"F77-[1]نوفمبر!$J76","v":0},{"$f":"IF([1]نوفمبر!$J76>0,[1]نوفمبر!$C76,\" \")","v":" "},74,null,0]
[{"$f":"IF(F78=[1]نوفمبر!$J77,\"ok\",\"error\")","v":"ok"},{"$f":"F78-[1]نوفمبر!$J77","v":0},{"$f":"IF([1]نوفمبر!$J77>0,[1]نوفمبر!$C77,\" \")","v":" "},75,null,0]
[{"$f":"IF(F79=[1]نوفمبر!$J78,\"ok\",\"error\")","v":"ok"},{"$f":"F79-[1]نوفمبر!$J78","v":0},{"$f":"IF([1]نوفمبر!$J78>0,[1]نوفمبر!$C78,\" \")","v":" "},76,null,0]
[{"$f":"IF(F80=[1]نوفمبر!$J79,\"ok\",\"error\")","v":"ok"},{"$f":"F80-[1]نوفمبر!$J79","v":0},{"$f":"IF([1]نوفمبر!$J79>0,[1]نوفمبر!$C79,\" \")","v":" "},77,null,0]
[{"$f":"IF(F81=[1]نوفمبر!$J80,\"ok\",\"error\")","v":"ok"},{"$f":"F81-[1]نوفمبر!$J80","v":0},{"$f":"IF([1]نوفمبر!$J80>0,[1]نوفمبر!$C80,\" \")","v":" "},78,null,0]
[{"$f":"IF(F82=[1]نوفمبر!$J81,\"ok\",\"error\")","v":"ok"},{"$f":"F82-[1]نوفمبر!$J81","v":0},{"$f":"IF([1]نوفمبر!$J81>0,[1]نوفمبر!$C81,\" \")","v":" "},79,null,0]
[{"$f":"IF(F83=[1]نوفمبر!$J82,\"ok\",\"error\")","v":"ok"},{"$f":"F83-[1]نوفمبر!$J82","v":0},{"$f":"IF([1]نوفمبر!$J82>0,[1]نوفمبر!$C82,\" \")","v":" "},80,null,0]
[{"$f":"IF(F84=[1]نوفمبر!$J83,\"ok\",\"error\")","v":"ok"},{"$f":"F84-[1]نوفمبر!$J83","v":0},{"$f":"IF([1]نوفمبر!$J83>0,[1]نوفمبر!$C83,\" \")","v":" "},81,null,0]
[{"$f":"IF(F85=[1]نوفمبر!$J84,\"ok\",\"error\")","v":"ok"},{"$f":"F85-[1]نوفمبر!$J84","v":0},{"$f":"IF([1]نوفمبر!$J84>0,[1]نوفمبر!$C84,\" \")","v":" "},82,null,0]
[{"$f":"IF(F86=[1]نوفمبر!$J85,\"ok\",\"error\")","v":"ok"},{"$f":"F86-[1]نوفمبر!$J85","v":0},{"$f":"IF([1]نوفمبر!$J85>0,[1]نوفمبر!$C85,\" \")","v":" "},83,null,0]
[{"$f":"IF(F87=[1]نوفمبر!$J86,\"ok\",\"error\")","v":"ok"},{"$f":"F87-[1]نوفمبر!$J86","v":0},{"$f":"IF([1]نوفمبر!$J86>0,[1]نوفمبر!$C86,\" \")","v":" "},84,null,0]
[{"$f":"IF(F88=[1]نوفمبر!$J87,\"ok\",\"error\")","v":"ok"},{"$f":"F88-[1]نوفمبر!$J87","v":0},{"$f":"IF([1]نوفمبر!$J87>0,[1]نوفمبر!$C87,\" \")","v":" "},85,null,0]
[{"$f":"IF(F89=[1]نوفمبر!$J88,\"ok\",\"error\")","v":"ok"},{"$f":"F89-[1]نوفمبر!$J88","v":0},{"$f":"IF([1]نوفمبر!$J88>0,[1]نوفمبر!$C88,\" \")","v":" "},86,null,0]
[{"$f":"IF(F90=[1]نوفمبر!$J89,\"ok\",\"error\")","v":"ok"},{"$f":"F90-[1]نوفمبر!$J89","v":0},{"$f":"IF([1]نوفمبر!$J89>0,[1]نوفمبر!$C89,\" \")","v":" "},87,null,0]
[{"$f":"IF(F91=[1]نوفمبر!$J90,\"ok\",\"error\")","v":"ok"},{"$f":"F91-[1]نوفمبر!$J90","v":0},{"$f":"IF([1]نوفمبر!$J90>0,[1]نوفمبر!$C90,\" \")","v":" "},88,null,0]
[{"$f":"IF(F92=[1]نوفمبر!$J91,\"ok\",\"error\")","v":"ok"},{"$f":"F92-[1]نوفمبر!$J91","v":0},{"$f":"IF([1]نوفمبر!$J91>0,[1]نوفمبر!$C91,\" \")","v":" "},89,null,0]
[{"$f":"IF(F93=[1]نوفمبر!$J92,\"ok\",\"error\")","v":"ok"},{"$f":"F93-[1]نوفمبر!$J92","v":0},{"$f":"IF([1]نوفمبر!$J92>0,[1]نوفمبر!$C92,\" \")","v":" "},90,null,0]
[{"$f":"IF(F94=[1]نوفمبر!$J93,\"ok\",\"error\")","v":"ok"},{"$f":"F94-[1]نوفمبر!$J93","v":0},{"$f":"IF([1]نوفمبر!$J93>0,[1]نوفمبر!$C93,\" \")","v":" "},91,null,0]
[{"$f":"IF(F95=[1]نوفمبر!$J94,\"ok\",\"error\")","v":"ok"},{"$f":"F95-[1]نوفمبر!$J94","v":0},{"$f":"IF([1]نوفمبر!$J94>0,[1]نوفمبر!$C94,\" \")","v":" "},92,null,0]
[{"$f":"IF(F96=[1]نوفمبر!$J95,\"ok\",\"error\")","v":"ok"},{"$f":"F96-[1]نوفمبر!$J95","v":0},{"$f":"IF([1]نوفمبر!$J95>0,[1]نوفمبر!$C95,\" \")","v":" "},93,null,0]
[{"$f":"IF(F97=[1]نوفمبر!$J96,\"ok\",\"error\")","v":"ok"},{"$f":"F97-[1]نوفمبر!$J96","v":0},{"$f":"IF([1]نوفمبر!$J96>0,[1]نوفمبر!$C96,\" \")","v":" "},94,null,0]
[{"$f":"IF(F98=[1]نوفمبر!$J97,\"ok\",\"error\")","v":"ok"},{"$f":"F98-[1]نوفمبر!$J97","v":0},{"$f":"IF([1]نوفمبر!$J97>0,[1]نوفمبر!$C97,\" \")","v":" "},95,null,0]
[{"$f":"IF(F99=[1]نوفمبر!$J98,\"ok\",\"error\")","v":"ok"},{"$f":"F99-[1]نوفمبر!$J98","v":0},{"$f":"IF([1]نوفمبر!$J98>0,[1]نوفمبر!$C98,\" \")","v":" "},96,null,0]
[{"$f":"IF(F100=[1]نوفمبر!$J99,\"ok\",\"error\")","v":"ok"},{"$f":"F100-[1]نوفمبر!$J99","v":0},{"$f":"IF([1]نوفمبر!$J99>0,[1]نوفمبر!$C99,\" \")","v":" "},97,null,{"$f":"SUM(G100:AX100)","v":0}]
[{"$f":"IF(F101=[1]نوفمبر!$J100,\"ok\",\"error\")","v":"ok"},{"$f":"F101-[1]نوفمبر!$J100","v":0},{"$f":"IF([1]نوفمبر!$J100>0,[1]نوفمبر!$C100,\" \")","v":" "},98,null,{"$f":"SUM(G101:AX101)","v":0}]
[{"$f":"IF(F102=[1]نوفمبر!$J101,\"ok\",\"error\")","v":"ok"},{"$f":"F102-[1]نوفمبر!$J101","v":0},{"$f":"IF([1]نوفمبر!$J101>0,[1]نوفمبر!$C101,\" \")","v":" "},99,null,{"$f":"SUM(G102:AX102)","v":0}]
[{"$f":"IF(F103=[1]نوفمبر!$J102,\"ok\",\"error\")","v":"ok"},{"$f":"F103-[1]نوفمبر!$J102","v":0},{"$f":"IF([1]نوفمبر!$J102>0,[1]نوفمبر!$C102,\" \")","v":" "},100,null,{"$f":"SUM(G103:AX103)","v":0}]
[{"$f":"IF(F104=[1]نوفمبر!$J103,\"ok\",\"error\")","v":"ok"},{"$f":"F104-[1]نوفمبر!$J103","v":0},"الإجمالى",null,null,{"$f":"SUM(F4:F103)","v":0},0,0,0,0,0,0,0,0,0,0,0,0,0,0,0,0,0,0,0,0,0,0,0,0,0,0,0,0,0]
[]
[null,null,null,null,"؟",{"$f":"F104-[1]نوفمبر!$J$103","v":0}]

{"sheet":"ديسمبر","index":11,"n_rows":106,"n_cols":35,"rows_kept":106,"cut":false,"hidden":false,"merged":[[1,38,2,38],[1,39,2,39],[1,10,2,10],[1,8,2,8],[1,34,2,34],[1,35,2,35],[1,36,2,36],[1,37,2,37],[1,30,2,30],[1,31,2,31],[1,32,2,32],[1,33,2,33],[1,26,2,26],[1,27,2,27],[1,28,2,28],[1,29,2,29],[1,22,2,22],[1,23,2,23],[1,24,2,24],[1,25,2,25],[1,18,2,18],[1,19,2,19],[1,20,2,20],[1,21,2,21],[1,15,2,15],[1,16,2,16],[1,17,2,17],[1,9,2,9],[1,11,2,11],[1,12,2,12],[1,13,2,13],[103,2,103,4],[1,2,2,2],[1,3,2,3],[1,4,2,4],[1,14,2,14],[0,2,0,14],[1,0,2,1],[1,5,2,5],[1,6,2,6],[1,7,2,7]]}
[null,null,"تحليـــــــــــــــــل مصـــــــــــــــروفات التشغيـــــــــــــــل عن شهـــــــــر ديسمبــــــــــــــر لعام 201"]
["OR",null,"التاريخ","رقم القيد","البيان","الإجمالى",{"$f":"نوفمبر!G2","v":"صيانة\nواصلاح\nوقطع غيار"},{"$f":"نوفمبر!H2","v":"خامات تشغيل"},{"$f":"نوفمبر!I2","v":"م سيارات"},{"$f":"نوفمبر!J2","v":"كهرباء"},{"$f":"نوفمبر!K2","v":"م نظافة"},{"$f":"نوفمبر!L2","v":"مياه"},{"$f":"نوفمبر!M2","v":"تأمينات"},{"$f":"نوفمبر!N2","v":"أجور"},{"$f":"نوفمبر!O2","v":0},{"$f":"نوفمبر!P2","v":0},{"$f":"نوفمبر!Q2","v":0},{"$f":"نوفمبر!R2","v":0},{"$f":"نوفمبر!S2","v":0},{"$f":"نوفمبر!T2","v":0},{"$f":"نوفمبر!U2","v":0},{"$f":"نوفمبر!V2","v":0},{"$f":"نوفمبر!W2","v":0},{"$f":"نوفمبر!X2","v":0},{"$f":"نوفمبر!Y2","v":0},{"$f":"نوفمبر!Z2","v":0},{"$f":"نوفمبر!AA2","v":0},{"$f":"نوفمبر!AB2","v":0},{"$f":"نوفمبر!AC2","v":0},{"$f":"نوفمبر!AD2","v":0}]
[]
[{"$f":"IF(F4=[1]ديسمبر!$J3,\"ok\",\"error\")","v":"ok"},{"$f":"F4-[1]ديسمبر!$J3","v":0},{"$f":"IF([1]ديسمبر!$J3>0,[1]ديسمبر!$C3,\" \")","v":" "},1,null,{"$f":"SUM(G4:AX4)","v":0}]
[{"$f":"IF(F5=[1]ديسمبر!$J4,\"ok\",\"error\")","v":"ok"},{"$f":"F5-[1]ديسمبر!$J4","v":0},{"$f":"IF([1]ديسمبر!$J4>0,[1]ديسمبر!$C4,\" \")","v":" "},2,null,0]
[{"$f":"IF(F6=[1]ديسمبر!$J5,\"ok\",\"error\")","v":"ok"},{"$f":"F6-[1]ديسمبر!$J5","v":0},{"$f":"IF([1]ديسمبر!$J5>0,[1]ديسمبر!$C5,\" \")","v":" "},3,null,0]
[{"$f":"IF(F7=[1]ديسمبر!$J6,\"ok\",\"error\")","v":"ok"},{"$f":"F7-[1]ديسمبر!$J6","v":0},{"$f":"IF([1]ديسمبر!$J6>0,[1]ديسمبر!$C6,\" \")","v":" "},4,null,0]
[{"$f":"IF(F8=[1]ديسمبر!$J7,\"ok\",\"error\")","v":"ok"},{"$f":"F8-[1]ديسمبر!$J7","v":0},{"$f":"IF([1]ديسمبر!$J7>0,[1]ديسمبر!$C7,\" \")","v":" "},5,null,0]
[{"$f":"IF(F9=[1]ديسمبر!$J8,\"ok\",\"error\")","v":"ok"},{"$f":"F9-[1]ديسمبر!$J8","v":0},{"$f":"IF([1]ديسمبر!$J8>0,[1]ديسمبر!$C8,\" \")","v":" "},6,null,0]
[{"$f":"IF(F10=[1]ديسمبر!$J9,\"ok\",\"error\")","v":"ok"},{"$f":"F10-[1]ديسمبر!$J9","v":0},{"$f":"IF([1]ديسمبر!$J9>0,[1]ديسمبر!$C9,\" \")","v":" "},7,null,0]
[{"$f":"IF(F11=[1]ديسمبر!$J10,\"ok\",\"error\")","v":"ok"},{"$f":"F11-[1]ديسمبر!$J10","v":0},{"$f":"IF([1]ديسمبر!$J10>0,[1]ديسمبر!$C10,\" \")","v":" "},8,null,0]
[{"$f":"IF(F12=[1]ديسمبر!$J11,\"ok\",\"error\")","v":"ok"},{"$f":"F12-[1]ديسمبر!$J11","v":0},{"$f":"IF([1]ديسمبر!$J11>0,[1]ديسمبر!$C11,\" \")","v":" "},9,null,0]
[{"$f":"IF(F13=[1]ديسمبر!$J12,\"ok\",\"error\")","v":"ok"},{"$f":"F13-[1]ديسمبر!$J12","v":0},{"$f":"IF([1]ديسمبر!$J12>0,[1]ديسمبر!$C12,\" \")","v":" "},10,null,0]
[{"$f":"IF(F14=[1]ديسمبر!$J13,\"ok\",\"error\")","v":"ok"},{"$f":"F14-[1]ديسمبر!$J13","v":0},{"$f":"IF([1]ديسمبر!$J13>0,[1]ديسمبر!$C13,\" \")","v":" "},11,null,0]
[{"$f":"IF(F15=[1]ديسمبر!$J14,\"ok\",\"error\")","v":"ok"},{"$f":"F15-[1]ديسمبر!$J14","v":0},{"$f":"IF([1]ديسمبر!$J14>0,[1]ديسمبر!$C14,\" \")","v":" "},12,null,0]
[{"$f":"IF(F16=[1]ديسمبر!$J15,\"ok\",\"error\")","v":"ok"},{"$f":"F16-[1]ديسمبر!$J15","v":0},{"$f":"IF([1]ديسمبر!$J15>0,[1]ديسمبر!$C15,\" \")","v":" "},13,null,0]
[{"$f":"IF(F17=[1]ديسمبر!$J16,\"ok\",\"error\")","v":"ok"},{"$f":"F17-[1]ديسمبر!$J16","v":0},{"$f":"IF([1]ديسمبر!$J16>0,[1]ديسمبر!$C16,\" \")","v":" "},14,null,0]
[{"$f":"IF(F18=[1]ديسمبر!$J17,\"ok\",\"error\")","v":"ok"},{"$f":"F18-[1]ديسمبر!$J17","v":0},{"$f":"IF([1]ديسمبر!$J17>0,[1]ديسمبر!$C17,\" \")","v":" "},15,null,0]
[{"$f":"IF(F19=[1]ديسمبر!$J18,\"ok\",\"error\")","v":"ok"},{"$f":"F19-[1]ديسمبر!$J18","v":0},{"$f":"IF([1]ديسمبر!$J18>0,[1]ديسمبر!$C18,\" \")","v":" "},16,null,0]
[{"$f":"IF(F20=[1]ديسمبر!$J19,\"ok\",\"error\")","v":"ok"},{"$f":"F20-[1]ديسمبر!$J19","v":0},{"$f":"IF([1]ديسمبر!$J19>0,[1]ديسمبر!$C19,\" \")","v":" "},17,null,0]
[{"$f":"IF(F21=[1]ديسمبر!$J20,\"ok\",\"error\")","v":"ok"},{"$f":"F21-[1]ديسمبر!$J20","v":0},{"$f":"IF([1]ديسمبر!$J20>0,[1]ديسمبر!$C20,\" \")","v":" "},18,null,0]
[{"$f":"IF(F22=[1]ديسمبر!$J21,\"ok\",\"error\")","v":"ok"},{"$f":"F22-[1]ديسمبر!$J21","v":0},{"$f":"IF([1]ديسمبر!$J21>0,[1]ديسمبر!$C21,\" \")","v":" "},19,null,0]
[{"$f":"IF(F23=[1]ديسمبر!$J22,\"ok\",\"error\")","v":"ok"},{"$f":"F23-[1]ديسمبر!$J22","v":0},{"$f":"IF([1]ديسمبر!$J22>0,[1]ديسمبر!$C22,\" \")","v":" "},20,null,0]
[{"$f":"IF(F24=[1]ديسمبر!$J23,\"ok\",\"error\")","v":"ok"},{"$f":"F24-[1]ديسمبر!$J23","v":0},{"$f":"IF([1]ديسمبر!$J23>0,[1]ديسمبر!$C23,\" \")","v":" "},21,null,0]
[{"$f":"IF(F25=[1]ديسمبر!$J24,\"ok\",\"error\")","v":"ok"},{"$f":"F25-[1]ديسمبر!$J24","v":0},{"$f":"IF([1]ديسمبر!$J24>0,[1]ديسمبر!$C24,\" \")","v":" "},22,null,0]
[{"$f":"IF(F26=[1]ديسمبر!$J25,\"ok\",\"error\")","v":"ok"},{"$f":"F26-[1]ديسمبر!$J25","v":0},{"$f":"IF([1]ديسمبر!$J25>0,[1]ديسمبر!$C25,\" \")","v":" "},23,null,0]
[{"$f":"IF(F27=[1]ديسمبر!$J26,\"ok\",\"error\")","v":"ok"},{"$f":"F27-[1]ديسمبر!$J26","v":0},{"$f":"IF([1]ديسمبر!$J26>0,[1]ديسمبر!$C26,\" \")","v":" "},24,null,0]
[{"$f":"IF(F28=[1]ديسمبر!$J27,\"ok\",\"error\")","v":"ok"},{"$f":"F28-[1]ديسمبر!$J27","v":0},{"$f":"IF([1]ديسمبر!$J27>0,[1]ديسمبر!$C27,\" \")","v":" "},25,null,0]
[{"$f":"IF(F29=[1]ديسمبر!$J28,\"ok\",\"error\")","v":"ok"},{"$f":"F29-[1]ديسمبر!$J28","v":0},{"$f":"IF([1]ديسمبر!$J28>0,[1]ديسمبر!$C28,\" \")","v":" "},26,null,0]
[{"$f":"IF(F30=[1]ديسمبر!$J29,\"ok\",\"error\")","v":"ok"},{"$f":"F30-[1]ديسمبر!$J29","v":0},{"$f":"IF([1]ديسمبر!$J29>0,[1]ديسمبر!$C29,\" \")","v":" "},27,null,0]
[{"$f":"IF(F31=[1]ديسمبر!$J30,\"ok\",\"error\")","v":"ok"},{"$f":"F31-[1]ديسمبر!$J30","v":0},{"$f":"IF([1]ديسمبر!$J30>0,[1]ديسمبر!$C30,\" \")","v":" "},28,null,0]
[{"$f":"IF(F32=[1]ديسمبر!$J31,\"ok\",\"error\")","v":"ok"},{"$f":"F32-[1]ديسمبر!$J31","v":0},{"$f":"IF([1]ديسمبر!$J31>0,[1]ديسمبر!$C31,\" \")","v":" "},29,null,0]
[{"$f":"IF(F33=[1]ديسمبر!$J32,\"ok\",\"error\")","v":"ok"},{"$f":"F33-[1]ديسمبر!$J32","v":0},{"$f":"IF([1]ديسمبر!$J32>0,[1]ديسمبر!$C32,\" \")","v":" "},30,null,0]
[{"$f":"IF(F34=[1]ديسمبر!$J33,\"ok\",\"error\")","v":"ok"},{"$f":"F34-[1]ديسمبر!$J33","v":0},{"$f":"IF([1]ديسمبر!$J33>0,[1]ديسمبر!$C33,\" \")","v":" "},31,null,0]
[{"$f":"IF(F35=[1]ديسمبر!$J34,\"ok\",\"error\")","v":"ok"},{"$f":"F35-[1]ديسمبر!$J34","v":0},{"$f":"IF([1]ديسمبر!$J34>0,[1]ديسمبر!$C34,\" \")","v":" "},32,null,0]
[{"$f":"IF(F36=[1]ديسمبر!$J35,\"ok\",\"error\")","v":"ok"},{"$f":"F36-[1]ديسمبر!$J35","v":0},{"$f":"IF([1]ديسمبر!$J35>0,[1]ديسمبر!$C35,\" \")","v":" "},33,null,{"$f":"SUM(G36:AX36)","v":0}]
[{"$f":"IF(F37=[1]ديسمبر!$J36,\"ok\",\"error\")","v":"ok"},{"$f":"F37-[1]ديسمبر!$J36","v":0},{"$f":"IF([1]ديسمبر!$J36>0,[1]ديسمبر!$C36,\" \")","v":" "},34,null,0]
[{"$f":"IF(F38=[1]ديسمبر!$J37,\"ok\",\"error\")","v":"ok"},{"$f":"F38-[1]ديسمبر!$J37","v":0},{"$f":"IF([1]ديسمبر!$J37>0,[1]ديسمبر!$C37,\" \")","v":" "},35,null,0]
[{"$f":"IF(F39=[1]ديسمبر!$J38,\"ok\",\"error\")","v":"ok"},{"$f":"F39-[1]ديسمبر!$J38","v":0},{"$f":"IF([1]ديسمبر!$J38>0,[1]ديسمبر!$C38,\" \")","v":" "},36,null,0]
[{"$f":"IF(F40=[1]ديسمبر!$J39,\"ok\",\"error\")","v":"ok"},{"$f":"F40-[1]ديسمبر!$J39","v":0},{"$f":"IF([1]ديسمبر!$J39>0,[1]ديسمبر!$C39,\" \")","v":" "},37,null,0]
[{"$f":"IF(F41=[1]ديسمبر!$J40,\"ok\",\"error\")","v":"ok"},{"$f":"F41-[1]ديسمبر!$J40","v":0},{"$f":"IF([1]ديسمبر!$J40>0,[1]ديسمبر!$C40,\" \")","v":" "},38,null,0]
[{"$f":"IF(F42=[1]ديسمبر!$J41,\"ok\",\"error\")","v":"ok"},{"$f":"F42-[1]ديسمبر!$J41","v":0},{"$f":"IF([1]ديسمبر!$J41>0,[1]ديسمبر!$C41,\" \")","v":" "},39,null,0]
[{"$f":"IF(F43=[1]ديسمبر!$J42,\"ok\",\"error\")","v":"ok"},{"$f":"F43-[1]ديسمبر!$J42","v":0},{"$f":"IF([1]ديسمبر!$J42>0,[1]ديسمبر!$C42,\" \")","v":" "},40,null,0]
[{"$f":"IF(F44=[1]ديسمبر!$J43,\"ok\",\"error\")","v":"ok"},{"$f":"F44-[1]ديسمبر!$J43","v":0},{"$f":"IF([1]ديسمبر!$J43>0,[1]ديسمبر!$C43,\" \")","v":" "},41,null,0]
[{"$f":"IF(F45=[1]ديسمبر!$J44,\"ok\",\"error\")","v":"ok"},{"$f":"F45-[1]ديسمبر!$J44","v":0},{"$f":"IF([1]ديسمبر!$J44>0,[1]ديسمبر!$C44,\" \")","v":" "},42,null,0]
[{"$f":"IF(F46=[1]ديسمبر!$J45,\"ok\",\"error\")","v":"ok"},{"$f":"F46-[1]ديسمبر!$J45","v":0},{"$f":"IF([1]ديسمبر!$J45>0,[1]ديسمبر!$C45,\" \")","v":" "},43,null,0]
[{"$f":"IF(F47=[1]ديسمبر!$J46,\"ok\",\"error\")","v":"ok"},{"$f":"F47-[1]ديسمبر!$J46","v":0},{"$f":"IF([1]ديسمبر!$J46>0,[1]ديسمبر!$C46,\" \")","v":" "},44,null,0]
[{"$f":"IF(F48=[1]ديسمبر!$J47,\"ok\",\"error\")","v":"ok"},{"$f":"F48-[1]ديسمبر!$J47","v":0},{"$f":"IF([1]ديسمبر!$J47>0,[1]ديسمبر!$C47,\" \")","v":" "},45,null,0]
[{"$f":"IF(F49=[1]ديسمبر!$J48,\"ok\",\"error\")","v":"ok"},{"$f":"F49-[1]ديسمبر!$J48","v":0},{"$f":"IF([1]ديسمبر!$J48>0,[1]ديسمبر!$C48,\" \")","v":" "},46,null,0]
[{"$f":"IF(F50=[1]ديسمبر!$J49,\"ok\",\"error\")","v":"ok"},{"$f":"F50-[1]ديسمبر!$J49","v":0},{"$f":"IF([1]ديسمبر!$J49>0,[1]ديسمبر!$C49,\" \")","v":" "},47,null,0]
[{"$f":"IF(F51=[1]ديسمبر!$J50,\"ok\",\"error\")","v":"ok"},{"$f":"F51-[1]ديسمبر!$J50","v":0},{"$f":"IF([1]ديسمبر!$J50>0,[1]ديسمبر!$C50,\" \")","v":" "},48,null,0]
[{"$f":"IF(F52=[1]ديسمبر!$J51,\"ok\",\"error\")","v":"ok"},{"$f":"F52-[1]ديسمبر!$J51","v":0},{"$f":"IF([1]ديسمبر!$J51>0,[1]ديسمبر!$C51,\" \")","v":" "},49,null,0]
[{"$f":"IF(F53=[1]ديسمبر!$J52,\"ok\",\"error\")","v":"ok"},{"$f":"F53-[1]ديسمبر!$J52","v":0},{"$f":"IF([1]ديسمبر!$J52>0,[1]ديسمبر!$C52,\" \")","v":" "},50,null,0]
[{"$f":"IF(F54=[1]ديسمبر!$J53,\"ok\",\"error\")","v":"ok"},{"$f":"F54-[1]ديسمبر!$J53","v":0},{"$f":"IF([1]ديسمبر!$J53>0,[1]ديسمبر!$C53,\" \")","v":" "},51,null,0]
[{"$f":"IF(F55=[1]ديسمبر!$J54,\"ok\",\"error\")","v":"ok"},{"$f":"F55-[1]ديسمبر!$J54","v":0},{"$f":"IF([1]ديسمبر!$J54>0,[1]ديسمبر!$C54,\" \")","v":" "},52,null,0]
[{"$f":"IF(F56=[1]ديسمبر!$J55,\"ok\",\"error\")","v":"ok"},{"$f":"F56-[1]ديسمبر!$J55","v":0},{"$f":"IF([1]ديسمبر!$J55>0,[1]ديسمبر!$C55,\" \")","v":" "},53,null,0]
[{"$f":"IF(F57=[1]ديسمبر!$J56,\"ok\",\"error\")","v":"ok"},{"$f":"F57-[1]ديسمبر!$J56","v":0},{"$f":"IF([1]ديسمبر!$J56>0,[1]ديسمبر!$C56,\" \")","v":" "},54,null,0]
[{"$f":"IF(F58=[1]ديسمبر!$J57,\"ok\",\"error\")","v":"ok"},{"$f":"F58-[1]ديسمبر!$J57","v":0},{"$f":"IF([1]ديسمبر!$J57>0,[1]ديسمبر!$C57,\" \")","v":" "},55,null,0]
[{"$f":"IF(F59=[1]ديسمبر!$J58,\"ok\",\"error\")","v":"ok"},{"$f":"F59-[1]ديسمبر!$J58","v":0},{"$f":"IF([1]ديسمبر!$J58>0,[1]ديسمبر!$C58,\" \")","v":" "},56,null,0]
[{"$f":"IF(F60=[1]ديسمبر!$J59,\"ok\",\"error\")","v":"ok"},{"$f":"F60-[1]ديسمبر!$J59","v":0},{"$f":"IF([1]ديسمبر!$J59>0,[1]ديسمبر!$C59,\" \")","v":" "},57,null,0]
[{"$f":"IF(F61=[1]ديسمبر!$J60,\"ok\",\"error\")","v":"ok"},{"$f":"F61-[1]ديسمبر!$J60","v":0},{"$f":"IF([1]ديسمبر!$J60>0,[1]ديسمبر!$C60,\" \")","v":" "},58,null,0]
[{"$f":"IF(F62=[1]ديسمبر!$J61,\"ok\",\"error\")","v":"ok"},{"$f":"F62-[1]ديسمبر!$J61","v":0},{"$f":"IF([1]ديسمبر!$J61>0,[1]ديسمبر!$C61,\" \")","v":" "},59,null,0]
[{"$f":"IF(F63=[1]ديسمبر!$J62,\"ok\",\"error\")","v":"ok"},{"$f":"F63-[1]ديسمبر!$J62","v":0},{"$f":"IF([1]ديسمبر!$J62>0,[1]ديسمبر!$C62,\" \")","v":" "},60,null,0]
[{"$f":"IF(F64=[1]ديسمبر!$J63,\"ok\",\"error\")","v":"ok"},{"$f":"F64-[1]ديسمبر!$J63","v":0},{"$f":"IF([1]ديسمبر!$J63>0,[1]ديسمبر!$C63,\" \")","v":" "},61,null,0]
[{"$f":"IF(F65=[1]ديسمبر!$J64,\"ok\",\"error\")","v":"ok"},{"$f":"F65-[1]ديسمبر!$J64","v":0},{"$f":"IF([1]ديسمبر!$J64>0,[1]ديسمبر!$C64,\" \")","v":" "},62,null,0]
[{"$f":"IF(F66=[1]ديسمبر!$J65,\"ok\",\"error\")","v":"ok"},{"$f":"F66-[1]ديسمبر!$J65","v":0},{"$f":"IF([1]ديسمبر!$J65>0,[1]ديسمبر!$C65,\" \")","v":" "},63,null,0]
[{"$f":"IF(F67=[1]ديسمبر!$J66,\"ok\",\"error\")","v":"ok"},{"$f":"F67-[1]ديسمبر!$J66","v":0},{"$f":"IF([1]ديسمبر!$J66>0,[1]ديسمبر!$C66,\" \")","v":" "},64,null,0]
[{"$f":"IF(F68=[1]ديسمبر!$J67,\"ok\",\"error\")","v":"ok"},{"$f":"F68-[1]ديسمبر!$J67","v":0},{"$f":"IF([1]ديسمبر!$J67>0,[1]ديسمبر!$C67,\" \")","v":" "},65,null,{"$f":"SUM(G68:AX68)","v":0}]
[{"$f":"IF(F69=[1]ديسمبر!$J68,\"ok\",\"error\")","v":"ok"},{"$f":"F69-[1]ديسمبر!$J68","v":0},{"$f":"IF([1]ديسمبر!$J68>0,[1]ديسمبر!$C68,\" \")","v":" "},66,null,0]
[{"$f":"IF(F70=[1]ديسمبر!$J69,\"ok\",\"error\")","v":"ok"},{"$f":"F70-[1]ديسمبر!$J69","v":0},{"$f":"IF([1]ديسمبر!$J69>0,[1]ديسمبر!$C69,\" \")","v":" "},67,null,0]
[{"$f":"IF(F71=[1]ديسمبر!$J70,\"ok\",\"error\")","v":"ok"},{"$f":"F71-[1]ديسمبر!$J70","v":0},{"$f":"IF([1]ديسمبر!$J70>0,[1]ديسمبر!$C70,\" \")","v":" "},68,null,0]
[{"$f":"IF(F72=[1]ديسمبر!$J71,\"ok\",\"error\")","v":"ok"},{"$f":"F72-[1]ديسمبر!$J71","v":0},{"$f":"IF([1]ديسمبر!$J71>0,[1]ديسمبر!$C71,\" \")","v":" "},69,null,0]
[{"$f":"IF(F73=[1]ديسمبر!$J72,\"ok\",\"error\")","v":"ok"},{"$f":"F73-[1]ديسمبر!$J72","v":0},{"$f":"IF([1]ديسمبر!$J72>0,[1]ديسمبر!$C72,\" \")","v":" "},70,null,0]
[{"$f":"IF(F74=[1]ديسمبر!$J73,\"ok\",\"error\")","v":"ok"},{"$f":"F74-[1]ديسمبر!$J73","v":0},{"$f":"IF([1]ديسمبر!$J73>0,[1]ديسمبر!$C73,\" \")","v":" "},71,null,0]
[{"$f":"IF(F75=[1]ديسمبر!$J74,\"ok\",\"error\")","v":"ok"},{"$f":"F75-[1]ديسمبر!$J74","v":0},{"$f":"IF([1]ديسمبر!$J74>0,[1]ديسمبر!$C74,\" \")","v":" "},72,null,0]
[{"$f":"IF(F76=[1]ديسمبر!$J75,\"ok\",\"error\")","v":"ok"},{"$f":"F76-[1]ديسمبر!$J75","v":0},{"$f":"IF([1]ديسمبر!$J75>0,[1]ديسمبر!$C75,\" \")","v":" "},73,null,0]
[{"$f":"IF(F77=[1]ديسمبر!$J76,\"ok\",\"error\")","v":"ok"},{"$f":"F77-[1]ديسمبر!$J76","v":0},{"$f":"IF([1]ديسمبر!$J76>0,[1]ديسمبر!$C76,\" \")","v":" "},74,null,0]
[{"$f":"IF(F78=[1]ديسمبر!$J77,\"ok\",\"error\")","v":"ok"},{"$f":"F78-[1]ديسمبر!$J77","v":0},{"$f":"IF([1]ديسمبر!$J77>0,[1]ديسمبر!$C77,\" \")","v":" "},75,null,0]
[{"$f":"IF(F79=[1]ديسمبر!$J78,\"ok\",\"error\")","v":"ok"},{"$f":"F79-[1]ديسمبر!$J78","v":0},{"$f":"IF([1]ديسمبر!$J78>0,[1]ديسمبر!$C78,\" \")","v":" "},76,null,0]
[{"$f":"IF(F80=[1]ديسمبر!$J79,\"ok\",\"error\")","v":"ok"},{"$f":"F80-[1]ديسمبر!$J79","v":0},{"$f":"IF([1]ديسمبر!$J79>0,[1]ديسمبر!$C79,\" \")","v":" "},77,null,0]
[{"$f":"IF(F81=[1]ديسمبر!$J80,\"ok\",\"error\")","v":"ok"},{"$f":"F81-[1]ديسمبر!$J80","v":0},{"$f":"IF([1]ديسمبر!$J80>0,[1]ديسمبر!$C80,\" \")","v":" "},78,null,0]
[{"$f":"IF(F82=[1]ديسمبر!$J81,\"ok\",\"error\")","v":"ok"},{"$f":"F82-[1]ديسمبر!$J81","v":0},{"$f":"IF([1]ديسمبر!$J81>0,[1]ديسمبر!$C81,\" \")","v":" "},79,null,0]
[{"$f":"IF(F83=[1]ديسمبر!$J82,\"ok\",\"error\")","v":"ok"},{"$f":"F83-[1]ديسمبر!$J82","v":0},{"$f":"IF([1]ديسمبر!$J82>0,[1]ديسمبر!$C82,\" \")","v":" "},80,null,0]
[{"$f":"IF(F84=[1]ديسمبر!$J83,\"ok\",\"error\")","v":"ok"},{"$f":"F84-[1]ديسمبر!$J83","v":0},{"$f":"IF([1]ديسمبر!$J83>0,[1]ديسمبر!$C83,\" \")","v":" "},81,null,0]
[{"$f":"IF(F85=[1]ديسمبر!$J84,\"ok\",\"error\")","v":"ok"},{"$f":"F85-[1]ديسمبر!$J84","v":0},{"$f":"IF([1]ديسمبر!$J84>0,[1]ديسمبر!$C84,\" \")","v":" "},82,null,0]
[{"$f":"IF(F86=[1]ديسمبر!$J85,\"ok\",\"error\")","v":"ok"},{"$f":"F86-[1]ديسمبر!$J85","v":0},{"$f":"IF([1]ديسمبر!$J85>0,[1]ديسمبر!$C85,\" \")","v":" "},83,null,0]
[{"$f":"IF(F87=[1]ديسمبر!$J86,\"ok\",\"error\")","v":"ok"},{"$f":"F87-[1]ديسمبر!$J86","v":0},{"$f":"IF([1]ديسمبر!$J86>0,[1]ديسمبر!$C86,\" \")","v":" "},84,null,0]
[{"$f":"IF(F88=[1]ديسمبر!$J87,\"ok\",\"error\")","v":"ok"},{"$f":"F88-[1]ديسمبر!$J87","v":0},{"$f":"IF([1]ديسمبر!$J87>0,[1]ديسمبر!$C87,\" \")","v":" "},85,null,0]
[{"$f":"IF(F89=[1]ديسمبر!$J88,\"ok\",\"error\")","v":"ok"},{"$f":"F89-[1]ديسمبر!$J88","v":0},{"$f":"IF([1]ديسمبر!$J88>0,[1]ديسمبر!$C88,\" \")","v":" "},86,null,0]
[{"$f":"IF(F90=[1]ديسمبر!$J89,\"ok\",\"error\")","v":"ok"},{"$f":"F90-[1]ديسمبر!$J89","v":0},{"$f":"IF([1]ديسمبر!$J89>0,[1]ديسمبر!$C89,\" \")","v":" "},87,null,0]
[{"$f":"IF(F91=[1]ديسمبر!$J90,\"ok\",\"error\")","v":"ok"},{"$f":"F91-[1]ديسمبر!$J90","v":0},{"$f":"IF([1]ديسمبر!$J90>0,[1]ديسمبر!$C90,\" \")","v":" "},88,null,0]
[{"$f":"IF(F92=[1]ديسمبر!$J91,\"ok\",\"error\")","v":"ok"},{"$f":"F92-[1]ديسمبر!$J91","v":0},{"$f":"IF([1]ديسمبر!$J91>0,[1]ديسمبر!$C91,\" \")","v":" "},89,null,0]
[{"$f":"IF(F93=[1]ديسمبر!$J92,\"ok\",\"error\")","v":"ok"},{"$f":"F93-[1]ديسمبر!$J92","v":0},{"$f":"IF([1]ديسمبر!$J92>0,[1]ديسمبر!$C92,\" \")","v":" "},90,null,0]
[{"$f":"IF(F94=[1]ديسمبر!$J93,\"ok\",\"error\")","v":"ok"},{"$f":"F94-[1]ديسمبر!$J93","v":0},{"$f":"IF([1]ديسمبر!$J93>0,[1]ديسمبر!$C93,\" \")","v":" "},91,null,0]
[{"$f":"IF(F95=[1]ديسمبر!$J94,\"ok\",\"error\")","v":"ok"},{"$f":"F95-[1]ديسمبر!$J94","v":0},{"$f":"IF([1]ديسمبر!$J94>0,[1]ديسمبر!$C94,\" \")","v":" "},92,null,0]
[{"$f":"IF(F96=[1]ديسمبر!$J95,\"ok\",\"error\")","v":"ok"},{"$f":"F96-[1]ديسمبر!$J95","v":0},{"$f":"IF([1]ديسمبر!$J95>0,[1]ديسمبر!$C95,\" \")","v":" "},93,null,0]
[{"$f":"IF(F97=[1]ديسمبر!$J96,\"ok\",\"error\")","v":"ok"},{"$f":"F97-[1]ديسمبر!$J96","v":0},{"$f":"IF([1]ديسمبر!$J96>0,[1]ديسمبر!$C96,\" \")","v":" "},94,null,0]
[{"$f":"IF(F98=[1]ديسمبر!$J97,\"ok\",\"error\")","v":"ok"},{"$f":"F98-[1]ديسمبر!$J97","v":0},{"$f":"IF([1]ديسمبر!$J97>0,[1]ديسمبر!$C97,\" \")","v":" "},95,null,0]
[{"$f":"IF(F99=[1]ديسمبر!$J98,\"ok\",\"error\")","v":"ok"},{"$f":"F99-[1]ديسمبر!$J98","v":0},{"$f":"IF([1]ديسمبر!$J98>0,[1]ديسمبر!$C98,\" \")","v":" "},96,null,0]
[{"$f":"IF(F100=[1]ديسمبر!$J99,\"ok\",\"error\")","v":"ok"},{"$f":"F100-[1]ديسمبر!$J99","v":0},{"$f":"IF([1]ديسمبر!$J99>0,[1]ديسمبر!$C99,\" \")","v":" "},97,null,{"$f":"SUM(G100:AX100)","v":0}]
[{"$f":"IF(F101=[1]ديسمبر!$J100,\"ok\",\"error\")","v":"ok"},{"$f":"F101-[1]ديسمبر!$J100","v":0},{"$f":"IF([1]ديسمبر!$J100>0,[1]ديسمبر!$C100,\" \")","v":" "},98,null,{"$f":"SUM(G101:AX101)","v":0}]
[{"$f":"IF(F102=[1]ديسمبر!$J101,\"ok\",\"error\")","v":"ok"},{"$f":"F102-[1]ديسمبر!$J101","v":0},{"$f":"IF([1]ديسمبر!$J101>0,[1]ديسمبر!$C101,\" \")","v":" "},99,null,{"$f":"SUM(G102:AX102)","v":0}]
[{"$f":"IF(F103=[1]ديسمبر!$J102,\"ok\",\"error\")","v":"ok"},{"$f":"F103-[1]ديسمبر!$J102","v":0},{"$f":"IF([1]ديسمبر!$J102>0,[1]ديسمبر!$C102,\" \")","v":" "},100,null,{"$f":"SUM(G103:AX103)","v":0}]
[{"$f":"IF(F104=[1]ديسمبر!$J103,\"ok\",\"error\")","v":"ok"},{"$f":"F104-[1]ديسمبر!$J103","v":0},"الإجمالى",null,null,{"$f":"SUM(F4:F103)","v":0},0,0,0,0,0,0,0,0,0,0,0,0,0,0,0,0,0,0,0,0,0,0,0,0,0,0,0,0,0]
[]
[null,null,null,null,"؟",{"$f":"F104-[1]ديسمبر!$J$103","v":0}]

{"sheet":"ميزان","index":12,"n_rows":17,"n_cols":32,"rows_kept":17,"cut":false,"hidden":false,"merged":[[0,2,0,13],[16,4,17,4],[16,5,17,6],[1,11,2,11],[1,12,2,12],[1,13,2,13],[1,3,2,3],[1,21,2,21],[1,14,2,14],[1,15,2,15],[1,2,2,2],[1,4,2,4],[1,5,2,5],[1,6,2,6],[1,7,2,7],[1,8,2,8],[1,9,2,9],[1,10,2,10],[1,0,2,1],[1,28,2,28],[1,29,2,29],[1,30,2,30],[1,31,2,31],[1,22,2,22],[1,23,2,23],[1,24,2,24],[1,25,2,25],[1,26,2,26],[1,27,2,27],[1,16,2,16],[1,17,2,17],[1,18,2,18],[1,19,2,19],[1,20,2,20]]}
[null,null,"إجمـــــــــــــــــــــــــــــــــالى مصـــــــــــــــــروفات التشغـــــــــــــــــــــــــــيل لعـــــــــــــام 201"]
["OR",null,"الشهر","الإجمـــالى","الإجمالى",{"$f":"ديسمبر!G2","v":"صيانة\nواصلاح\nوقطع غيار"},{"$f":"ديسمبر!H2","v":"خامات تشغيل"},{"$f":"ديسمبر!I2","v":"م سيارات"},{"$f":"ديسمبر!J2","v":"كهرباء"},{"$f":"ديسمبر!K2","v":"م نظافة"},{"$f":"ديسمبر!L2","v":"مياه"},{"$f":"ديسمبر!M2","v":"تأمينات"},{"$f":"ديسمبر!N2","v":"أجور"},{"$f":"ديسمبر!O2","v":0},{"$f":"ديسمبر!P2","v":0},{"$f":"ديسمبر!Q2","v":0},{"$f":"ديسمبر!R2","v":0},{"$f":"ديسمبر!S2","v":0},{"$f":"ديسمبر!T2","v":0},{"$f":"ديسمبر!U2","v":0},{"$f":"ديسمبر!V2","v":0},{"$f":"ديسمبر!W2","v":0},{"$f":"ديسمبر!X2","v":0},{"$f":"ديسمبر!Y2","v":0},{"$f":"ديسمبر!Z2","v":0},{"$f":"ديسمبر!AA2","v":0},{"$f":"ديسمبر!AB2","v":0},{"$f":"ديسمبر!AC2","v":0},{"$f":"ديسمبر!AD2","v":0},{"$f":"ديسمبر!AE2","v":0},{"$f":"ديسمبر!AF2","v":0},{"$f":"ديسمبر!AG2","v":0}]
[]
[{"$f":"IF(D4=E4,\"ok\",\"error\")","v":"ok"},{"$f":"D4-E4","v":0},"يناير",{"$f":"SUM(F4:AF4)","v":0},{"$f":"يناير!$F$104","v":0},{"$f":"يناير!G104","v":0},{"$f":"يناير!H104","v":0},{"$f":"يناير!I104","v":0},{"$f":"يناير!J104","v":0},{"$f":"يناير!K104","v":0},{"$f":"يناير!L104","v":0},{"$f":"يناير!M104","v":0},{"$f":"يناير!N104","v":0},{"$f":"يناير!O104","v":0},{"$f":"يناير!P104","v":0},{"$f":"يناير!Q104","v":0},{"$f":"يناير!R104","v":0},{"$f":"يناير!S104","v":0},{"$f":"يناير!T104","v":0},{"$f":"يناير!U104","v":0},{"$f":"يناير!V104","v":0},{"$f":"يناير!W104","v":0},{"$f":"يناير!X104","v":0},{"$f":"يناير!Y104","v":0},{"$f":"يناير!Z104","v":0},{"$f":"يناير!AA104","v":0},{"$f":"يناير!AB104","v":0},{"$f":"يناير!AC104","v":0},{"$f":"يناير!AD104","v":0},{"$f":"يناير!AE104","v":0},{"$f":"يناير!AF104","v":0},{"$f":"يناير!AG104","v":0}]
[{"$f":"IF(D5=E5,\"ok\",\"error\")","v":"ok"},{"$f":"D5-E5","v":0},"فبراير",{"$f":"SUM(F5:AF5)","v":0},{"$f":"فبراير!$F$104","v":0},{"$f":"فبراير!G104","v":0},{"$f":"فبراير!H104","v":0},{"$f":"فبراير!I104","v":0},{"$f":"فبراير!J104","v":0},{"$f":"فبراير!K104","v":0},{"$f":"فبراير!L104","v":0},{"$f":"فبراير!M104","v":0},{"$f":"فبراير!N104","v":0},{"$f":"فبراير!O104","v":0},{"$f":"فبراير!P104","v":0},{"$f":"فبراير!Q104","v":0},{"$f":"فبراير!R104","v":0},{"$f":"فبراير!S104","v":0},{"$f":"فبراير!T104","v":0},{"$f":"فبراير!U104","v":0},{"$f":"فبراير!V104","v":0},{"$f":"فبراير!W104","v":0},{"$f":"فبراير!X104","v":0},{"$f":"فبراير!Y104","v":0},{"$f":"فبراير!Z104","v":0},{"$f":"فبراير!AA104","v":0},{"$f":"فبراير!AB104","v":0},{"$f":"فبراير!AC104","v":0},{"$f":"فبراير!AD104","v":0},{"$f":"فبراير!AE104","v":0},{"$f":"فبراير!AF104","v":0},{"$f":"فبراير!AG104","v":0}]
["ok",0,"مارس",0,{"$f":"مارس!$F$104","v":0},{"$f":"مارس!G104","v":0},{"$f":"مارس!H104","v":0},{"$f":"مارس!I104","v":0},{"$f":"مارس!J104","v":0},{"$f":"مارس!K104","v":0},{"$f":"مارس!L104","v":0},{"$f":"مارس!M104","v":0},{"$f":"مارس!N104","v":0},{"$f":"مارس!O104","v":0},{"$f":"مارس!P104","v":0},{"$f":"مارس!Q104","v":0},{"$f":"مارس!R104","v":0},{"$f":"مارس!S104","v":0},{"$f":"مارس!T104","v":0},{"$f":"مارس!U104","v":0},{"$f":"مارس!V104","v":0},{"$f":"مارس!W104","v":0},{"$f":"مارس!X104","v":0},{"$f":"مارس!Y104","v":0},{"$f":"مارس!Z104","v":0},{"$f":"مارس!AA104","v":0},{"$f":"مارس!AB104","v":0},{"$f":"مارس!AC104","v":0},{"$f":"مارس!AD104","v":0},{"$f":"مارس!AE104","v":0},{"$f":"مارس!AF104","v":0},{"$f":"مارس!AG104","v":0}]
["ok",0,"أبريل",0,{"$f":"ابريل!$F$104","v":0},{"$f":"ابريل!G104","v":0},{"$f":"ابريل!H104","v":0},{"$f":"ابريل!I104","v":0},{"$f":"ابريل!J104","v":0},{"$f":"ابريل!K104","v":0},{"$f":"ابريل!L104","v":0},{"$f":"ابريل!M104","v":0},{"$f":"ابريل!N104","v":0},{"$f":"ابريل!O104","v":0},{"$f":"ابريل!P104","v":0},{"$f":"ابريل!Q104","v":0},{"$f":"ابريل!R104","v":0},{"$f":"ابريل!S104","v":0},{"$f":"ابريل!T104","v":0},{"$f":"ابريل!U104","v":0},{"$f":"ابريل!V104","v":0},{"$f":"ابريل!W104","v":0},{"$f":"ابريل!X104","v":0},{"$f":"ابريل!Y104","v":0},{"$f":"ابريل!Z104","v":0},{"$f":"ابريل!AA104","v":0},{"$f":"ابريل!AB104","v":0},{"$f":"ابريل!AC104","v":0},{"$f":"ابريل!AD104","v":0},{"$f":"ابريل!AE104","v":0},{"$f":"ابريل!AF104","v":0},{"$f":"ابريل!AG104","v":0}]
["ok",0,"مايو",0,{"$f":"مايو!$F$104","v":0},{"$f":"مايو!G104","v":0},{"$f":"مايو!H104","v":0},{"$f":"مايو!I104","v":0},{"$f":"مايو!J104","v":0},{"$f":"مايو!K104","v":0},{"$f":"مايو!L104","v":0},{"$f":"مايو!M104","v":0},{"$f":"مايو!N104","v":0},{"$f":"مايو!O104","v":0},{"$f":"مايو!P104","v":0},{"$f":"مايو!Q104","v":0},{"$f":"مايو!R104","v":0},{"$f":"مايو!S104","v":0},{"$f":"مايو!T104","v":0},{"$f":"مايو!U104","v":0},{"$f":"مايو!V104","v":0},{"$f":"مايو!W104","v":0},{"$f":"مايو!X104","v":0},{"$f":"مايو!Y104","v":0},{"$f":"مايو!Z104","v":0},{"$f":"مايو!AA104","v":0},{"$f":"مايو!AB104","v":0},{"$f":"مايو!AC104","v":0},{"$f":"مايو!AD104","v":0},{"$f":"مايو!AE104","v":0},{"$f":"مايو!AF104","v":0},{"$f":"مايو!AG104","v":0}]
["ok",0,"يونيو",0,{"$f":"يونيو!$F$104","v":0},{"$f":"يونيو!G104","v":0},{"$f":"يونيو!H104","v":0},{"$f":"يونيو!I104","v":0},{"$f":"يونيو!J104","v":0},{"$f":"يونيو!K104","v":0},{"$f":"يونيو!L104","v":0},{"$f":"يونيو!M104","v":0},{"$f":"يونيو!N104","v":0},{"$f":"يونيو!O104","v":0},{"$f":"يونيو!P104","v":0},{"$f":"يونيو!Q104","v":0},{"$f":"يونيو!R104","v":0},{"$f":"يونيو!S104","v":0},{"$f":"يونيو!T104","v":0},{"$f":"يونيو!U104","v":0},{"$f":"يونيو!V104","v":0},{"$f":"يونيو!W104","v":0},{"$f":"يونيو!X104","v":0},{"$f":"يونيو!Y104","v":0},{"$f":"يونيو!Z104","v":0},{"$f":"يونيو!AA104","v":0},{"$f":"يونيو!AB104","v":0},{"$f":"يونيو!AC104","v":0},{"$f":"يونيو!AD104","v":0},{"$f":"يونيو!AE104","v":0},{"$f":"يونيو!AF104","v":0},{"$f":"يونيو!AG104","v":0}]
["ok",0,"يوليو",0,{"$f":"يوليو!$F$104","v":0},{"$f":"يوليو!G104","v":0},{"$f":"يوليو!H104","v":0},{"$f":"يوليو!I104","v":0},{"$f":"يوليو!J104","v":0},{"$f":"يوليو!K104","v":0},{"$f":"يوليو!L104","v":0},{"$f":"يوليو!M104","v":0},{"$f":"يوليو!N104","v":0},{"$f":"يوليو!O104","v":0},{"$f":"يوليو!P104","v":0},{"$f":"يوليو!Q104","v":0},{"$f":"يوليو!R104","v":0},{"$f":"يوليو!S104","v":0},{"$f":"يوليو!T104","v":0},{"$f":"يوليو!U104","v":0},{"$f":"يوليو!V104","v":0},{"$f":"يوليو!W104","v":0},{"$f":"يوليو!X104","v":0},{"$f":"يوليو!Y104","v":0},{"$f":"يوليو!Z104","v":0},{"$f":"يوليو!AA104","v":0},{"$f":"يوليو!AB104","v":0},{"$f":"يوليو!AC104","v":0},{"$f":"يوليو!AD104","v":0},{"$f":"يوليو!AE104","v":0},{"$f":"يوليو!AF104","v":0},{"$f":"يوليو!AG104","v":0}]
["ok",0,"أغسطس",0,{"$f":"أغسطس!$F$104","v":0},{"$f":"أغسطس!G104","v":0},{"$f":"أغسطس!H104","v":0},{"$f":"أغسطس!I104","v":0},{"$f":"أغسطس!J104","v":0},{"$f":"أغسطس!K104","v":0},{"$f":"أغسطس!L104","v":0},{"$f":"أغسطس!M104","v":0},{"$f":"أغسطس!N104","v":0},{"$f":"أغسطس!O104","v":0},{"$f":"أغسطس!P104","v":0},{"$f":"أغسطس!Q104","v":0},{"$f":"أغسطس!R104","v":0},{"$f":"أغسطس!S104","v":0},{"$f":"أغسطس!T104","v":0},{"$f":"أغسطس!U104","v":0},{"$f":"أغسطس!V104","v":0},{"$f":"أغسطس!W104","v":0},{"$f":"أغسطس!X104","v":0},{"$f":"أغسطس!Y104","v":0},{"$f":"أغسطس!Z104","v":0},{"$f":"أغسطس!AA104","v":0},{"$f":"أغسطس!AB104","v":0},{"$f":"أغسطس!AC104","v":0},{"$f":"أغسطس!AD104","v":0},{"$f":"أغسطس!AE104","v":0},{"$f":"أغسطس!AF104","v":0},{"$f":"أغسطس!AG104","v":0}]
["ok",0,"سبتمبر",0,{"$f":"سبتمبر!$F$104","v":0},{"$f":"سبتمبر!G104","v":0},{"$f":"سبتمبر!H104","v":0},{"$f":"سبتمبر!I104","v":0},{"$f":"سبتمبر!J104","v":0},{"$f":"سبتمبر!K104","v":0},{"$f":"سبتمبر!L104","v":0},{"$f":"سبتمبر!M104","v":0},{"$f":"سبتمبر!N104","v":0},{"$f":"سبتمبر!O104","v":0},{"$f":"سبتمبر!P104","v":0},{"$f":"سبتمبر!Q104","v":0},{"$f":"سبتمبر!R104","v":0},{"$f":"سبتمبر!S104","v":0},{"$f":"سبتمبر!T104","v":0},{"$f":"سبتمبر!U104","v":0},{"$f":"سبتمبر!V104","v":0},{"$f":"سبتمبر!W104","v":0},{"$f":"سبتمبر!X104","v":0},{"$f":"سبتمبر!Y104","v":0},{"$f":"سبتمبر!Z104","v":0},{"$f":"سبتمبر!AA104","v":0},{"$f":"سبتمبر!AB104","v":0},{"$f":"سبتمبر!AC104","v":0},{"$f":"سبتمبر!AD104","v":0},{"$f":"سبتمبر!AE104","v":0},{"$f":"سبتمبر!AF104","v":0},{"$f":"سبتمبر!AG104","v":0}]
["ok",0,"أكتوبر",0,{"$f":"أكتوبر!$F$104","v":0},{"$f":"أكتوبر!G104","v":0},{"$f":"أكتوبر!H104","v":0},{"$f":"أكتوبر!I104","v":0},{"$f":"أكتوبر!J104","v":0},{"$f":"أكتوبر!K104","v":0},{"$f":"أكتوبر!L104","v":0},{"$f":"أكتوبر!M104","v":0},{"$f":"أكتوبر!N104","v":0},{"$f":"أكتوبر!O104","v":0},{"$f":"أكتوبر!P104","v":0},{"$f":"أكتوبر!Q104","v":0},{"$f":"أكتوبر!R104","v":0},{"$f":"أكتوبر!S104","v":0},{"$f":"أكتوبر!T104","v":0},{"$f":"أكتوبر!U104","v":0},{"$f":"أكتوبر!V104","v":0},{"$f":"أكتوبر!W104","v":0},{"$f":"أكتوبر!X104","v":0},{"$f":"أكتوبر!Y104","v":0},{"$f":"أكتوبر!Z104","v":0},{"$f":"أكتوبر!AA104","v":0},{"$f":"أكتوبر!AB104","v":0},{"$f":"أكتوبر!AC104","v":0},{"$f":"أكتوبر!AD104","v":0},{"$f":"أكتوبر!AE104","v":0},{"$f":"أكتوبر!AF104","v":0},{"$f":"أكتوبر!AG104","v":0}]
["ok",0,"نوفمبر",0,{"$f":"نوفمبر!$F$104","v":0},{"$f":"نوفمبر!G104","v":0},{"$f":"نوفمبر!H104","v":0},{"$f":"نوفمبر!I104","v":0},{"$f":"نوفمبر!J104","v":0},{"$f":"نوفمبر!K104","v":0},{"$f":"نوفمبر!L104","v":0},{"$f":"نوفمبر!M104","v":0},{"$f":"نوفمبر!N104","v":0},{"$f":"نوفمبر!O104","v":0},{"$f":"نوفمبر!P104","v":0},{"$f":"نوفمبر!Q104","v":0},{"$f":"نوفمبر!R104","v":0},{"$f":"نوفمبر!S104","v":0},{"$f":"نوفمبر!T104","v":0},{"$f":"نوفمبر!U104","v":0},{"$f":"نوفمبر!V104","v":0},{"$f":"نوفمبر!W104","v":0},{"$f":"نوفمبر!X104","v":0},{"$f":"نوفمبر!Y104","v":0},{"$f":"نوفمبر!Z104","v":0},{"$f":"نوفمبر!AA104","v":0},{"$f":"نوفمبر!AB104","v":0},{"$f":"نوفمبر!AC104","v":0},{"$f":"نوفمبر!AD104","v":0},{"$f":"نوفمبر!AE104","v":0},{"$f":"نوفمبر!AF104","v":0},{"$f":"نوفمبر!AG104","v":0}]
["ok",0,"ديسمبر",0,{"$f":"ديسمبر!$F$104","v":0},{"$f":"ديسمبر!G104","v":0},{"$f":"ديسمبر!H104","v":0},{"$f":"ديسمبر!I104","v":0},{"$f":"ديسمبر!J104","v":0},{"$f":"ديسمبر!K104","v":0},{"$f":"ديسمبر!L104","v":0},{"$f":"ديسمبر!M104","v":0},{"$f":"ديسمبر!N104","v":0},{"$f":"ديسمبر!O104","v":0},{"$f":"ديسمبر!P104","v":0},{"$f":"ديسمبر!Q104","v":0},{"$f":"ديسمبر!R104","v":0},{"$f":"ديسمبر!S104","v":0},{"$f":"ديسمبر!T104","v":0},{"$f":"ديسمبر!U104","v":0},{"$f":"ديسمبر!V104","v":0},{"$f":"ديسمبر!W104","v":0},{"$f":"ديسمبر!X104","v":0},{"$f":"ديسمبر!Y104","v":0},{"$f":"ديسمبر!Z104","v":0},{"$f":"ديسمبر!AA104","v":0},{"$f":"ديسمبر!AB104","v":0},{"$f":"ديسمبر!AC104","v":0},{"$f":"ديسمبر!AD104","v":0},{"$f":"ديسمبر!AE104","v":0},{"$f":"ديسمبر!AF104","v":0},{"$f":"ديسمبر!AG104","v":0}]
["ok",0,"الإجمالى",0,{"$f":"SUM(E4:E15)","v":0},{"$f":"SUM(F4:F15)","v":0},{"$f":"SUM(G4:G15)","v":0},0,0,0,0,0,0,0,0,0,{"$f":"SUM(Q4:Q15)","v":0},0,0,0,0,0,0,0,0,0,0,0,0,0,0,0]
[null,null,null,null,"?",{"$f":"IF(D16='[1]ميزان المراجعة'!$G$20,\"OK\",\"error\")","v":"OK"}]