{"text_format":"1","workbook":"xlsx","n_sheets":3,"sheets":["الاساسية","فاتورة","تفاصيل الفاتورة"],"not_rendered":{"charts":0,"images":0,"macros":1,"external_links":0,"defined_names":0,"comments":0,"pivot_tables":0},"unopened":[],"bounds":{"document_bytes":16777216,"sheet_cells":100000,"rows_first":2000,"rows_last":500,"rows_between":2000,"halvings":0,"cell_chars":16384,"cell_head_chars":4096},"cells_cut":0,"cells_raw":0,"read":"whole","date_system":"1900"}

{"sheet":"الاساسية","index":0,"n_rows":163,"n_cols":10,"rows_kept":163,"cut":false,"hidden":false,"merged":[]}
[]
[]
[null,null,"كود الصنف","اسم الصنف","السعر",null,"الرقم","إسم العميل","المندوب","المشرف"]
[null,null,1001002,"صنف رقم 1",16.225000000000001,null,1204012,"العميل رقم 1","مندوب1","مشرف1"]
[null,null,1001003,"صنف رقم 2",8.25,null,1204019,"العميل رقم 2","مندوب1","مشرف2"]
[null,null,1001005,"صنف رقم 3",8.91,null,1204025,"العميل رقم 3","مندوب1","مشرف1"]
[null,null,1001014,"صنف رقم 4",19.5,null,24010275,"العميل رقم 4","مندوب1","مشرف2"]
["نوع الفاتورة",null,1001016,"صنف رقم 5",39,null,1204031,"العميل رقم 5","مندوب1","مشرف1"]
["مجانى ",null,1001017,"صنف رقم 6",19.5,null,1204033,"العميل رقم 6","مندوب1","مشرف2"]
["بالحساب",null,1001018,"صنف رقم 7",11,null,1204036,"العميل رقم 7","مندوب1","مشرف1"]
["فرق سعر",null,1001020,"صنف رقم 8",35,null,12040330,"العميل رقم 8","مندوب1","مشرف2"]
["بدل ايجار",null,1001021,"صنف رقم 9",15.75,null,1205009,"العميل رقم 9","مندوب1","مشرف1"]
["بدل ايجار طبلية",null,1001022,"صنف رقم 10",11.75,null,12050019,"العميل رقم 10","مندوب1","مشرف2"]
["لاغى",null,1001024,"صنف رقم 11",65,null,12050022,"العميل رقم 11","مندوب1","مشرف1"]
[null,null,1001026,"صنف رقم 12",22.5,null,1206023,"العميل رقم 12","مندوب1","مشرف2"]
["المندوب",null,1002012,"صنف رقم 13",16,null,1206191,"العميل رقم 13","مندوب1","مشرف1"]
["مندوب2",null,1003001,"صنف رقم 14",11.53,null,null,"العميل رقم 14","مندوب1","مشرف2"]
["مندوب1 ",null,1003002,"صنف رقم 15",5.7649999999999997,null,1206201,"العميل رقم 15","مندوب1","مشرف1"]
["مندوب4",null,1003003,"صنف رقم 16",3.0249999999999999,null,1206202,"العميل رقم 16","مندوب1","مشرف2"]
["مندوب3",null,1006005,"صنف رقم 17",9.9,null,1206211,"العميل رقم 17","مندوب1","مشرف1"]
{"$rows_left_out":144}
{"sheet":"فاتورة","index":1,"n_rows":31,"n_cols":7,"rows_kept":31,"cut":false,"hidden":false,"merged":[[30,3,30,4],[1,4,1,5],[2,4,2,5],[3,4,3,5],[4,4,4,5],[27,3,27,4],[28,3,28,4],[29,3,29,4]]}
[]
[null,"التاريخ",{"$f":"TODAY()","v":"2018-05-22"},"رقم الفاتورة",{"$f":"MAX('تفاصيل الفاتورة'!$B:$B)+1","v":1}]
[null,"رقم العميل",null,"نوع الفاتورة","بالحساب",null,1]
[null,"العميل",{"$f":"IFERROR(VLOOKUP(C3,الاساسية!$G$4:$I$50000,2,0),\"لا يوجد عميل بهذا الرقم\")","v":"لا يوجد عميل بهذا الرقم"},"المندوب",{"$f":"IFERROR(VLOOKUP(C3,الاساسية!$G$4:$I$50000,3,0),\"غير معرف\")","v":"غير معرف"},null,2]
[null,null,null,"المشرف",{"$f":"IFERROR(VLOOKUP(C3,الاساسية!$G$4:$J$50000,4,0),\"غير معرف\")","v":"غير معرف"},null,3]
[null,"كود الصنف","الصنف","السعر","الكمية","الاجمالى",4]
[1,null,{"$f":"IFERROR(VLOOKUP(B7,الاساسية!$C$4:$E$50000,2,0),\"لايوجد صنف \")","v":"لايوجد صنف "},{"$f":"IFERROR(VLOOKUP(B7,الاساسية!$C$4:$E$50000,3,0),\"0.000\")","v":"0.000"},null,{"$f":"D7*E7","v":0},5]
[2,null,{"$f":"IFERROR(VLOOKUP(B8,الاساسية!$C$4:$E$50000,2,0),\"لايوجد صنف \")","v":"لايوجد صنف "},{"$f":"IFERROR(VLOOKUP(B8,الاساسية!$C$4:$E$50000,3,0),\"0.000\")","v":"0.000"},null,0,6]
[3,null,{"$f":"IFERROR(VLOOKUP(B9,الاساسية!$C$4:$E$50000,2,0),\"لايوجد صنف \")","v":"لايوجد صنف "},{"$f":"IFERROR(VLOOKUP(B9,الاساسية!$C$4:$E$50000,3,0),\"0.000\")","v":"0.000"},null,0,7]
[4,null,{"$f":"IFERROR(VLOOKUP(B10,الاساسية!$C$4:$E$50000,2,0),\"لايوجد صنف \")","v":"لايوجد صنف "},{"$f":"IFERROR(VLOOKUP(B10,الاساسية!$C$4:$E$50000,3,0),\"0.000\")","v":"0.000"},null,0,8]
[5,null,{"$f":"IFERROR(VLOOKUP(B11,الاساسية!$C$4:$E$50000,2,0),\"لايوجد صنف \")","v":"لايوجد صنف "},{"$f":"IFERROR(VLOOKUP(B11,الاساسية!$C$4:$E$50000,3,0),\"0.000\")","v":"0.000"},null,0,9]
[6,null,{"$f":"IFERROR(VLOOKUP(B12,الاساسية!$C$4:$E$50000,2,0),\"لايوجد صنف \")","v":"لايوجد صنف "},{"$f":"IFERROR(VLOOKUP(B12,الاساسية!$C$4:$E$50000,3,0),\"0.000\")","v":"0.000"},null,0,10]
[7,null,{"$f":"IFERROR(VLOOKUP(B13,الاساسية!$C$4:$E$50000,2,0),\"لايوجد صنف \")","v":"لايوجد صنف "},{"$f":"IFERROR(VLOOKUP(B13,الاساسية!$C$4:$E$50000,3,0),\"0.000\")","v":"0.000"},null,0,11]
[8,null,{"$f":"IFERROR(VLOOKUP(B14,الاساسية!$C$4:$E$50000,2,0),\"لايوجد صنف \")","v":"لايوجد صنف "},{"$f":"IFERROR(VLOOKUP(B14,الاساسية!$C$4:$E$50000,3,0),\"0.000\")","v":"0.000"},null,0,12]
[9,null,{"$f":"IFERROR(VLOOKUP(B15,الاساسية!$C$4:$E$50000,2,0),\"لايوجد صنف \")","v":"لايوجد صنف "},{"$f":"IFERROR(VLOOKUP(B15,الاساسية!$C$4:$E$50000,3,0),\"0.000\")","v":"0.000"},null,0,13]
[10,null,{"$f":"IFERROR(VLOOKUP(B16,الاساسية!$C$4:$E$50000,2,0),\"لايوجد صنف \")","v":"لايوجد صنف "},{"$f":"IFERROR(VLOOKUP(B16,الاساسية!$C$4:$E$50000,3,0),\"0.000\")","v":"0.000"},null,0,14]
[11,null,{"$f":"IFERROR(VLOOKUP(B17,الاساسية!$C$4:$E$50000,2,0),\"لايوجد صنف \")","v":"لايوجد صنف "},{"$f":"IFERROR(VLOOKUP(B17,الاساسية!$C$4:$E$50000,3,0),\"0.000\")","v":"0.000"},null,0,15]
[12,null,{"$f":"IFERROR(VLOOKUP(B18,الاساسية!$C$4:$E$50000,2,0),\"لايوجد صنف \")","v":"لايوجد صنف "},{"$f":"IFERROR(VLOOKUP(B18,الاساسية!$C$4:$E$50000,3,0),\"0.000\")","v":"0.000"},null,0,16]
[13,null,{"$f":"IFERROR(VLOOKUP(B19,الاساسية!$C$4:$E$50000,2,0),\"لايوجد صنف \")","v":"لايوجد صنف "},{"$f":"IFERROR(VLOOKUP(B19,الاساسية!$C$4:$E$50000,3,0),\"0.000\")","v":"0.000"},null,0,17]
[14,null,{"$f":"IFERROR(VLOOKUP(B20,الاساسية!$C$4:$E$50000,2,0),\"لايوجد صنف \")","v":"لايوجد صنف "},{"$f":"IFERROR(VLOOKUP(B20,الاساسية!$C$4:$E$50000,3,0),\"0.000\")","v":"0.000"},null,0,18]
{"$rows_left_out":12}
{"sheet":"تفاصيل الفاتورة","index":2,"n_rows":97,"n_cols":13,"rows_kept":97,"cut":false,"hidden":false,"merged":[]}
[]
[null,"رقم الفاتورة","التاريخ","نوع الفاتورة","رقم العميل","العميل","المندوب","المشرف","كود الصنف","الصنف","السعر","الكمية","الاجمالى"]
[null,{"$f":"IF(ROWS($A$1:A1)>COUNTIF(فاتورة!$C$7:$C$27,\"<>0\"),\"\",INDEX(فاتورة!$E$2,SMALL(IF(فاتورة!$C$7:$C$27<>0,ROW($C$7:$C$27)-ROW($C$7)+1),ROWS($A$1:A1))))","v":0},{"$f":"IF(ROWS($A$1:B1)>COUNTIF(فاتورة!$C$7:$C$27,\"<>0\"),\"\",INDEX(فاتورة!$C$2,SMALL(IF(فاتورة!$C$7:$C$27<>0,ROW($C$7:$C$27)-ROW($C$7)+1),ROWS($A$1:B1))))","v":"2018-05-22"},{"$f":"IF(ROWS($A$1:C1)>COUNTIF(فاتورة!$C$7:$C$27,\"<>0\"),\"\",INDEX(فاتورة!$E$3,SMALL(IF(فاتورة!$C$7:$C$27<>0,ROW($C$7:$C$27)-ROW($C$7)+1),ROWS($A$1:C1))))","v":"بالحساب"},{"$f":"IF(ROWS($A$1:D1)>COUNTIF(فاتورة!$C$7:$C$27,\"<>0\"),\"\",INDEX(فاتورة!$C$3,SMALL(IF(فاتورة!$C$7:$C$27<>0,ROW($C$7:$C$27)-ROW($C$7)+1),ROWS($A$1:D1))))","v":0},{"$f":"IF(ROWS($A$1:E1)>COUNTIF(فاتورة!$C$7:$C$27,\"<>0\"),\"\",INDEX(فاتورة!$C$4,SMALL(IF(فاتورة!$C$7:$C$27<>0,ROW($C$7:$C$27)-ROW($C$7)+1),ROWS($A$1:E1))))","v":"لا يوجد عميل بهذا الرقم"},{"$f":"IF(ROWS($A$1:F1)>COUNTIF(فاتورة!$C$7:$C$27,\"<>0\"),\"\",INDEX(فاتورة!$E$4,SMALL(IF(فاتورة!$C$7:$C$27<>0,ROW($C$7:$C$27)-ROW($C$7)+1),ROWS($A$1:F1))))","v":"غير معرف"},{"$f":"IF(ROWS($A$1:G1)>COUNTIF(فاتورة!$C$7:$C$27,\"<>0\"),\"\",INDEX(فاتورة!$E$5,SMALL(IF(فاتورة!$C$7:$C$27<>0,ROW($C$7:$C$27)-ROW($C$7)+1),ROWS($A$1:G1))))","v":"غير معرف"},{"$f":"IF(ROWS($A$1:H1)>COUNTIF(فاتورة!$C$7:$C$27,\"<>0\"),\"\",INDEX(فاتورة!$B$7:$B$27,SMALL(IF(فاتورة!$C$7:$C$27<>0,ROW($C$7:$C$27)-ROW($C$7)+1),ROWS($A$1:H1))))","v":0},{"$f":"IF(ROWS($A$1:I1)>COUNTIF(فاتورة!$C$7:$C$27,\"<>0\"),\"\",INDEX(فاتورة!$C$7:$C$27,SMALL(IF(فاتورة!$C$7:$C$27<>0,ROW($C$7:$C$27)-ROW($C$7)+1),ROWS($A$1:I1))))","v":"لايوجد صنف "},{"$f":"IF(ROWS($A$1:J1)>COUNTIF(فاتورة!$C$7:$C$27,\"<>0\"),\"\",INDEX(فاتورة!$D$7:$D$27,SMALL(IF(فاتورة!$C$7:$C$27<>0,ROW($C$7:$C$27)-ROW($C$7)+1),ROWS($A$1:J1))))","v":"0.000"},{"$f":"IF(ROWS($A$1:K1)>COUNTIF(فاتورة!$C$7:$C$27,\"<>0\"),\"\",INDEX(فاتورة!$E$7:$E$27,SMALL(IF(فاتورة!$C$7:$C$27<>0,ROW($C$7:$C$27)-ROW($C$7)+1),ROWS($A$1:K1))))","v":0},{"$f":"IF(ROWS($A$1:L1)>COUNTIF(فاتورة!$C$7:$C$27,\"<>0\"),\"\",INDEX(فاتورة!$F$7:$F$27,SMALL(IF(فاتورة!$C$7:$C$27<>0,ROW($C$7:$C$27)-ROW($C$7)+1),ROWS($A$1:L1))))","v":0}]
[null,null,null,null,null,null,null,null,{"$f":"IF(ROWS($A$1:H2)>COUNTIF(فاتورة!$C$7:$C$27,\"<>0\"),\"\",INDEX(فاتورة!$B$7:$B$27,SMALL(IF(فاتورة!$C$7:$C$27<>0,ROW($C$7:$C$27)-ROW($C$7)+1),ROWS($A$1:H2))))","v":0},{"$f":"IF(ROWS($A$1:I2)>COUNTIF(فاتورة!$C$7:$C$27,\"<>0\"),\"\",INDEX(فاتورة!$C$7:$C$27,SMALL(IF(فاتورة!$C$7:$C$27<>0,ROW($C$7:$C$27)-ROW($C$7)+1),ROWS($A$1:I2))))","v":"لايوجد صنف "},{"$f":"IF(ROWS($A$1:J2)>COUNTIF(فاتورة!$C$7:$C$27,\"<>0\"),\"\",INDEX(فاتورة!$D$7:$D$27,SMALL(IF(فاتورة!$C$7:$C$27<>0,ROW($C$7:$C$27)-ROW($C$7)+1),ROWS($A$1:J2))))","v":"0.000"},{"$f":"IF(ROWS($A$1:K2)>COUNTIF(فاتورة!$C$7:$C$27,\"<>0\"),\"\",INDEX(فاتورة!$E$7:$E$27,SMALL(IF(فاتورة!$C$7:$C$27<>0,ROW($C$7:$C$27)-ROW($C$7)+1),ROWS($A$1:K2))))","v":0},{"$f":"IF(ROWS($A$1:L2)>COUNTIF(فاتورة!$C$7:$C$27,\"<>0\"),\"\",INDEX(فاتورة!$F$7:$F$27,SMALL(IF(فاتورة!$C$7:$C$27<>0,ROW($C$7:$C$27)-ROW($C$7)+1),ROWS($A$1:L2))))","v":0}]
[null,null,null,null,null,null,null,null,{"$f":"IF(ROWS($A$1:H3)>COUNTIF(فاتورة!$C$7:$C$27,\"<>0\"),\"\",INDEX(فاتورة!$B$7:$B$27,SMALL(IF(فاتورة!$C$7:$C$27<>0,ROW($C$7:$C$27)-ROW($C$7)+1),ROWS($A$1:H3))))","v":0},{"$f":"IF(ROWS($A$1:I3)>COUNTIF(فاتورة!$C$7:$C$27,\"<>0\"),\"\",INDEX(فاتورة!$C$7:$C$27,SMALL(IF(فاتورة!$C$7:$C$27<>0,ROW($C$7:$C$27)-ROW($C$7)+1),ROWS($A$1:I3))))","v":"لايوجد صنف "},{"$f":"IF(ROWS($A$1:J3)>COUNTIF(فاتورة!$C$7:$C$27,\"<>0\"),\"\",INDEX(فاتورة!$D$7:$D$27,SMALL(IF(فاتورة!$C$7:$C$27<>0,ROW($C$7:$C$27)-ROW($C$7)+1),ROWS($A$1:J3))))","v":"0.000"},{"$f":"IF(ROWS($A$1:K3)>COUNTIF(فاتورة!$C$7:$C$27,\"<>0\"),\"\",INDEX(فاتورة!$E$7:$E$27,SMALL(IF(فاتورة!$C$7:$C$27<>0,ROW($C$7:$C$27)-ROW($C$7)+1),ROWS($A$1:K3))))","v":0},{"$f":"IF(ROWS($A$1:L3)>COUNTIF(فاتورة!$C$7:$C$27,\"<>0\"),\"\",INDEX(فاتورة!$F$7:$F$27,SMALL(IF(فاتورة!$C$7:$C$27<>0,ROW($C$7:$C$27)-ROW($C$7)+1),ROWS($A$1:L3))))","v":0}]
[null,null,null,null,null,null,null,null,{"$f":"IF(ROWS($A$1:H4)>COUNTIF(فاتورة!$C$7:$C$27,\"<>0\"),\"\",INDEX(فاتورة!$B$7:$B$27,SMALL(IF(فاتورة!$C$7:$C$27<>0,ROW($C$7:$C$27)-ROW($C$7)+1),ROWS($A$1:H4))))","v":0},{"$f":"IF(ROWS($A$1:I4)>COUNTIF(فاتورة!$C$7:$C$27,\"<>0\"),\"\",INDEX(فاتورة!$C$7:$C$27,SMALL(IF(فاتورة!$C$7:$C$27<>0,ROW($C$7:$C$27)-ROW($C$7)+1),ROWS($A$1:I4))))","v":"لايوجد صنف "},{"$f":"IF(ROWS($A$1:J4)>COUNTIF(فاتورة!$C$7:$C$27,\"<>0\"),\"\",INDEX(فاتورة!$D$7:$D$27,SMALL(IF(فاتورة!$C$7:$C$27<>0,ROW($C$7:$C$27)-ROW($C$7)+1),ROWS($A$1:J4))))","v":"0.000"},{"$f":"IF(ROWS($A$1:K4)>COUNTIF(فاتورة!$C$7:$C$27,\"<>0\"),\"\",INDEX(فاتورة!$E$7:$E$27,SMALL(IF(فاتورة!$C$7:$C$27<>0,ROW($C$7:$C$27)-ROW($C$7)+1),ROWS($A$1:K4))))","v":0},{"$f":"IF(ROWS($A$1:L4)>COUNTIF(فاتورة!$C$7:$C$27,\"<>0\"),\"\",INDEX(فاتورة!$F$7:$F$27,SMALL(IF(فاتورة!$C$7:$C$27<>0,ROW($C$7:$C$27)-ROW($C$7)+1),ROWS($A$1:L4))))","v":0}]
[null,null,null,null,null,null,null,null,{"$f":"IF(ROWS($A$1:H5)>COUNTIF(فاتورة!$C$7:$C$27,\"<>0\"),\"\",INDEX(فاتورة!$B$7:$B$27,SMALL(IF(فاتورة!$C$7:$C$27<>0,ROW($C$7:$C$27)-ROW($C$7)+1),ROWS($A$1:H5))))","v":0},{"$f":"IF(ROWS($A$1:I5)>COUNTIF(فاتورة!$C$7:$C$27,\"<>0\"),\"\",INDEX(فاتورة!$C$7:$C$27,SMALL(IF(فاتورة!$C$7:$C$27<>0,ROW($C$7:$C$27)-ROW($C$7)+1),ROWS($A$1:I5))))","v":"لايوجد صنف "},{"$f":"IF(ROWS($A$1:J5)>COUNTIF(فاتورة!$C$7:$C$27,\"<>0\"),\"\",INDEX(فاتورة!$D$7:$D$27,SMALL(IF(فاتورة!$C$7:$C$27<>0,ROW($C$7:$C$27)-ROW($C$7)+1),ROWS($A$1:J5))))","v":"0.000"},{"$f":"IF(ROWS($A$1:K5)>COUNTIF(فاتورة!$C$7:$C$27,\"<>0\"),\"\",INDEX(فاتورة!$E$7:$E$27,SMALL(IF(فاتورة!$C$7:$C$27<>0,ROW($C$7:$C$27)-ROW($C$7)+1),ROWS($A$1:K5))))","v":0},{"$f":"IF(ROWS($A$1:L5)>COUNTIF(فاتورة!$C$7:$C$27,\"<>0\"),\"\",INDEX(فاتورة!$F$7:$F$27,SMALL(IF(فاتورة!$C$7:$C$27<>0,ROW($C$7:$C$27)-ROW($C$7)+1),ROWS($A$1:L5))))","v":0}]
[null,null,null,null,null,null,null,null,{"$f":"IF(ROWS($A$1:H6)>COUNTIF(فاتورة!$C$7:$C$27,\"<>0\"),\"\",INDEX(فاتورة!$B$7:$B$27,SMALL(IF(فاتورة!$C$7:$C$27<>0,ROW($C$7:$C$27)-ROW($C$7)+1),ROWS($A$1:H6))))","v":0},{"$f":"IF(ROWS($A$1:I6)>COUNTIF(فاتورة!$C$7:$C$27,\"<>0\"),\"\",INDEX(فاتورة!$C$7:$C$27,SMALL(IF(فاتورة!$C$7:$C$27<>0,ROW($C$7:$C$27)-ROW($C$7)+1),ROWS($A$1:I6))))","v":"لايوجد صنف "},{"$f":"IF(ROWS($A$1:J6)>COUNTIF(فاتورة!$C$7:$C$27,\"<>0\"),\"\",INDEX(فاتورة!$D$7:$D$27,SMALL(IF(فاتورة!$C$7:$C$27<>0,ROW($C$7:$C$27)-ROW($C$7)+1),ROWS($A$1:J6))))","v":"0.000"},{"$f":"IF(ROWS($A$1:K6)>COUNTIF(فاتورة!$C$7:$C$27,\"<>0\"),\"\",INDEX(فاتورة!$E$7:$E$27,SMALL(IF(فاتورة!$C$7:$C$27<>0,ROW($C$7:$C$27)-ROW($C$7)+1),ROWS($A$1:K6))))","v":0},{"$f":"IF(ROWS($A$1:L6)>COUNTIF(فاتورة!$C$7:$C$27,\"<>0\"),\"\",INDEX(فاتورة!$F$7:$F$27,SMALL(IF(فاتورة!$C$7:$C$27<>0,ROW($C$7:$C$27)-ROW($C$7)+1),ROWS($A$1:L6))))","v":0}]
[null,null,null,null,null,null,null,null,{"$f":"IF(ROWS($A$1:H7)>COUNTIF(فاتورة!$C$7:$C$27,\"<>0\"),\"\",INDEX(فاتورة!$B$7:$B$27,SMALL(IF(فاتورة!$C$7:$C$27<>0,ROW($C$7:$C$27)-ROW($C$7)+1),ROWS($A$1:H7))))","v":0},{"$f":"IF(ROWS($A$1:I7)>COUNTIF(فاتورة!$C$7:$C$27,\"<>0\"),\"\",INDEX(فاتورة!$C$7:$C$27,SMALL(IF(فاتورة!$C$7:$C$27<>0,ROW($C$7:$C$27)-ROW($C$7)+1),ROWS($A$1:I7))))","v":"لايوجد صنف "},{"$f":"IF(ROWS($A$1:J7)>COUNTIF(فاتورة!$C$7:$C$27,\"<>0\"),\"\",INDEX(فاتورة!$D$7:$D$27,SMALL(IF(فاتورة!$C$7:$C$27<>0,ROW($C$7:$C$27)-ROW($C$7)+1),ROWS($A$1:J7))))","v":"0.000"},{"$f":"IF(ROWS($A$1:K7)>COUNTIF(فاتورة!$C$7:$C$27,\"<>0\"),\"\",INDEX(فاتورة!$E$7:$E$27,SMALL(IF(فاتورة!$C$7:$C$27<>0,ROW($C$7:$C$27)-ROW($C$7)+1),ROWS($A$1:K7))))","v":0},{"$f":"IF(ROWS($A$1:L7)>COUNTIF(فاتورة!$C$7:$C$27,\"<>0\"),\"\",INDEX(فاتورة!$F$7:$F$27,SMALL(IF(فاتورة!$C$7:$C$27<>0,ROW($C$7:$C$27)-ROW($C$7)+1),ROWS($A$1:L7))))","v":0}]
[null,null,null,null,null,null,null,null,{"$f":"IF(ROWS($A$1:H8)>COUNTIF(فاتورة!$C$7:$C$27,\"<>0\"),\"\",INDEX(فاتورة!$B$7:$B$27,SMALL(IF(فاتورة!$C$7:$C$27<>0,ROW($C$7:$C$27)-ROW($C$7)+1),ROWS($A$1:H8))))","v":0},{"$f":"IF(ROWS($A$1:I8)>COUNTIF(فاتورة!$C$7:$C$27,\"<>0\"),\"\",INDEX(فاتورة!$C$7:$C$27,SMALL(IF(فاتورة!$C$7:$C$27<>0,ROW($C$7:$C$27)-ROW($C$7)+1),ROWS($A$1:I8))))","v":"لايوجد صنف "},{"$f":"IF(ROWS($A$1:J8)>COUNTIF(فاتورة!$C$7:$C$27,\"<>0\"),\"\",INDEX(فاتورة!$D$7:$D$27,SMALL(IF(فاتورة!$C$7:$C$27<>0,ROW($C$7:$C$27)-ROW($C$7)+1),ROWS($A$1:J8))))","v":"0.000"},{"$f":"IF(ROWS($A$1:K8)>COUNTIF(فاتورة!$C$7:$C$27,\"<>0\"),\"\",INDEX(فاتورة!$E$7:$E$27,SMALL(IF(فاتورة!$C$7:$C$27<>0,ROW($C$7:$C$27)-ROW($C$7)+1),ROWS($A$1:K8))))","v":0},{"$f":"IF(ROWS($A$1:L8)>COUNTIF(فاتورة!$C$7:$C$27,\"<>0\"),\"\",INDEX(فاتورة!$F$7:$F$27,SMALL(IF(فاتورة!$C$7:$C$27<>0,ROW($C$7:$C$27)-ROW($C$7)+1),ROWS($A$1:L8))))","v":0}]
[null,null,null,null,null,null,null,null,{"$f":"IF(ROWS($A$1:H9)>COUNTIF(فاتورة!$C$7:$C$27,\"<>0\"),\"\",INDEX(فاتورة!$B$7:$B$27,SMALL(IF(فاتورة!$C$7:$C$27<>0,ROW($C$7:$C$27)-ROW($C$7)+1),ROWS($A$1:H9))))","v":0},{"$f":"IF(ROWS($A$1:I9)>COUNTIF(فاتورة!$C$7:$C$27,\"<>0\"),\"\",INDEX(فاتورة!$C$7:$C$27,SMALL(IF(فاتورة!$C$7:$C$27<>0,ROW($C$7:$C$27)-ROW($C$7)+1),ROWS($A$1:I9))))","v":"لايوجد صنف "},{"$f":"IF(ROWS($A$1:J9)>COUNTIF(فاتورة!$C$7:$C$27,\"<>0\"),\"\",INDEX(فاتورة!$D$7:$D$27,SMALL(IF(فاتورة!$C$7:$C$27<>0,ROW($C$7:$C$27)-ROW($C$7)+1),ROWS($A$1:J9))))","v":"0.000"},{"$f":"IF(ROWS($A$1:K9)>COUNTIF(فاتورة!$C$7:$C$27,\"<>0\"),\"\",INDEX(فاتورة!$E$7:$E$27,SMALL(IF(فاتورة!$C$7:$C$27<>0,ROW($C$7:$C$27)-ROW($C$7)+1),ROWS($A$1:K9))))","v":0},{"$f":"IF(ROWS($A$1:L9)>COUNTIF(فاتورة!$C$7:$C$27,\"<>0\"),\"\",INDEX(فاتورة!$F$7:$F$27,SMALL(IF(فاتورة!$C$7:$C$27<>0,ROW($C$7:$C$27)-ROW($C$7)+1),ROWS($A$1:L9))))","v":0}]
[null,null,null,null,null,null,null,null,{"$f":"IF(ROWS($A$1:H10)>COUNTIF(فاتورة!$C$7:$C$27,\"<>0\"),\"\",INDEX(فاتورة!$B$7:$B$27,SMALL(IF(فاتورة!$C$7:$C$27<>0,ROW($C$7:$C$27)-ROW($C$7)+1),ROWS($A$1:H10))))","v":0},{"$f":"IF(ROWS($A$1:I10)>COUNTIF(فاتورة!$C$7:$C$27,\"<>0\"),\"\",INDEX(فاتورة!$C$7:$C$27,SMALL(IF(فاتورة!$C$7:$C$27<>0,ROW($C$7:$C$27)-ROW($C$7)+1),ROWS($A$1:I10))))","v":"لايوجد صنف "},{"$f":"IF(ROWS($A$1:J10)>COUNTIF(فاتورة!$C$7:$C$27,\"<>0\"),\"\",INDEX(فاتورة!$D$7:$D$27,SMALL(IF(فاتورة!$C$7:$C$27<>0,ROW($C$7:$C$27)-ROW($C$7)+1),ROWS($A$1:J10))))","v":"0.000"},{"$f":"IF(ROWS($A$1:K10)>COUNTIF(فاتورة!$C$7:$C$27,\"<>0\"),\"\",INDEX(فاتورة!$E$7:$E$27,SMALL(IF(فاتورة!$C$7:$C$27<>0,ROW($C$7:$C$27)-ROW($C$7)+1),ROWS($A$1:K10))))","v":0},{"$f":"IF(ROWS($A$1:L10)>COUNTIF(فاتورة!$C$7:$C$27,\"<>0\"),\"\",INDEX(فاتورة!$F$7:$F$27,SMALL(IF(فاتورة!$C$7:$C$27<>0,ROW($C$7:$C$27)-ROW($C$7)+1),ROWS($A$1:L10))))","v":0}]
[null,null,null,null,null,null,null,null,{"$f":"IF(ROWS($A$1:H11)>COUNTIF(فاتورة!$C$7:$C$27,\"<>0\"),\"\",INDEX(فاتورة!$B$7:$B$27,SMALL(IF(فاتورة!$C$7:$C$27<>0,ROW($C$7:$C$27)-ROW($C$7)+1),ROWS($A$1:H11))))","v":0},{"$f":"IF(ROWS($A$1:I11)>COUNTIF(فاتورة!$C$7:$C$27,\"<>0\"),\"\",INDEX(فاتورة!$C$7:$C$27,SMALL(IF(فاتورة!$C$7:$C$27<>0,ROW($C$7:$C$27)-ROW($C$7)+1),ROWS($A$1:I11))))","v":"لايوجد صنف "},{"$f":"IF(ROWS($A$1:J11)>COUNTIF(فاتورة!$C$7:$C$27,\"<>0\"),\"\",INDEX(فاتورة!$D$7:$D$27,SMALL(IF(فاتورة!$C$7:$C$27<>0,ROW($C$7:$C$27)-ROW($C$7)+1),ROWS($A$1:J11))))","v":"0.000"},{"$f":"IF(ROWS($A$1:K11)>COUNTIF(فاتورة!$C$7:$C$27,\"<>0\"),\"\",INDEX(فاتورة!$E$7:$E$27,SMALL(IF(فاتورة!$C$7:$C$27<>0,ROW($C$7:$C$27)-ROW($C$7)+1),ROWS($A$1:K11))))","v":0},{"$f":"IF(ROWS($A$1:L11)>COUNTIF(فاتورة!$C$7:$C$27,\"<>0\"),\"\",INDEX(فاتورة!$F$7:$F$27,SMALL(IF(فاتورة!$C$7:$C$27<>0,ROW($C$7:$C$27)-ROW($C$7)+1),ROWS($A$1:L11))))","v":0}]
[null,null,null,null,null,null,null,null,{"$f":"IF(ROWS($A$1:H12)>COUNTIF(فاتورة!$C$7:$C$27,\"<>0\"),\"\",INDEX(فاتورة!$B$7:$B$27,SMALL(IF(فاتورة!$C$7:$C$27<>0,ROW($C$7:$C$27)-ROW($C$7)+1),ROWS($A$1:H12))))","v":0},{"$f":"IF(ROWS($A$1:I12)>COUNTIF(فاتورة!$C$7:$C$27,\"<>0\"),\"\",INDEX(فاتورة!$C$7:$C$27,SMALL(IF(فاتورة!$C$7:$C$27<>0,ROW($C$7:$C$27)-ROW($C$7)+1),ROWS($A$1:I12))))","v":"لايوجد صنف "},{"$f":"IF(ROWS($A$1:J12)>COUNTIF(فاتورة!$C$7:$C$27,\"<>0\"),\"\",INDEX(فاتورة!$D$7:$D$27,SMALL(IF(فاتورة!$C$7:$C$27<>0,ROW($C$7:$C$27)-ROW($C$7)+1),ROWS($A$1:J12))))","v":"0.000"},{"$f":"IF(ROWS($A$1:K12)>COUNTIF(فاتورة!$C$7:$C$27,\"<>0\"),\"\",INDEX(فاتورة!$E$7:$E$27,SMALL(IF(فاتورة!$C$7:$C$27<>0,ROW($C$7:$C$27)-ROW($C$7)+1),ROWS($A$1:K12))))","v":0},{"$f":"IF(ROWS($A$1:L12)>COUNTIF(فاتورة!$C$7:$C$27,\"<>0\"),\"\",INDEX(فاتورة!$F$7:$F$27,SMALL(IF(فاتورة!$C$7:$C$27<>0,ROW($C$7:$C$27)-ROW($C$7)+1),ROWS($A$1:L12))))","v":0}]
[null,null,null,null,null,null,null,null,{"$f":"IF(ROWS($A$1:H13)>COUNTIF(فاتورة!$C$7:$C$27,\"<>0\"),\"\",INDEX(فاتورة!$B$7:$B$27,SMALL(IF(فاتورة!$C$7:$C$27<>0,ROW($C$7:$C$27)-ROW($C$7)+1),ROWS($A$1:H13))))","v":0},{"$f":"IF(ROWS($A$1:I13)>COUNTIF(فاتورة!$C$7:$C$27,\"<>0\"),\"\",INDEX(فاتورة!$C$7:$C$27,SMALL(IF(فاتورة!$C$7:$C$27<>0,ROW($C$7:$C$27)-ROW($C$7)+1),ROWS($A$1:I13))))","v":"لايوجد صنف "},{"$f":"IF(ROWS($A$1:J13)>COUNTIF(فاتورة!$C$7:$C$27,\"<>0\"),\"\",INDEX(فاتورة!$D$7:$D$27,SMALL(IF(فاتورة!$C$7:$C$27<>0,ROW($C$7:$C$27)-ROW($C$7)+1),ROWS($A$1:J13))))","v":"0.000"},{"$f":"IF(ROWS($A$1:K13)>COUNTIF(فاتورة!$C$7:$C$27,\"<>0\"),\"\",INDEX(فاتورة!$E$7:$E$27,SMALL(IF(فاتورة!$C$7:$C$27<>0,ROW($C$7:$C$27)-ROW($C$7)+1),ROWS($A$1:K13))))","v":0},{"$f":"IF(ROWS($A$1:L13)>COUNTIF(فاتورة!$C$7:$C$27,\"<>0\"),\"\",INDEX(فاتورة!$F$7:$F$27,SMALL(IF(فاتورة!$C$7:$C$27<>0,ROW($C$7:$C$27)-ROW($C$7)+1),ROWS($A$1:L13))))","v":0}]
[null,null,null,null,null,null,null,null,{"$f":"IF(ROWS($A$1:H14)>COUNTIF(فاتورة!$C$7:$C$27,\"<>0\"),\"\",INDEX(فاتورة!$B$7:$B$27,SMALL(IF(فاتورة!$C$7:$C$27<>0,ROW($C$7:$C$27)-ROW($C$7)+1),ROWS($A$1:H14))))","v":0},{"$f":"IF(ROWS($A$1:I14)>COUNTIF(فاتورة!$C$7:$C$27,\"<>0\"),\"\",INDEX(فاتورة!$C$7:$C$27,SMALL(IF(فاتورة!$C$7:$C$27<>0,ROW($C$7:$C$27)-ROW($C$7)+1),ROWS($A$1:I14))))","v":"لايوجد صنف "},{"$f":"IF(ROWS($A$1:J14)>COUNTIF(فاتورة!$C$7:$C$27,\"<>0\"),\"\",INDEX(فاتورة!$D$7:$D$27,SMALL(IF(فاتورة!$C$7:$C$27<>0,ROW($C$7:$C$27)-ROW($C$7)+1),ROWS($A$1:J14))))","v":"0.000"},{"$f":"IF(ROWS($A$1:K14)>COUNTIF(فاتورة!$C$7:$C$27,\"<>0\"),\"\",INDEX(فاتورة!$E$7:$E$27,SMALL(IF(فاتورة!$C$7:$C$27<>0,ROW($C$7:$C$27)-ROW($C$7)+1),ROWS($A$1:K14))))","v":0},{"$f":"IF(ROWS($A$1:L14)>COUNTIF(فاتورة!$C$7:$C$27,\"<>0\"),\"\",INDEX(فاتورة!$F$7:$F$27,SMALL(IF(فاتورة!$C$7:$C$27<>0,ROW($C$7:$C$27)-ROW($C$7)+1),ROWS($A$1:L14))))","v":0}]
[null,null,null,null,null,null,null,null,{"$f":"IF(ROWS($A$1:H15)>COUNTIF(فاتورة!$C$7:$C$27,\"<>0\"),\"\",INDEX(فاتورة!$B$7:$B$27,SMALL(IF(فاتورة!$C$7:$C$27<>0,ROW($C$7:$C$27)-ROW($C$7)+1),ROWS($A$1:H15))))","v":0},{"$f":"IF(ROWS($A$1:I15)>COUNTIF(فاتورة!$C$7:$C$27,\"<>0\"),\"\",INDEX(فاتورة!$C$7:$C$27,SMALL(IF(فاتورة!$C$7:$C$27<>0,ROW($C$7:$C$27)-ROW($C$7)+1),ROWS($A$1:I15))))","v":"لايوجد صنف "},{"$f":"IF(ROWS($A$1:J15)>COUNTIF(فاتورة!$C$7:$C$27,\"<>0\"),\"\",INDEX(فاتورة!$D$7:$D$27,SMALL(IF(فاتورة!$C$7:$C$27<>0,ROW($C$7:$C$27)-ROW($C$7)+1),ROWS($A$1:J15))))","v":"0.000"},{"$f":"IF(ROWS($A$1:K15)>COUNTIF(فاتورة!$C$7:$C$27,\"<>0\"),\"\",INDEX(فاتورة!$E$7:$E$27,SMALL(IF(فاتورة!$C$7:$C$27<>0,ROW($C$7:$C$27)-ROW($C$7)+1),ROWS($A$1:K15))))","v":0},{"$f":"IF(ROWS($A$1:L15)>COUNTIF(فاتورة!$C$7:$C$27,\"<>0\"),\"\",INDEX(فاتورة!$F$7:$F$27,SMALL(IF(فاتورة!$C$7:$C$27<>0,ROW($C$7:$C$27)-ROW($C$7)+1),ROWS($A$1:L15))))","v":0}]
[null,null,null,null,null,null,null,null,{"$f":"IF(ROWS($A$1:H16)>COUNTIF(فاتورة!$C$7:$C$27,\"<>0\"),\"\",INDEX(فاتورة!$B$7:$B$27,SMALL(IF(فاتورة!$C$7:$C$27<>0,ROW($C$7:$C$27)-ROW($C$7)+1),ROWS($A$1:H16))))","v":0},{"$f":"IF(ROWS($A$1:I16)>COUNTIF(فاتورة!$C$7:$C$27,\"<>0\"),\"\",INDEX(فاتورة!$C$7:$C$27,SMALL(IF(فاتورة!$C$7:$C$27<>0,ROW($C$7:$C$27)-ROW($C$7)+1),ROWS($A$1:I16))))","v":"لايوجد صنف "},{"$f":"IF(ROWS($A$1:J16)>COUNTIF(فاتورة!$C$7:$C$27,\"<>0\"),\"\",INDEX(فاتورة!$D$7:$D$27,SMALL(IF(فاتورة!$C$7:$C$27<>0,ROW($C$7:$C$27)-ROW($C$7)+1),ROWS($A$1:J16))))","v":"0.000"},{"$f":"IF(ROWS($A$1:K16)>COUNTIF(فاتورة!$C$7:$C$27,\"<>0\"),\"\",INDEX(فاتورة!$E$7:$E$27,SMALL(IF(فاتورة!$C$7:$C$27<>0,ROW($C$7:$C$27)-ROW($C$7)+1),ROWS($A$1:K16))))","v":0},{"$f":"IF(ROWS($A$1:L16)>COUNTIF(فاتورة!$C$7:$C$27,\"<>0\"),\"\",INDEX(فاتورة!$F$7:$F$27,SMALL(IF(فاتورة!$C$7:$C$27<>0,ROW($C$7:$C$27)-ROW($C$7)+1),ROWS($A$1:L16))))","v":0}]
[null,null,null,null,null,null,null,null,{"$f":"IF(ROWS($A$1:H17)>COUNTIF(فاتورة!$C$7:$C$27,\"<>0\"),\"\",INDEX(فاتورة!$B$7:$B$27,SMALL(IF(فاتورة!$C$7:$C$27<>0,ROW($C$7:$C$27)-ROW($C$7)+1),ROWS($A$1:H17))))","v":0},{"$f":"IF(ROWS($A$1:I17)>COUNTIF(فاتورة!$C$7:$C$27,\"<>0\"),\"\",INDEX(فاتورة!$C$7:$C$27,SMALL(IF(فاتورة!$C$7:$C$27<>0,ROW($C$7:$C$27)-ROW($C$7)+1),ROWS($A$1:I17))))","v":"لايوجد صنف "},{"$f":"IF(ROWS($A$1:J17)>COUNTIF(فاتورة!$C$7:$C$27,\"<>0\"),\"\",INDEX(فاتورة!$D$7:$D$27,SMALL(IF(فاتورة!$C$7:$C$27<>0,ROW($C$7:$C$27)-ROW($C$7)+1),ROWS($A$1:J17))))","v":"0.000"},{"$f":"IF(ROWS($A$1:K17)>COUNTIF(فاتورة!$C$7:$C$27,\"<>0\"),\"\",INDEX(فاتورة!$E$7:$E$27,SMALL(IF(فاتورة!$C$7:$C$27<>0,ROW($C$7:$C$27)-ROW($C$7)+1),ROWS($A$1:K17))))","v":0},{"$f":"IF(ROWS($A$1:L17)>COUNTIF(فاتورة!$C$7:$C$27,\"<>0\"),\"\",INDEX(فاتورة!$F$7:$F$27,SMALL(IF(فاتورة!$C$7:$C$27<>0,ROW($C$7:$C$27)-ROW($C$7)+1),ROWS($A$1:L17))))","v":0}]
[null,null,null,null,null,null,null,null,{"$f":"IF(ROWS($A$1:H18)>COUNTIF(فاتورة!$C$7:$C$27,\"<>0\"),\"\",INDEX(فاتورة!$B$7:$B$27,SMALL(IF(فاتورة!$C$7:$C$27<>0,ROW($C$7:$C$27)-ROW($C$7)+1),ROWS($A$1:H18))))","v":0},{"$f":"IF(ROWS($A$1:I18)>COUNTIF(فاتورة!$C$7:$C$27,\"<>0\"),\"\",INDEX(فاتورة!$C$7:$C$27,SMALL(IF(فاتورة!$C$7:$C$27<>0,ROW($C$7:$C$27)-ROW($C$7)+1),ROWS($A$1:I18))))","v":"لايوجد صنف "},{"$f":"IF(ROWS($A$1:J18)>COUNTIF(فاتورة!$C$7:$C$27,\"<>0\"),\"\",INDEX(فاتورة!$D$7:$D$27,SMALL(IF(فاتورة!$C$7:$C$27<>0,ROW($C$7:$C$27)-ROW($C$7)+1),ROWS($A$1:J18))))","v":"0.000"},{"$f":"IF(ROWS($A$1:K18)>COUNTIF(فاتورة!$C$7:$C$27,\"<>0\"),\"\",INDEX(فاتورة!$E$7:$E$27,SMALL(IF(فاتورة!$C$7:$C$27<>0,ROW($C$7:$C$27)-ROW($C$7)+1),ROWS($A$1:K18))))","v":0},{"$f":"IF(ROWS($A$1:L18)>COUNTIF(فاتورة!$C$7:$C$27,\"<>0\"),\"\",INDEX(فاتورة!$F$7:$F$27,SMALL(IF(فاتورة!$C$7:$C$27<>0,ROW($C$7:$C$27)-ROW($C$7)+1),ROWS($A$1:L18))))","v":0}]
{"$rows_left_out":77}