{"text_format":"1","workbook":"xlsx","n_sheets":2,"sheets":["اقساط","دمج"],"not_rendered":{"charts":0,"images":1,"macros":0,"external_links":0,"defined_names":1,"comments":0,"pivot_tables":0},"unopened":[],"bounds":{"document_bytes":16777216,"sheet_cells":100000,"rows_first":2000,"rows_last":500,"rows_between":2000,"halvings":0,"cell_chars":16384,"cell_head_chars":4096},"cells_cut":0,"cells_raw":0,"read":"whole","date_system":"1900"}

{"sheet":"اقساط","index":0,"n_rows":121,"n_cols":47,"rows_kept":121,"cut":false,"hidden":false,"merged":[]}
[]
["رمز المادة","اسم المادة","سعر المادة","العدد","المبلغ","تاريخ الشراء","اسم العميل","مجموع المشتريات","المبلغ المتبقي بذمة العميل","الدفعة الأولى","تاريخه","الدفعة الثانية","تاريخه","الدفعة الثالثة","تاريخه","الدفعة الرابعة","تاريخه","الدفعة الخامسة","تاريخه","الدفعة السادسة","تاريخه","الدفعة السابعة","تاريخه","الدفعة الثامنة","تاريخه","الدفعة التاسعة","تاريخه","الدفعة العاشرة","تاريخه","الدفعة احد عشر","تاريخه","الدفعة الأخيرة","تاريخه","عنوان الكفيل","اسم الكفيل","الدائرة","رقم الموبايل","الملاحظات","رقم الموبايل","عنوان العميل","الدائرة","الملاحظات","الحالة","مجموع المبالغ المستلمة","المبلغ المتبقي","رقم الفاتورة","ت"]
[181,"شاشة عرض دنكا 55",850000,1,850000,"2017-09-24","أبو ايمن دائره مجاري",1225000,1225000,null,{"$f":"F3","v":"2017-09-24"},null,{"$f":"K3+30","v":"2017-10-24"},null,{"$f":"M3+30","v":"2017-11-23"},null,{"$f":"O3+30","v":"2017-12-23"},null,{"$f":"Q3+30","v":"2018-01-22"},null,{"$f":"S3+30","v":"2018-02-21"},null,{"$f":"U3+30","v":"2018-03-23"},null,{"$f":"W3+30","v":"2018-04-22"},null,{"$f":"Y3+30","v":"2018-05-22"},null,{"$f":"AA3+30","v":"2018-06-21"},null,{"$f":"AC3+30","v":"2018-07-21"},null,{"$f":"AE3+30","v":"2018-08-20"},null,null,null,null,null,null,null,null,null,null,{"$f":"SUM(J3+L3+N3+P3+R3+T3+V3+X3+Z3+AB3+AD3+AF3)","v":0},{"$f":"H3-AR3","v":1225000},1,1]
[22,"مجمدة ميديا 12 قدم",325000,1,325000,"2017-09-24","أبو ايمن دائره مجاري",null,null,null,{"$f":"F4","v":"2017-09-24"},null,{"$f":"K4+30","v":"2017-10-24"},null,{"$f":"M4+30","v":"2017-11-23"},null,{"$f":"O4+30","v":"2017-12-23"},null,{"$f":"Q4+30","v":"2018-01-22"},null,{"$f":"S4+30","v":"2018-02-21"},null,{"$f":"U4+30","v":"2018-03-23"},null,{"$f":"W4+30","v":"2018-04-22"},null,{"$f":"Y4+30","v":"2018-05-22"},null,{"$f":"AA4+30","v":"2018-06-21"},null,{"$f":"AC4+30","v":"2018-07-21"},null,{"$f":"AE4+30","v":"2018-08-20"},null,null,null,null,null,null,null,null,null,null,{"$f":"SUM(J4+L4+N4+P4+R4+T4+V4+X4+Z4+AB4+AD4+AF4)","v":0},{"$f":"H4-AR4","v":0},1,2]
[107,"ستلايت سترونك 7777 عدسه كامه",25000,1,25000,"2017-09-24","أبو ايمن دائره مجاري",null,null,null,"2017-09-24",null,"2017-10-24",null,"2017-11-23",null,"2017-12-23",null,"2018-01-22",null,"2018-02-21",null,"2018-03-23",null,"2018-04-22",null,"2018-05-22",null,"2018-06-21",null,"2018-07-21",null,"2018-08-20",null,null,null,null,null,null,null,null,null,null,0,0,1,3]
[165,"حمالة شاشة 6047 ذراع",25000,1,25000,"2017-09-24","أبو ايمن دائره مجاري",null,null,null,"2017-09-24",null,"2017-10-24",null,"2017-11-23",null,"2017-12-23",null,"2018-01-22",null,"2018-02-21",null,"2018-03-23",null,"2018-04-22",null,"2018-05-22",null,"2018-06-21",null,"2018-07-21",null,"2018-08-20",null,null,null,null,null,null,null,null,null,null,0,0,1,4]
[279,"مكيف LG",400000,1,400000,"2017-09-27","أبو ايمن دائره مجاري",400000,175000,125000,"2017-09-27",100000,"2017-10-27",175000,"2017-11-26",null,"2017-12-26",null,"2018-01-25",null,"2018-02-24",null,"2018-03-26",null,"2018-04-25",null,"2018-05-25",null,"2018-06-24",null,"2018-07-24",null,"2018-08-23",null,null,null,null,null,null,null,null,null,null,400000,0,2,5]
[214,"عارضة سما عامودي 350",540000,1,540000,"2017-08-08","أبو رداد",5405000,3865000,500000,"2017-08-08",1040000,"2017-09-07",1500000,"2017-10-07",2000000,"2017-11-06",365000,"2017-12-06",null,"2018-01-05",null,"2018-02-04",null,"2018-03-06",null,"2018-04-05",null,"2018-05-05",null,"2018-06-04",null,"2018-07-04",null,null,null,null,null,null,null,null,null,null,5405000,0,3,6]
[177,"عارضة سنفير 22 قدم",625000,2,1250000,"2017-08-08","أبو رداد",null,null,null,"2017-08-08",null,"2017-09-07",null,"2017-10-07",null,"2017-11-06",null,"2017-12-06",null,"2018-01-05",null,"2018-02-04",null,"2018-03-06",null,"2018-04-05",null,"2018-05-05",null,"2018-06-04",null,"2018-07-04",null,null,null,null,null,null,null,null,null,null,0,0,3,7]
[211,"عارضة سما افقي 335",450000,1,450000,"2017-08-08","أبو رداد",null,null,null,"2017-08-08",null,"2017-09-07",null,"2017-10-07",null,"2017-11-06",null,"2017-12-06",null,"2018-01-05",null,"2018-02-04",null,"2018-03-06",null,"2018-04-05",null,"2018-05-05",null,"2018-06-04",null,"2018-07-04",null,null,null,null,null,null,null,null,null,null,0,0,3,8]
[212,"عارضة سما افقي 456",600000,1,600000,"2017-08-08","أبو رداد",null,null,null,"2017-08-08",null,"2017-09-07",null,"2017-10-07",null,"2017-11-06",null,"2017-12-06",null,"2018-01-05",null,"2018-02-04",null,"2018-03-06",null,"2018-04-05",null,"2018-05-05",null,"2018-06-04",null,"2018-07-04",null,null,null,null,null,null,null,null,null,null,0,0,3,9]
[150,"سبلت يورك 2 طن",825000,1,825000,"2017-08-08","أبو رداد",null,null,null,"2017-08-08",null,"2017-09-07",null,"2017-10-07",null,"2017-11-06",null,"2017-12-06",null,"2018-01-05",null,"2018-02-04",null,"2018-03-06",null,"2018-04-05",null,"2018-05-05",null,"2018-06-04",null,"2018-07-04",null,null,null,null,null,null,null,null,null,null,0,0,3,10]
[41,"سبلت اوكس 3 طن كنتوري",1325000,1,1325000,"2017-08-08","أبو رداد",null,null,null,"2017-08-08",null,"2017-09-07",null,"2017-10-07",null,"2017-11-06",null,"2017-12-06",null,"2018-01-05",null,"2018-02-04",null,"2018-03-06",null,"2018-04-05",null,"2018-05-05",null,"2018-06-04",null,"2018-07-04",null,null,null,null,null,null,null,null,null,null,0,0,3,11]
[146,"مبردة سوبر امبريال KT -1E-3S",415000,1,415000,"2017-08-08","أبو رداد",null,null,null,"2017-08-08",null,"2017-09-07",null,"2017-10-07",null,"2017-11-06",null,"2017-12-06",null,"2018-01-05",null,"2018-02-04",null,"2018-03-06",null,"2018-04-05",null,"2018-05-05",null,"2018-06-04",null,"2018-07-04",null,null,null,null,null,null,null,null,null,null,0,0,3,12]
[151,"سبلت يورك 3 طن كنتوري",1200000,1,1200000,"2017-08-15","أبو لؤي 2",1680000,680000,1000000,"2017-08-15",680000,"2017-09-14",null,"2017-10-14",null,"2017-11-13",null,"2017-12-13",null,"2018-01-12",null,"2018-02-11",null,"2018-03-13",null,"2018-04-12",null,"2018-05-12",null,"2018-06-11",null,"2018-07-11",null,null,null,null,null,null,null,null,null,null,1680000,0,7,16]
[251,"ثلاجة كين وود 22",480000,1,480000,"2017-08-15","أبو لؤي 2",null,null,null,"2017-08-15",null,"2017-09-14",null,"2017-10-14",null,"2017-11-13",null,"2017-12-13",null,"2018-01-12",null,"2018-02-11",null,"2018-03-13",null,"2018-04-12",null,"2018-05-12",null,"2018-06-11",null,"2018-07-11",null,null,null,null,null,null,null,null,null,null,0,0,7,17]
[327,"شاشة عرض همر 49 سمارت",500000,1,500000,"2017-10-13","أبو ماريا البيت",1025000,525000,500000,"2017-10-13",null,"2017-11-12",null,"2017-12-12",null,"2018-01-11",null,"2018-02-10",null,"2018-03-12",null,"2018-04-11",null,"2018-05-11",null,"2018-06-10",null,"2018-07-10",null,"2018-08-09",null,"2018-09-08",null,null,null,null,null,null,null,null,null,null,500000,525000,8,18]
[1,"ثلاجة توسوت 530WDR فريز ابيض",525000,1,525000,"2017-10-13","أبو ماريا البيت",null,null,null,"2017-10-13",null,"2017-11-12",null,"2017-12-12",null,"2018-01-11",null,"2018-02-10",null,"2018-03-12",null,"2018-04-11",null,"2018-05-11",null,"2018-06-10",null,"2018-07-10",null,"2018-08-09",null,"2018-09-08",null,null,null,null,null,null,null,null,null,null,0,0,8,19]
[37,"غسالة سامسونك 15 كيلو فول 5730",450000,1,450000,"2017-05-28","أستاذ محمد رشيد ",2010000,2010000,null,"2017-05-28",null,"2017-06-27",null,"2017-07-27",null,"2017-08-26",null,"2017-09-25",null,"2017-10-25",null,"2017-11-24",null,"2017-12-24",null,"2018-01-23",null,"2018-02-22",null,"2018-03-24",null,"2018-04-23",null,null,null,null,null,null,null,null,null,null,0,2010000,11,22]
[97,"سبلت توسوت 1.5 طن",460000,1,460000,"2017-05-28","أستاذ محمد رشيد ",null,null,null,"2017-05-28",null,"2017-06-27",null,"2017-07-27",null,"2017-08-26",null,"2017-09-25",null,"2017-10-25",null,"2017-11-24",null,"2017-12-24",null,"2018-01-23",null,"2018-02-22",null,"2018-03-24",null,"2018-04-23",null,null,null,null,null,null,null,null,null,null,0,0,11,23]
[154,"سبلت توسوت 2طن وثلث كنتوري",1100000,1,1100000,"2017-05-28","أستاذ محمد رشيد ",null,null,null,"2017-05-28",null,"2017-06-27",null,"2017-07-27",null,"2017-08-26",null,"2017-09-25",null,"2017-10-25",null,"2017-11-24",null,"2017-12-24",null,"2018-01-23",null,"2018-02-22",null,"2018-03-24",null,"2018-04-23",null,null,null,null,null,null,null,null,null,null,0,0,11,24]
[12,"ثلاجة ميديا 5 قدم",150000,1,150000,"2017-05-04","أستاذ ياسين الدبي",1978500,163500,280000,"2017-05-04",440000,"2017-06-03",280000,"2017-07-03",325000,"2017-08-02",325000,"2017-09-01",325000,"2017-10-01",null,"2017-10-31",null,"2017-11-30",null,"2017-12-30",null,"2018-01-29",null,"2018-02-28",null,"2018-03-30",null,null,null,null,null,null,null,null,null,null,1975000,3500,12,25]
[68,"براد نوال 048 احمر",150000,1,150000,"2017-05-04","أستاذ ياسين الدبي",null,null,null,"2017-05-04",null,"2017-06-03",null,"2017-07-03",null,"2017-08-02",null,"2017-09-01",null,"2017-10-01",null,"2017-10-31",null,"2017-11-30",null,"2017-12-30",null,"2018-01-29",null,"2018-02-28",null,"2018-03-30",null,null,null,null,null,null,null,null,null,null,0,0,12,26]
[39,"سبلت اوكس 1 طن",459500,3,1378500,"2017-05-04","أستاذ ياسين الدبي",null,null,null,"2017-05-04",null,"2017-06-03",null,"2017-07-03",null,"2017-08-02",null,"2017-09-01",null,"2017-10-01",null,"2017-10-31",null,"2017-11-30",null,"2017-12-30",null,"2018-01-29",null,"2018-02-28",null,"2018-03-30",null,null,null,null,null,null,null,null,null,null,0,0,12,27]
[63,"براد ماء توسوت",150000,2,300000,"2017-06-24","أستاذ ياسين الدبي",null,null,null,"2017-06-24",null,"2017-07-24",null,"2017-08-23",null,"2017-09-22",null,"2017-10-22",null,"2017-11-21",null,"2017-12-21",null,"2018-01-20",null,"2018-02-19",null,"2018-03-21",null,"2018-04-20",null,"2018-05-20",null,null,null,null,null,null,null,null,null,null,0,0,12,28]
[265,"شاشة عرض 32YES TV",190000,1,190000,"2017-07-28","أنور صلاح ",350000,200000,100000,"2017-07-28",50000,"2017-08-27",50000,"2017-09-26",100000,"2017-10-26",50000,"2017-11-25",null,"2017-12-25",null,"2018-01-24",null,"2018-02-23",null,"2018-03-25",null,"2018-04-24",null,"2018-05-24",null,"2018-06-23",null,null,null,null,null,null,null,null,null,null,350000,0,13,29]
[171,"غسالة ميديا 12 كيلو",160000,1,160000,"2017-07-28","أنور صلاح ",null,null,null,"2017-07-28",null,"2017-08-27",null,"2017-09-26",null,"2017-10-26",null,"2017-11-25",null,"2017-12-25",null,"2018-01-24",null,"2018-02-23",null,"2018-03-25",null,"2018-04-24",null,"2018-05-24",null,"2018-06-23",null,null,null,null,null,null,null,null,null,null,0,0,13,30]
[180,"مجمدة ميديا 14 قدم 377",365000,1,365000,"2017-05-17","إبراهيم الحرج",365000,250000,65000,"2017-05-17",50000,"2017-06-16",null,"2017-07-16",null,"2017-08-15",null,"2017-09-14",null,"2017-10-14",null,"2017-11-13",null,"2017-12-13",null,"2018-01-12",null,"2018-02-11",null,"2018-03-13",null,"2018-04-12",null,null,null,null,null,null,null,null,null,null,115000,250000,14,31]
[150,"سبلت يورك 2 طن",755000,1,755000,"2017-05-11","إبراهيم الحرج",755000,30000,125000,"2017-05-11",100000,"2017-06-10",150000,"2017-07-10",125000,"2017-08-09",125000,"2017-09-08",100000,"2017-10-08",null,"2017-11-07",null,"2017-12-07",null,"2018-01-06",null,"2018-02-05",null,"2018-03-07",null,"2018-04-06",null,null,null,null,null,null,null,null,null,null,725000,30000,15,32]
[300,"شاشة عرض شينون 55 4K مقوس",840000,1,840000,"2017-10-01","إبراهيم الخفاجي",939000,924000,115000,"2017-10-01",100000,"2017-10-31",100000,"2017-11-30",100000,"2017-12-30",100000,"2018-01-29",100000,"2018-02-28",100000,"2018-03-30",100000,"2018-04-29",null,"2018-05-29",null,"2018-06-28",null,"2018-07-28",null,"2018-08-27",null,null,null,null,null,null,null,null,null,null,815000,124000,16,33]
[65,"براد ماء نوبل منضدي",84000,1,84000,"2017-10-01","إبراهيم الخفاجي",null,null,null,"2017-10-01",null,"2017-10-31",null,"2017-11-30",null,"2017-12-30",null,"2018-01-29",null,"2018-02-28",null,"2018-03-30",null,"2018-04-29",null,"2018-05-29",null,"2018-06-28",null,"2018-07-28",null,"2018-08-27",null,null,null,null,null,null,null,null,null,null,0,0,16,34]
[164,"حمالة شاشة 4575 ذراع كبيرة",15000,1,15000,"2017-10-01","إبراهيم الخفاجي",null,null,null,"2017-10-01",null,"2017-10-31",null,"2017-11-30",null,"2017-12-30",null,"2018-01-29",null,"2018-02-28",null,"2018-03-30",null,"2018-04-29",null,"2018-05-29",null,"2018-06-28",null,"2018-07-28",null,"2018-08-27",null,null,null,null,null,null,null,null,null,null,0,0,16,35]
[251,"ثلاجة كين وود 22",625000,1,625000,"2017-05-22","إبراهيم السمره ",625000,425000,100000,"2017-05-22",100000,"2017-06-21",100000,"2017-07-21",100000,"2017-08-20",225000,"2017-09-19",null,"2017-10-19",null,"2017-11-18",null,"2017-12-18",null,"2018-01-17",null,"2018-02-16",null,"2018-03-18",null,"2018-04-17",null,null,null,null,null,null,null,null,null,null,625000,0,17,36]
[191,"ثلاجة دنكا 219",330000,1,330000,"2017-07-22","إبراهيم السمره",330000,180000,50000,"2017-07-22",50000,"2017-08-21",50000,"2017-09-20",50000,"2017-10-20",50000,"2017-11-19",80000,"2017-12-19",null,"2018-01-18",null,"2018-02-17",null,"2018-03-19",null,"2018-04-18",null,"2018-05-18",null,"2018-06-17",null,null,null,null,null,null,null,null,null,null,330000,0,18,37]
[284,"غسالة هيتاشي 16 كيلو حوضين",130000,1,130000,"2017-05-22","إبراهيم السمره ",130000,130000,130000,"2017-05-22",null,"2017-06-21",null,"2017-07-21",null,"2017-08-20",null,"2017-09-19",null,"2017-10-19",null,"2017-11-18",null,"2017-12-18",null,"2018-01-17",null,"2018-02-16",null,"2018-03-18",null,"2018-04-17",null,null,null,null,null,null,null,null,null,null,130000,0,19,38]
[104,"ستلايت سترونك 4400 عدسه كامه",25000,1,25000,"2017-06-11","احمد سمير حنيفيش",2695000,1425000,420000,"2017-06-11",450000,"2017-07-11",400000,"2017-08-10",500000,"2017-09-09",450000,"2017-10-09",250000,"2017-11-08",null,"2017-12-08",null,"2018-01-07",null,"2018-02-06",null,"2018-03-08",null,"2018-04-07",null,"2018-05-07",null,null,null,7806745878,null,null,"فوج القاسم",null,null,null,2470000,225000,28,47]
[116,"خلاط نوال 3020",25000,1,25000,"2017-06-11","احمد سمير حنيفيش",null,null,null,"2017-06-11",null,"2017-07-11",null,"2017-08-10",null,"2017-09-09",null,"2017-10-09",null,"2017-11-08",null,"2017-12-08",null,"2018-01-07",null,"2018-02-06",null,"2018-03-08",null,"2018-04-07",null,"2018-05-07",null,null,null,null,null,null,null,null,null,null,0,0,28,48]
[75,"شاشة عرض بنسونك 49",660000,1,660000,"2017-06-11","احمد سمير حنيفيش",null,null,null,"2017-06-11",null,"2017-07-11",null,"2017-08-10",null,"2017-09-09",null,"2017-10-09",null,"2017-11-08",null,"2017-12-08",null,"2018-01-07",null,"2018-02-06",null,"2018-03-08",null,"2018-04-07",null,"2018-05-07",null,null,null,null,null,null,null,null,null,null,0,0,28,49]
[150,"سبلت يورك 2 طن",755000,1,755000,"2017-06-11","احمد سمير حنيفيش",null,null,null,"2017-06-11",null,"2017-07-11",null,"2017-08-10",null,"2017-09-09",null,"2017-10-09",null,"2017-11-08",null,"2017-12-08",null,"2018-01-07",null,"2018-02-06",null,"2018-03-08",null,"2018-04-07",null,"2018-05-07",null,null,null,null,null,null,null,null,null,null,0,0,28,50]
[152,"سبلت شونك 1.5 طن",570000,1,570000,"2017-06-11","احمد سمير حنيفيش",null,null,null,"2017-06-11",null,"2017-07-11",null,"2017-08-10",null,"2017-09-09",null,"2017-10-09",null,"2017-11-08",null,"2017-12-08",null,"2018-01-07",null,"2018-02-06",null,"2018-03-08",null,"2018-04-07",null,"2018-05-07",null,null,null,null,null,null,null,null,null,null,0,0,28,51]
{"$rows_left_out":82}
{"sheet":"دمج","index":1,"n_rows":7,"n_cols":12,"rows_kept":7,"cut":false,"hidden":false,"merged":[]}
["رقم الفاتورة","تاريخ الشراء","اسم العميل","المواد المشتراة","السعر","العدد","المبلغ","مجموع المشتريات","مجموع المبالغ المدفوع","المبلغ المتبقي",null,"الفواتير المختارة"]
[1,{"$f":"IFERROR(INDEX(اقساط!$F$3:$F$150,SMALL(IF(اقساط!$AT$3:$AT$150=$A$2,ROW($AT$3:$AT$150)-ROW($AT$3)+1),ROWS($B$2:B2))),\"\")","v":"2017-09-24"},{"$f":"IFERROR(INDEX(اقساط!$G$3:$G$150,SMALL(IF(اقساط!$AT$3:$AT$150=$A$2,ROW($AT$3:$AT$150)-ROW($AT$3)+1),ROWS($B$2:C2))),\"\")","v":"أبو ايمن دائره مجاري"},{"$f":"IFERROR(INDEX(اقساط!$B$3:$B$150,SMALL(IF(اقساط!$AT$3:$AT$150=$A$2,ROW($AT$3:$AT$150)-ROW($AT$3)+1),ROWS($B$2:D2))),\"\")","v":"شاشة عرض دنكا 55"},{"$f":"IFERROR(INDEX(اقساط!$C$3:$C$150,SMALL(IF(اقساط!$AT$3:$AT$150=$A$2,ROW($AT$3:$AT$150)-ROW($AT$3)+1),ROWS($B$2:E2))),\"\")","v":850000},{"$f":"IFERROR(INDEX(اقساط!$D$3:$D$150,SMALL(IF(اقساط!$AT$3:$AT$150=$A$2,ROW($AT$3:$AT$150)-ROW($AT$3)+1),ROWS($B$2:F2))),\"\")","v":1},{"$f":"IFERROR(INDEX(اقساط!$E$3:$E$150,SMALL(IF(اقساط!$AT$3:$AT$150=$A$2,ROW($AT$3:$AT$150)-ROW($AT$3)+1),ROWS($B$2:G2))),\"\")","v":850000},{"$f":"IFERROR(INDEX(اقساط!$H$3:$H$150,SMALL(IF(اقساط!$AT$3:$AT$150=$A$2,ROW($AT$3:$AT$150)-ROW($AT$3)+1),ROWS($B$2:H2))),\"\")","v":1225000},{"$f":"IFERROR(INDEX(اقساط!$AR$3:$AR$150,SMALL(IF(اقساط!$AT$3:$AT$150=$A$2,ROW($AT$3:$AT$150)-ROW($AT$3)+1),ROWS($B$2:I2))),\"\")","v":0},{"$f":"IFERROR(INDEX(اقساط!$AS$3:$AS$150,SMALL(IF(اقساط!$AT$3:$AT$150=$A$2,ROW($AT$3:$AT$150)-ROW($AT$3)+1),ROWS($B$2:J2))),\"\")","v":1225000},null,1]
[null,{"$f":"IFERROR(INDEX(اقساط!$F$3:$F$150,SMALL(IF(اقساط!$AT$3:$AT$150=$A$2,ROW($AT$3:$AT$150)-ROW($AT$3)+1),ROWS($B$2:B3))),\"\")","v":"2017-09-24"},{"$f":"IFERROR(INDEX(اقساط!$G$3:$G$150,SMALL(IF(اقساط!$AT$3:$AT$150=$A$2,ROW($AT$3:$AT$150)-ROW($AT$3)+1),ROWS($B$2:C3))),\"\")","v":"أبو ايمن دائره مجاري"},{"$f":"IFERROR(INDEX(اقساط!$B$3:$B$150,SMALL(IF(اقساط!$AT$3:$AT$150=$A$2,ROW($AT$3:$AT$150)-ROW($AT$3)+1),ROWS($B$2:D3))),\"\")","v":"مجمدة ميديا 12 قدم"},{"$f":"IFERROR(INDEX(اقساط!$C$3:$C$150,SMALL(IF(اقساط!$AT$3:$AT$150=$A$2,ROW($AT$3:$AT$150)-ROW($AT$3)+1),ROWS($B$2:E3))),\"\")","v":325000},{"$f":"IFERROR(INDEX(اقساط!$D$3:$D$150,SMALL(IF(اقساط!$AT$3:$AT$150=$A$2,ROW($AT$3:$AT$150)-ROW($AT$3)+1),ROWS($B$2:F3))),\"\")","v":1},{"$f":"IFERROR(INDEX(اقساط!$E$3:$E$150,SMALL(IF(اقساط!$AT$3:$AT$150=$A$2,ROW($AT$3:$AT$150)-ROW($AT$3)+1),ROWS($B$2:G3))),\"\")","v":325000},{"$f":"IFERROR(INDEX(اقساط!$H$3:$H$150,SMALL(IF(اقساط!$AT$3:$AT$150=$A$2,ROW($AT$3:$AT$150)-ROW($AT$3)+1),ROWS($B$2:H3))),\"\")","v":0},{"$f":"IFERROR(INDEX(اقساط!$AR$3:$AR$150,SMALL(IF(اقساط!$AT$3:$AT$150=$A$2,ROW($AT$3:$AT$150)-ROW($AT$3)+1),ROWS($B$2:I3))),\"\")","v":0},{"$f":"IFERROR(INDEX(اقساط!$AS$3:$AS$150,SMALL(IF(اقساط!$AT$3:$AT$150=$A$2,ROW($AT$3:$AT$150)-ROW($AT$3)+1),ROWS($B$2:J3))),\"\")","v":0},null,2]
[null,{"$f":"IFERROR(INDEX(اقساط!$F$3:$F$150,SMALL(IF(اقساط!$AT$3:$AT$150=$A$2,ROW($AT$3:$AT$150)-ROW($AT$3)+1),ROWS($B$2:B4))),\"\")","v":"2017-09-24"},{"$f":"IFERROR(INDEX(اقساط!$G$3:$G$150,SMALL(IF(اقساط!$AT$3:$AT$150=$A$2,ROW($AT$3:$AT$150)-ROW($AT$3)+1),ROWS($B$2:C4))),\"\")","v":"أبو ايمن دائره مجاري"},{"$f":"IFERROR(INDEX(اقساط!$B$3:$B$150,SMALL(IF(اقساط!$AT$3:$AT$150=$A$2,ROW($AT$3:$AT$150)-ROW($AT$3)+1),ROWS($B$2:D4))),\"\")","v":"ستلايت سترونك 7777 عدسه كامه"},{"$f":"IFERROR(INDEX(اقساط!$C$3:$C$150,SMALL(IF(اقساط!$AT$3:$AT$150=$A$2,ROW($AT$3:$AT$150)-ROW($AT$3)+1),ROWS($B$2:E4))),\"\")","v":25000},{"$f":"IFERROR(INDEX(اقساط!$D$3:$D$150,SMALL(IF(اقساط!$AT$3:$AT$150=$A$2,ROW($AT$3:$AT$150)-ROW($AT$3)+1),ROWS($B$2:F4))),\"\")","v":1},{"$f":"IFERROR(INDEX(اقساط!$E$3:$E$150,SMALL(IF(اقساط!$AT$3:$AT$150=$A$2,ROW($AT$3:$AT$150)-ROW($AT$3)+1),ROWS($B$2:G4))),\"\")","v":25000},{"$f":"IFERROR(INDEX(اقساط!$H$3:$H$150,SMALL(IF(اقساط!$AT$3:$AT$150=$A$2,ROW($AT$3:$AT$150)-ROW($AT$3)+1),ROWS($B$2:H4))),\"\")","v":0},{"$f":"IFERROR(INDEX(اقساط!$AR$3:$AR$150,SMALL(IF(اقساط!$AT$3:$AT$150=$A$2,ROW($AT$3:$AT$150)-ROW($AT$3)+1),ROWS($B$2:I4))),\"\")","v":0},{"$f":"IFERROR(INDEX(اقساط!$AS$3:$AS$150,SMALL(IF(اقساط!$AT$3:$AT$150=$A$2,ROW($AT$3:$AT$150)-ROW($AT$3)+1),ROWS($B$2:J4))),\"\")","v":0}]
[null,{"$f":"IFERROR(INDEX(اقساط!$F$3:$F$150,SMALL(IF(اقساط!$AT$3:$AT$150=$A$2,ROW($AT$3:$AT$150)-ROW($AT$3)+1),ROWS($B$2:B5))),\"\")","v":"2017-09-24"},{"$f":"IFERROR(INDEX(اقساط!$G$3:$G$150,SMALL(IF(اقساط!$AT$3:$AT$150=$A$2,ROW($AT$3:$AT$150)-ROW($AT$3)+1),ROWS($B$2:C5))),\"\")","v":"أبو ايمن دائره مجاري"},{"$f":"IFERROR(INDEX(اقساط!$B$3:$B$150,SMALL(IF(اقساط!$AT$3:$AT$150=$A$2,ROW($AT$3:$AT$150)-ROW($AT$3)+1),ROWS($B$2:D5))),\"\")","v":"حمالة شاشة 6047 ذراع"},{"$f":"IFERROR(INDEX(اقساط!$C$3:$C$150,SMALL(IF(اقساط!$AT$3:$AT$150=$A$2,ROW($AT$3:$AT$150)-ROW($AT$3)+1),ROWS($B$2:E5))),\"\")","v":25000},{"$f":"IFERROR(INDEX(اقساط!$D$3:$D$150,SMALL(IF(اقساط!$AT$3:$AT$150=$A$2,ROW($AT$3:$AT$150)-ROW($AT$3)+1),ROWS($B$2:F5))),\"\")","v":1},{"$f":"IFERROR(INDEX(اقساط!$E$3:$E$150,SMALL(IF(اقساط!$AT$3:$AT$150=$A$2,ROW($AT$3:$AT$150)-ROW($AT$3)+1),ROWS($B$2:G5))),\"\")","v":25000},{"$f":"IFERROR(INDEX(اقساط!$H$3:$H$150,SMALL(IF(اقساط!$AT$3:$AT$150=$A$2,ROW($AT$3:$AT$150)-ROW($AT$3)+1),ROWS($B$2:H5))),\"\")","v":0},{"$f":"IFERROR(INDEX(اقساط!$AR$3:$AR$150,SMALL(IF(اقساط!$AT$3:$AT$150=$A$2,ROW($AT$3:$AT$150)-ROW($AT$3)+1),ROWS($B$2:I5))),\"\")","v":0},{"$f":"IFERROR(INDEX(اقساط!$AS$3:$AS$150,SMALL(IF(اقساط!$AT$3:$AT$150=$A$2,ROW($AT$3:$AT$150)-ROW($AT$3)+1),ROWS($B$2:J5))),\"\")","v":0}]
["رقم الفاتورة","تاريخ الشراء","اسم العميل","المواد المشتراة","السعر","العدد","المبلغ","مجموع المشتريات","مجموع المبالغ المدفوع","المبلغ المتبقي"]
[2,{"$f":"IFERROR(INDEX(اقساط!$F$3:$F$150,SMALL(IF(اقساط!$AT$3:$AT$150=$A$7,ROW($AT$3:$AT$150)-ROW($AT$3)+1),ROWS($B$7:B7))),\"\")","v":"2017-09-27"},{"$f":"IFERROR(INDEX(اقساط!$G$3:$G$150,SMALL(IF(اقساط!$AT$3:$AT$150=$A$7,ROW($AT$3:$AT$150)-ROW($AT$3)+1),ROWS($B$7:C7))),\"\")","v":"أبو ايمن دائره مجاري"},{"$f":"IFERROR(INDEX(اقساط!$B$3:$B$150,SMALL(IF(اقساط!$AT$3:$AT$150=$A$7,ROW($AT$3:$AT$150)-ROW($AT$3)+1),ROWS($B$7:D7))),\"\")","v":"مكيف LG"},{"$f":"IFERROR(INDEX(اقساط!$C$3:$C$150,SMALL(IF(اقساط!$AT$3:$AT$150=$A$7,ROW($AT$3:$AT$150)-ROW($AT$3)+1),ROWS($B$7:E7))),\"\")","v":400000},{"$f":"IFERROR(INDEX(اقساط!$D$3:$D$150,SMALL(IF(اقساط!$AT$3:$AT$150=$A$7,ROW($AT$3:$AT$150)-ROW($AT$3)+1),ROWS($B$7:F7))),\"\")","v":1},{"$f":"IFERROR(INDEX(اقساط!$E$3:$E$150,SMALL(IF(اقساط!$AT$3:$AT$150=$A$7,ROW($AT$3:$AT$150)-ROW($AT$3)+1),ROWS($B$7:G7))),\"\")","v":400000},{"$f":"IFERROR(INDEX(اقساط!$H$3:$H$150,SMALL(IF(اقساط!$AT$3:$AT$150=$A$7,ROW($AT$3:$AT$150)-ROW($AT$3)+1),ROWS($B$7:H7))),\"\")","v":400000},{"$f":"IFERROR(INDEX(اقساط!$AR$3:$AR$150,SMALL(IF(اقساط!$AT$3:$AT$150=$A$7,ROW($AT$3:$AT$150)-ROW($AT$3)+1),ROWS($B$7:I7))),\"\")","v":400000},{"$f":"IFERROR(INDEX(اقساط!$AS$3:$AS$150,SMALL(IF(اقساط!$AT$3:$AT$150=$A$7,ROW($AT$3:$AT$150)-ROW($AT$3)+1),ROWS($B$7:J7))),\"\")","v":0}]