{"text_format":"1","workbook":"xlsx","n_sheets":2,"sheets":["درجات","الطلاب الضعفاء"],"not_rendered":{"charts":0,"images":0,"macros":0,"external_links":1,"defined_names":21,"comments":0,"pivot_tables":0},"unopened":[],"bounds":{"document_bytes":16777216,"sheet_cells":100000,"rows_first":2000,"rows_last":500,"rows_between":2000,"halvings":0,"cell_chars":16384,"cell_head_chars":4096},"cells_cut":0,"cells_raw":0,"read":"whole","date_system":"1900"}

{"sheet":"درجات","index":0,"n_rows":131,"n_cols":16,"rows_kept":131,"cut":false,"hidden":false,"merged":[[20,11,21,11],[20,12,21,12],[20,13,21,13],[21,14,21,19],[19,2,19,13],[20,2,21,2],[20,3,21,3],[20,4,21,4],[20,5,21,5],[20,6,21,6],[20,7,21,7],[20,8,21,8],[20,9,21,9],[20,10,21,10]]}
[]
[]
[]
[]
[]
[]
[]
[]
[]
[]
[]
[]
[]
[]
[]
[]
[]
[]
[]
[null,null,{"$f":"'[1]رصد الدرجات'!EB21","v":"قائمة"}]
{"$rows_left_out":112}
{"sheet":"الطلاب الضعفاء","index":1,"n_rows":40,"n_cols":14,"rows_kept":40,"cut":false,"hidden":false,"merged":[[13,12,14,12],[13,13,14,13],[13,2,14,2],[13,3,14,3],[13,4,14,4],[13,5,14,5],[13,6,14,6],[13,7,14,7],[13,1,14,1],[13,8,14,8],[13,9,14,9],[13,10,14,10],[13,11,14,11]]}
[]
[]
[]
[]
[]
[]
[]
[]
[]
[]
[null,null,null,"هنا اريد جلب التلاميذ الضعفاء 10 طلاب الأقل درجات حصلو ا عليها من قائمة الدرجات شيت الدرجات"]
[]
[]
[null,"ت","اسم التلميذ","الإسلامية","العربية","الإنكليزية","الرياضيات","الاجتماعيات","العلوم","الفنية والنشيد","الرياضة","نتيجة","مجموع","معدل"]
[]
[null,{"$f":"IF(C16=\"\",\"\",MAX($B$15:B15)+1)","v":1},{"$f":"IFERROR(INDEX(درجات!C$23:C$131,SMALL(IF(درجات!$M$23:$M$131<=SMALL(درجات!$M$23:$M$131,10),ROW($A$23:$A$131)-ROW($A$23)+1),ROWS($A$1:A1))),\"\")","v":"حسين علي كاظم حمد"},{"$f":"IFERROR(INDEX(درجات!D$23:D$131,SMALL(IF(درجات!$M$23:$M$131<=SMALL(درجات!$M$23:$M$131,10),ROW($A$23:$A$131)-ROW($A$23)+1),ROWS($A$1:B1))),\"\")","v":49},{"$f":"IFERROR(INDEX(درجات!E$23:E$131,SMALL(IF(درجات!$M$23:$M$131<=SMALL(درجات!$M$23:$M$131,10),ROW($A$23:$A$131)-ROW($A$23)+1),ROWS($A$1:C1))),\"\")","v":48},{"$f":"IFERROR(INDEX(درجات!F$23:F$131,SMALL(IF(درجات!$M$23:$M$131<=SMALL(درجات!$M$23:$M$131,10),ROW($A$23:$A$131)-ROW($A$23)+1),ROWS($A$1:D1))),\"\")","v":36},{"$f":"IFERROR(INDEX(درجات!G$23:G$131,SMALL(IF(درجات!$M$23:$M$131<=SMALL(درجات!$M$23:$M$131,10),ROW($A$23:$A$131)-ROW($A$23)+1),ROWS($A$1:E1))),\"\")","v":30},{"$f":"IFERROR(INDEX(درجات!H$23:H$131,SMALL(IF(درجات!$M$23:$M$131<=SMALL(درجات!$M$23:$M$131,10),ROW($A$23:$A$131)-ROW($A$23)+1),ROWS($A$1:F1))),\"\")","v":63},{"$f":"IFERROR(INDEX(درجات!I$23:I$131,SMALL(IF(درجات!$M$23:$M$131<=SMALL(درجات!$M$23:$M$131,10),ROW($A$23:$A$131)-ROW($A$23)+1),ROWS($A$1:G1))),\"\")","v":33},{"$f":"IFERROR(INDEX(درجات!J$23:J$131,SMALL(IF(درجات!$M$23:$M$131<=SMALL(درجات!$M$23:$M$131,10),ROW($A$23:$A$131)-ROW($A$23)+1),ROWS($A$1:H1))),\"\")","v":80},{"$f":"IFERROR(INDEX(درجات!K$23:K$131,SMALL(IF(درجات!$M$23:$M$131<=SMALL(درجات!$M$23:$M$131,10),ROW($A$23:$A$131)-ROW($A$23)+1),ROWS($A$1:I1))),\"\")","v":85},{"$f":"IFERROR(INDEX(درجات!L$23:L$131,SMALL(IF(درجات!$M$23:$M$131<=SMALL(درجات!$M$23:$M$131,10),ROW($A$23:$A$131)-ROW($A$23)+1),ROWS($A$1:J1))),\"\")","v":"راسب"},{"$f":"IFERROR(INDEX(درجات!M$23:M$131,SMALL(IF(درجات!$M$23:$M$131<=SMALL(درجات!$M$23:$M$131,10),ROW($A$23:$A$131)-ROW($A$23)+1),ROWS($A$1:K1))),\"\")","v":424},{"$f":"IFERROR(INDEX(درجات!N$23:N$131,SMALL(IF(درجات!$M$23:$M$131<=SMALL(درجات!$M$23:$M$131,10),ROW($A$23:$A$131)-ROW($A$23)+1),ROWS($A$1:L1))),\"\")","v":53}]
[null,{"$f":"IF(C17=\"\",\"\",MAX($B$15:B16)+1)","v":2},{"$f":"IFERROR(INDEX(درجات!C$23:C$131,SMALL(IF(درجات!$M$23:$M$131<=SMALL(درجات!$M$23:$M$131,10),ROW($A$23:$A$131)-ROW($A$23)+1),ROWS($A$1:A2))),\"\")","v":"شاكر كاظم شاكر جعمول"},{"$f":"IFERROR(INDEX(درجات!D$23:D$131,SMALL(IF(درجات!$M$23:$M$131<=SMALL(درجات!$M$23:$M$131,10),ROW($A$23:$A$131)-ROW($A$23)+1),ROWS($A$1:B2))),\"\")","v":52},{"$f":"IFERROR(INDEX(درجات!E$23:E$131,SMALL(IF(درجات!$M$23:$M$131<=SMALL(درجات!$M$23:$M$131,10),ROW($A$23:$A$131)-ROW($A$23)+1),ROWS($A$1:C2))),\"\")","v":47},{"$f":"IFERROR(INDEX(درجات!F$23:F$131,SMALL(IF(درجات!$M$23:$M$131<=SMALL(درجات!$M$23:$M$131,10),ROW($A$23:$A$131)-ROW($A$23)+1),ROWS($A$1:D2))),\"\")","v":48},{"$f":"IFERROR(INDEX(درجات!G$23:G$131,SMALL(IF(درجات!$M$23:$M$131<=SMALL(درجات!$M$23:$M$131,10),ROW($A$23:$A$131)-ROW($A$23)+1),ROWS($A$1:E2))),\"\")","v":35},{"$f":"IFERROR(INDEX(درجات!H$23:H$131,SMALL(IF(درجات!$M$23:$M$131<=SMALL(درجات!$M$23:$M$131,10),ROW($A$23:$A$131)-ROW($A$23)+1),ROWS($A$1:F2))),\"\")","v":54},{"$f":"IFERROR(INDEX(درجات!I$23:I$131,SMALL(IF(درجات!$M$23:$M$131<=SMALL(درجات!$M$23:$M$131,10),ROW($A$23:$A$131)-ROW($A$23)+1),ROWS($A$1:G2))),\"\")","v":52},{"$f":"IFERROR(INDEX(درجات!J$23:J$131,SMALL(IF(درجات!$M$23:$M$131<=SMALL(درجات!$M$23:$M$131,10),ROW($A$23:$A$131)-ROW($A$23)+1),ROWS($A$1:H2))),\"\")","v":80},{"$f":"IFERROR(INDEX(درجات!K$23:K$131,SMALL(IF(درجات!$M$23:$M$131<=SMALL(درجات!$M$23:$M$131,10),ROW($A$23:$A$131)-ROW($A$23)+1),ROWS($A$1:I2))),\"\")","v":87},{"$f":"IFERROR(INDEX(درجات!L$23:L$131,SMALL(IF(درجات!$M$23:$M$131<=SMALL(درجات!$M$23:$M$131,10),ROW($A$23:$A$131)-ROW($A$23)+1),ROWS($A$1:J2))),\"\")","v":"راسب"},{"$f":"IFERROR(INDEX(درجات!M$23:M$131,SMALL(IF(درجات!$M$23:$M$131<=SMALL(درجات!$M$23:$M$131,10),ROW($A$23:$A$131)-ROW($A$23)+1),ROWS($A$1:K2))),\"\")","v":455},{"$f":"IFERROR(INDEX(درجات!N$23:N$131,SMALL(IF(درجات!$M$23:$M$131<=SMALL(درجات!$M$23:$M$131,10),ROW($A$23:$A$131)-ROW($A$23)+1),ROWS($A$1:L2))),\"\")","v":56.875}]
[null,{"$f":"IF(C18=\"\",\"\",MAX($B$15:B17)+1)","v":3},{"$f":"IFERROR(INDEX(درجات!C$23:C$131,SMALL(IF(درجات!$M$23:$M$131<=SMALL(درجات!$M$23:$M$131,10),ROW($A$23:$A$131)-ROW($A$23)+1),ROWS($A$1:A3))),\"\")","v":"ضياء رياض صبحي وعد"},{"$f":"IFERROR(INDEX(درجات!D$23:D$131,SMALL(IF(درجات!$M$23:$M$131<=SMALL(درجات!$M$23:$M$131,10),ROW($A$23:$A$131)-ROW($A$23)+1),ROWS($A$1:B3))),\"\")","v":60},{"$f":"IFERROR(INDEX(درجات!E$23:E$131,SMALL(IF(درجات!$M$23:$M$131<=SMALL(درجات!$M$23:$M$131,10),ROW($A$23:$A$131)-ROW($A$23)+1),ROWS($A$1:C3))),\"\")","v":59},{"$f":"IFERROR(INDEX(درجات!F$23:F$131,SMALL(IF(درجات!$M$23:$M$131<=SMALL(درجات!$M$23:$M$131,10),ROW($A$23:$A$131)-ROW($A$23)+1),ROWS($A$1:D3))),\"\")","v":48},{"$f":"IFERROR(INDEX(درجات!G$23:G$131,SMALL(IF(درجات!$M$23:$M$131<=SMALL(درجات!$M$23:$M$131,10),ROW($A$23:$A$131)-ROW($A$23)+1),ROWS($A$1:E3))),\"\")","v":39},{"$f":"IFERROR(INDEX(درجات!H$23:H$131,SMALL(IF(درجات!$M$23:$M$131<=SMALL(درجات!$M$23:$M$131,10),ROW($A$23:$A$131)-ROW($A$23)+1),ROWS($A$1:F3))),\"\")","v":29},{"$f":"IFERROR(INDEX(درجات!I$23:I$131,SMALL(IF(درجات!$M$23:$M$131<=SMALL(درجات!$M$23:$M$131,10),ROW($A$23:$A$131)-ROW($A$23)+1),ROWS($A$1:G3))),\"\")","v":57},{"$f":"IFERROR(INDEX(درجات!J$23:J$131,SMALL(IF(درجات!$M$23:$M$131<=SMALL(درجات!$M$23:$M$131,10),ROW($A$23:$A$131)-ROW($A$23)+1),ROWS($A$1:H3))),\"\")","v":85},{"$f":"IFERROR(INDEX(درجات!K$23:K$131,SMALL(IF(درجات!$M$23:$M$131<=SMALL(درجات!$M$23:$M$131,10),ROW($A$23:$A$131)-ROW($A$23)+1),ROWS($A$1:I3))),\"\")","v":90},{"$f":"IFERROR(INDEX(درجات!L$23:L$131,SMALL(IF(درجات!$M$23:$M$131<=SMALL(درجات!$M$23:$M$131,10),ROW($A$23:$A$131)-ROW($A$23)+1),ROWS($A$1:J3))),\"\")","v":"راسب"},{"$f":"IFERROR(INDEX(درجات!M$23:M$131,SMALL(IF(درجات!$M$23:$M$131<=SMALL(درجات!$M$23:$M$131,10),ROW($A$23:$A$131)-ROW($A$23)+1),ROWS($A$1:K3))),\"\")","v":467},{"$f":"IFERROR(INDEX(درجات!N$23:N$131,SMALL(IF(درجات!$M$23:$M$131<=SMALL(درجات!$M$23:$M$131,10),ROW($A$23:$A$131)-ROW($A$23)+1),ROWS($A$1:L3))),\"\")","v":58.375}]
[null,{"$f":"IF(C19=\"\",\"\",MAX($B$15:B18)+1)","v":4},{"$f":"IFERROR(INDEX(درجات!C$23:C$131,SMALL(IF(درجات!$M$23:$M$131<=SMALL(درجات!$M$23:$M$131,10),ROW($A$23:$A$131)-ROW($A$23)+1),ROWS($A$1:A4))),\"\")","v":"عباس كارون رحيم عجه"},{"$f":"IFERROR(INDEX(درجات!D$23:D$131,SMALL(IF(درجات!$M$23:$M$131<=SMALL(درجات!$M$23:$M$131,10),ROW($A$23:$A$131)-ROW($A$23)+1),ROWS($A$1:B4))),\"\")","v":46},{"$f":"IFERROR(INDEX(درجات!E$23:E$131,SMALL(IF(درجات!$M$23:$M$131<=SMALL(درجات!$M$23:$M$131,10),ROW($A$23:$A$131)-ROW($A$23)+1),ROWS($A$1:C4))),\"\")","v":39},{"$f":"IFERROR(INDEX(درجات!F$23:F$131,SMALL(IF(درجات!$M$23:$M$131<=SMALL(درجات!$M$23:$M$131,10),ROW($A$23:$A$131)-ROW($A$23)+1),ROWS($A$1:D4))),\"\")","v":43},{"$f":"IFERROR(INDEX(درجات!G$23:G$131,SMALL(IF(درجات!$M$23:$M$131<=SMALL(درجات!$M$23:$M$131,10),ROW($A$23:$A$131)-ROW($A$23)+1),ROWS($A$1:E4))),\"\")","v":55},{"$f":"IFERROR(INDEX(درجات!H$23:H$131,SMALL(IF(درجات!$M$23:$M$131<=SMALL(درجات!$M$23:$M$131,10),ROW($A$23:$A$131)-ROW($A$23)+1),ROWS($A$1:F4))),\"\")","v":60},{"$f":"IFERROR(INDEX(درجات!I$23:I$131,SMALL(IF(درجات!$M$23:$M$131<=SMALL(درجات!$M$23:$M$131,10),ROW($A$23:$A$131)-ROW($A$23)+1),ROWS($A$1:G4))),\"\")","v":60},{"$f":"IFERROR(INDEX(درجات!J$23:J$131,SMALL(IF(درجات!$M$23:$M$131<=SMALL(درجات!$M$23:$M$131,10),ROW($A$23:$A$131)-ROW($A$23)+1),ROWS($A$1:H4))),\"\")","v":80},{"$f":"IFERROR(INDEX(درجات!K$23:K$131,SMALL(IF(درجات!$M$23:$M$131<=SMALL(درجات!$M$23:$M$131,10),ROW($A$23:$A$131)-ROW($A$23)+1),ROWS($A$1:I4))),\"\")","v":82},{"$f":"IFERROR(INDEX(درجات!L$23:L$131,SMALL(IF(درجات!$M$23:$M$131<=SMALL(درجات!$M$23:$M$131,10),ROW($A$23:$A$131)-ROW($A$23)+1),ROWS($A$1:J4))),\"\")","v":"راسب"},{"$f":"IFERROR(INDEX(درجات!M$23:M$131,SMALL(IF(درجات!$M$23:$M$131<=SMALL(درجات!$M$23:$M$131,10),ROW($A$23:$A$131)-ROW($A$23)+1),ROWS($A$1:K4))),\"\")","v":465},{"$f":"IFERROR(INDEX(درجات!N$23:N$131,SMALL(IF(درجات!$M$23:$M$131<=SMALL(درجات!$M$23:$M$131,10),ROW($A$23:$A$131)-ROW($A$23)+1),ROWS($A$1:L4))),\"\")","v":58.125}]
[null,{"$f":"IF(C20=\"\",\"\",MAX($B$15:B19)+1)","v":5},{"$f":"IFERROR(INDEX(درجات!C$23:C$131,SMALL(IF(درجات!$M$23:$M$131<=SMALL(درجات!$M$23:$M$131,10),ROW($A$23:$A$131)-ROW($A$23)+1),ROWS($A$1:A5))),\"\")","v":"علي حسين كامل جعمول"},{"$f":"IFERROR(INDEX(درجات!D$23:D$131,SMALL(IF(درجات!$M$23:$M$131<=SMALL(درجات!$M$23:$M$131,10),ROW($A$23:$A$131)-ROW($A$23)+1),ROWS($A$1:B5))),\"\")","v":67},{"$f":"IFERROR(INDEX(درجات!E$23:E$131,SMALL(IF(درجات!$M$23:$M$131<=SMALL(درجات!$M$23:$M$131,10),ROW($A$23:$A$131)-ROW($A$23)+1),ROWS($A$1:C5))),\"\")","v":40},{"$f":"IFERROR(INDEX(درجات!F$23:F$131,SMALL(IF(درجات!$M$23:$M$131<=SMALL(درجات!$M$23:$M$131,10),ROW($A$23:$A$131)-ROW($A$23)+1),ROWS($A$1:D5))),\"\")","v":40},{"$f":"IFERROR(INDEX(درجات!G$23:G$131,SMALL(IF(درجات!$M$23:$M$131<=SMALL(درجات!$M$23:$M$131,10),ROW($A$23:$A$131)-ROW($A$23)+1),ROWS($A$1:E5))),\"\")","v":48},{"$f":"IFERROR(INDEX(درجات!H$23:H$131,SMALL(IF(درجات!$M$23:$M$131<=SMALL(درجات!$M$23:$M$131,10),ROW($A$23:$A$131)-ROW($A$23)+1),ROWS($A$1:F5))),\"\")","v":64},{"$f":"IFERROR(INDEX(درجات!I$23:I$131,SMALL(IF(درجات!$M$23:$M$131<=SMALL(درجات!$M$23:$M$131,10),ROW($A$23:$A$131)-ROW($A$23)+1),ROWS($A$1:G5))),\"\")","v":30},{"$f":"IFERROR(INDEX(درجات!J$23:J$131,SMALL(IF(درجات!$M$23:$M$131<=SMALL(درجات!$M$23:$M$131,10),ROW($A$23:$A$131)-ROW($A$23)+1),ROWS($A$1:H5))),\"\")","v":80},{"$f":"IFERROR(INDEX(درجات!K$23:K$131,SMALL(IF(درجات!$M$23:$M$131<=SMALL(درجات!$M$23:$M$131,10),ROW($A$23:$A$131)-ROW($A$23)+1),ROWS($A$1:I5))),\"\")","v":90},{"$f":"IFERROR(INDEX(درجات!L$23:L$131,SMALL(IF(درجات!$M$23:$M$131<=SMALL(درجات!$M$23:$M$131,10),ROW($A$23:$A$131)-ROW($A$23)+1),ROWS($A$1:J5))),\"\")","v":"راسب"},{"$f":"IFERROR(INDEX(درجات!M$23:M$131,SMALL(IF(درجات!$M$23:$M$131<=SMALL(درجات!$M$23:$M$131,10),ROW($A$23:$A$131)-ROW($A$23)+1),ROWS($A$1:K5))),\"\")","v":459},{"$f":"IFERROR(INDEX(درجات!N$23:N$131,SMALL(IF(درجات!$M$23:$M$131<=SMALL(درجات!$M$23:$M$131,10),ROW($A$23:$A$131)-ROW($A$23)+1),ROWS($A$1:L5))),\"\")","v":57.375}]
{"$rows_left_out":20}