{"text_format":"1","workbook":"xlsx","n_sheets":2,"sheets":["Sayfa1","FAX"],"not_rendered":{"charts":0,"images":0,"macros":1,"external_links":0,"defined_names":3,"comments":0,"pivot_tables":0},"unopened":[],"bounds":{"document_bytes":16777216,"sheet_cells":100000,"rows_first":2000,"rows_last":500,"rows_between":2000,"halvings":0,"cell_chars":16384,"cell_head_chars":4096},"cells_cut":0,"cells_raw":0,"read":"whole","date_system":"1900"}

{"sheet":"Sayfa1","index":0,"n_rows":32,"n_cols":25,"rows_kept":32,"cut":false,"hidden":false,"merged":[[1,10,2,10],[1,11,2,14],[27,2,27,9],[17,8,17,9],[18,8,18,9],[14,8,14,9],[15,8,15,9],[16,8,16,9],[13,8,13,9],[25,8,25,9],[1,1,8,9],[3,16,4,17],[30,2,30,4],[5,16,7,17],[20,8,20,9],[21,8,21,9],[3,11,3,14],[4,11,4,14],[5,11,5,14],[8,11,8,14],[26,7,26,9],[6,11,6,14],[7,11,7,14],[10,8,10,9],[31,2,31,5],[27,10,27,12],[27,13,27,14],[11,8,11,9],[12,8,12,9],[22,8,22,9],[23,8,23,9],[26,13,26,14],[19,8,19,9],[24,8,24,9]]}
[]
[null,"PROFORMA",null,null,null,null,null,null,null,null,"FİRMA :","TEPE INSAAT ",null,null,null,null,null,null,null,null,null,null,null,null,"PROFORMA"]
[null,null,null,null,null,null,null,null,null,null,null,null,null,null,null,null,null,null,null,null,null,null,null,null,"FIYAT TEKLİF"]
[null,null,null,null,null,null,null,null,null,null,"YETKİLİ  :","IST",null,null,null,null,"KDV"]
[null,null,null,null,null,null,null,null,null,null,"ŞEHİR  :"]
[null,null,null,null,null,null,null,null,null,null,"ADRES:",null,null,null,null,null,0.18]
[null,null,null,null,null,null,null,null,null,null,"G.S.M:"]
[null,null,null,null,null,null,null,null,null,null,"FAKS:"]
[null,null,null,null,null,null,null,null,null,null,"E-POSTA:"]
[]
[null,"FAX","EN","BOY","DUVAR","SOL","SAĞ","MODEL","TEKNİK DETAYLAR",null,"AD","FIYAT","TOTAL ","KDV","KDV TOTAL",null,"ARKA YÜZEY","KASA "]
[null,1,90,200,"14x24",1,2,"U-2001","EKO",null,{"$f":"G12+F12","v":3},null,{"$f":"L12*K12","v":0},{"$f":"M12*$Q$6","v":0},{"$f":"M12+N12","v":0},null,"DÜZ","VENGE"]
[null,2,90,200,"14x25",2,3,"U-2002","EKO",null,{"$f":"G13+F13","v":5},null,{"$f":"L13*K13","v":0},{"$f":"M13*$Q$6","v":0},{"$f":"M13+N13","v":0},null,"DÜZ","VENGE"]
[null,3,90,200,"14x26",3,1,"U-2003","EKO",null,4,null,0,0,0,null,"DÜZ","VENGE"]
[null,4,null,null,null,null,null,null,null,null,0,null,0,0,0]
[null,5,null,null,null,null,null,null,null,null,0,null,0,0,0]
[null,6,null,null,null,null,null,null,null,null,0,null,0,0,0]
[null,7,null,null,null,null,null,null,null,null,0,null,0,0,0]
[null,8,null,null,null,null,null,null,null,null,0,null,0,0,0]
[null,9,null,null,null,null,null,null,null,null,0,null,0,0,0]
[null,10,null,null,null,null,null,null,null,null,0,null,0,0,0]
[null,11,null,null,null,null,null,null,null,null,0,null,0,0,0]
[null,12,null,null,null,null,null,null,null,null,0,null,0,0,0]
[null,13,null,null,null,null,null,null,null,null,0,null,{"$f":"L24*K24","v":0},0,{"$f":"M24+N24","v":0}]
[null,14,null,null,null,null,null,null,null,null,0,null,{"$f":"L25*K25","v":0},0,{"$f":"M25+N25","v":0}]
[null,15,null,null,null,null,null,null,null,null,{"$f":"G26+F26","v":0},null,{"$f":"L26*K26","v":0},{"$f":"M26*$Q$6","v":0},{"$f":"M26+N26","v":0}]
[null,null,null,null,null,{"$f":"SUM(F12:F26)","v":6},{"$f":"SUM(G12:G26)","v":6},null,null,null,{"$f":"SUM(K12:K26)","v":12},null,null,{"$f":"SUM(O12:O26)","v":0}]
[null,null,"NOT:., SATIŞIMIZ KAYSERİ FABRİKA TESLİMİDİR..SİPARİŞ ONAYINI  GÖNDERİNİZ ..     \nÜRETİ SÜRECİ:20/25 GÜN\n",null,null,null,null,null,null,null,"GENEL TOPLAM",null,null,{"$f":"N27","v":0}]
[null,null,"ÖDEME ŞEKLİ: ÇEKLİ ÖDEMELİ"]
[]
[null,null,"Sipariş Alan",null,null,null,null,null,"Sipariş Veren"]
[null,null,null,null,null,null,null,null,{"$f":"L4","v":"IST"}]

{"sheet":"FAX","index":1,"n_rows":39,"n_cols":21,"rows_kept":39,"cut":false,"hidden":false,"merged":[[8,1,8,2],[6,5,6,8],[7,5,7,8],[8,6,8,7],[11,17,12,18],[6,10,7,11],[6,14,7,15],[27,17,27,18],[29,10,29,11],[29,14,29,15],[33,17,34,18],[34,6,34,7],[28,5,28,8],[29,5,29,8],[30,6,30,7],[45,6,45,8],[23,6,23,8],[24,6,25,6],[24,11,24,14],[12,6,12,7],[16,1,20,7],[13,1,13,2],[14,1,14,2],[15,1,15,2],[35,1,35,2],[36,1,36,2],[37,1,37,2],[38,1,42,7],[26,11,26,14],[27,1,27,2],[30,1,30,2],[1,6,1,7],[2,11,2,14],[5,1,5,2],[5,17,5,18],[4,11,4,14]]}
[]
[null,null,null,null,null,null,null,null,null,null,null,null,null,null,null,null,null,null,null,"SAĞ"]
[null,null,null,null,null,null,null,null,null,null,null,1,null,null,null,null,null,null,null,"SOL "]
[null,null,{"$f":"Sayfa1!L2","v":"TEPE INSAAT "}]
[null,null,{"$f":"Sayfa1!L4","v":"IST"},null,null,null,null,null,null,null,null,null,null,null,null,null,null,null,null,"AD",{"$f":"IF($R$6=\"SAĞ\",VLOOKUP(L3,Sayfa1!B12:R127,6,0),VLOOKUP(L3,Sayfa1!B12:R127,5,0))","v":1}]
[null,{"$f":"TODAY()","v":"2018-07-09"}]
[null,{"$f":"VLOOKUP(L3,Sayfa1!B2:R127,7,0)","v":"U-2001"},null,null,null,{"$f":"VLOOKUP(L3,Sayfa1!B2:R127,17,0)","v":"VENGE"},null,null,null,null,{"$f":"VLOOKUP(L3,Sayfa1!B12:R127,5,0)","v":1},null,null,null,{"$f":"VLOOKUP(L3,Sayfa1!B12:R127,6,0)","v":2}]
[null,{"$f":"VLOOKUP(L3,Sayfa1!B2:R127,16,0)","v":"DÜZ"},null,null,null,{"$f":"VLOOKUP(L3,Sayfa1!B12:R127,17,0)","v":"VENGE"}]
[null,"SOL",null,null,{"$f":"VLOOKUP(L3,Sayfa1!B12:R127,4,0)","v":"14x24"},null,{"$f":"VLOOKUP(L3,Sayfa1!B12:R127,2,0)","v":90}]
[]
[]
[]
[null,null,null,{"$f":"VLOOKUP(L3,Sayfa1!B12:R127,3,0)","v":200},null,null,{"$f":"VLOOKUP(L3,Sayfa1!B12:R127,3,0)","v":200}]
[]
[]
[]
[null,{"$f":"VLOOKUP(L3,Sayfa1!B12:R127,8,0)","v":"EKO"}]
[]
[]
[]
[]
[]
[]
[]
[]
[null,null,{"$f":"Sayfa1!L2","v":"TEPE INSAAT "}]
[null,null,{"$f":"Sayfa1!L4","v":"IST"}]
[null,{"$f":"TODAY()","v":"2018-07-09"}]
[null,{"$f":"VLOOKUP(L3,Sayfa1!B2:R127,7,0)","v":"U-2001"},null,null,null,{"$f":"VLOOKUP(L3,Sayfa1!B2:R127,17,0)","v":"VENGE"}]
[null,{"$f":"VLOOKUP(L3,Sayfa1!B2:R127,16,0)","v":"DÜZ"},null,null,null,{"$f":"VLOOKUP(L3,Sayfa1!B2:R127,17,0)","v":"VENGE"}]
[null,"SAĞ",null,null,{"$f":"VLOOKUP(L3,Sayfa1!B12:R127,4,0)","v":"14x24"},null,{"$f":"VLOOKUP(L3,Sayfa1!B12:R127,2,0)","v":90}]
[]
[]
[]
[null,null,null,{"$f":"VLOOKUP(L3,Sayfa1!B12:R127,3,0)","v":200},null,null,{"$f":"VLOOKUP(L3,Sayfa1!B12:R127,3,0)","v":200}]
[]
[]
[]
[null,{"$f":"VLOOKUP(L3,Sayfa1!B12:R127,8,0)","v":"EKO"}]