{"text_format":"1","workbook":"xlsx","n_sheets":2,"sheets":["بيانات التلاميذ","خرائط جلوس"],"not_rendered":{"charts":0,"images":0,"macros":0,"external_links":0,"defined_names":1,"comments":0,"pivot_tables":0},"unopened":[],"bounds":{"document_bytes":16777216,"sheet_cells":100000,"rows_first":2000,"rows_last":500,"rows_between":2000,"halvings":0,"cell_chars":16384,"cell_head_chars":4096},"cells_cut":0,"cells_raw":0,"read":"whole","date_system":"1900"}

{"sheet":"بيانات التلاميذ","index":0,"n_rows":658,"n_cols":22,"rows_kept":658,"cut":false,"hidden":false,"merged":[]}
[]
[]
[]
[]
[null,null,null,null,null,null,null,null,null,null,null,null,null,null,null,null,null,null,null,"الاول - أ"]
[null,null,null,null,null,null,null,null,null,null,null,null,null,null,null,null,null,null,null,"الاول - ب"]
[null,null,null,null,null,null,null,null,null,null,null,null,null,null,null,null,null,null,null,"الاول - ج"]
[null,null,null,null,null,null,null,null,null,null,null,null,null,null,null,null,null,null,null,"الاول - د"]
[null,null,null,null,null,null,null,null,null,null,null,null,null,null,null,null,null,null,null,"الثاني - أ"]
[null,null,null,null,null,null,null,null,null,null,null,null,null,null,null,null,null,null,null,"الثاني - ب"]
[null,null,null,null,null,null,null,null,null,null,null,null,null,null,null,null,null,null,null,"الثاني - ج","الاول","ناجح"]
[null,null,null,null,null,null,null,null,null,null,null,null,null,null,null,null,null,null,null,"الثاني - د","الثاني","راسب"]
[null,null,null,null,null,null,null,null,null,null,null,null,null,null,null,null,null,null,null,"الثالث - أ","الثالث","مكمل"]
[null,null,null,null,null,null,null,null,null,null,null,null,null,null,null,null,null,null,null,"الثالث - ب","الرابع"]
["التسلسل العام","ت","القيد","التولد","الاسم","الصف والشعبة","الجنس","الصف","يوم","شهر","سنة",null,null,null,null,null,null,null,null,"الثالث - ج"]
[{"$f":"IF(E16=\"\",\"\",SUBTOTAL(3,$E$16:E16))","v":1},{"$f":"COUNTIF($F$16:F16,F16)","v":1},"83/5","2011/6/6","احمد سعيد حسين خضر","الاول - أ","ذكر",{"$f":"IF(OR(F16=$T$5,F16=$T$6,F16=$T$7,F16=$T$8),\"الاول\",IF(OR(F16=$T$9,F16=$T$10,F16=$T$11,F16=$T$12),\"الثاني\",IF(OR(F16=$T$13,F16=$T$14,F16=$T$15,F16=$T$16),\"الثالث\",IF(OR(F16=$T$17,F16=$T$18,F16=$T$19,F16=$T$20),\"الرابع\",IF(OR(F16=$T$21,F16=$T$22,F16=$T$32,F16=$T$24),\"الخامس\",IF(OR(F16=$T$25,F16=$T$26,F16=$T$27,F16=$T$28),\"السادس\",\"\"))))))","v":"الاول"},{"$f":"DATEDIF($D16,$M$16,\"md\")","v":2},{"$f":"DATEDIF($D16,$M$16,\"ym\")","v":1},{"$f":"DATEDIF($D16,$M$16,\"y\")","v":7},null,"2018-07-08","اختيار",null,null,null,null,{"$f":"IF(F16=$T$5,1,IF(F16=$T$6,2,IF(F16=$T$7,3,IF(F16=$T$8,4,IF(F16=$T$9,5,IF(F16=$T$10,6,IF(F16=$T$11,7,IF(F16=$T$12,8,IF(F16=$T$13,9,IF(F16=$T$14,10,IF(F16=$T$15,11,IF(F16=$T$16,12,IF(F16=$T$17,13,IF(F16=$T$18,14,IF(F16=$T$19,15,IF(F16=$T$20,16,IF(F16=$T$21,17,IF(F16=$T$22,18,IF(F16=$T$23,19,IF(F16=$T$24,20,IF(F16=$T$25,21,IF(F16=$T$26,22,IF(F16=$T$27,23,IF(F16=$T$28,24,\"\"))))))))))))))))))))))))","v":1},"الثالث - د"]
[{"$f":"IF(E17=\"\",\"\",SUBTOTAL(3,$E$16:E17))","v":2},{"$f":"COUNTIF($F$16:F17,F17)","v":2},"84/5","2011/9/21","أسامه شهيد مايح شاني","الاول - أ","ذكر","الاول",17,9,6,null,"2017-10-01","بداية الدوام",null,null,null,null,1,"الرابع - أ"]
[{"$f":"IF(E18=\"\",\"\",SUBTOTAL(3,$E$16:E18))","v":3},{"$f":"COUNTIF($F$16:F18,F18)","v":3},"85/5","2011/3/21","باقر محمد حسن جعفر","الاول - أ","ذكر","الاول",17,3,7,null,"2018-07-08","تاريخ اليوم",null,null,null,null,1,"الرابع - ب"]
[{"$f":"IF(E19=\"\",\"\",SUBTOTAL(3,$E$16:E19))","v":4},{"$f":"COUNTIF($F$16:F19,F19)","v":4},"86/5","2011/5/31","باقر وسام كريم جهادي","الاول - أ","ذكر","الاول",7,1,7,null,null,null,null,null,null,null,1,"الرابع - ج"]
[{"$f":"IF(E20=\"\",\"\",SUBTOTAL(3,$E$16:E20))","v":5},{"$f":"COUNTIF($F$16:F20,F20)","v":5},"87/5","2011/3/18","حسن باسم كاظم جهادي","الاول - أ","ذكر","الاول",20,3,7,null,null,null,null,null,null,null,1,"الرابع - د"]
[{"$f":"IF(E21=\"\",\"\",SUBTOTAL(3,$E$16:E21))","v":6},{"$f":"COUNTIF($F$16:F21,F21)","v":6},"88/5","2011/11/25","حسن سامي حنون نجم","الاول - أ","ذكر","الاول",13,7,6,null,null,null,null,null,null,null,1,"الخامس - أ"]
[{"$f":"IF(E22=\"\",\"\",SUBTOTAL(3,$E$16:E22))","v":7},{"$f":"COUNTIF($F$16:F22,F22)","v":7},"89/5","2011/9/2","حسين احمد يحيى عليوي","الاول - أ","ذكر","الاول",6,10,6,null,null,null,null,null,null,null,1,"الخامس - ب"]
[{"$f":"IF(E23=\"\",\"\",SUBTOTAL(3,$E$16:E23))","v":8},{"$f":"COUNTIF($F$16:F23,F23)","v":8},"90/5","2011/6/18","حسين باسم كريم عطشان","الاول - أ","ذكر","الاول",20,0,7,null,null,null,null,null,null,null,1,"الخامس - ج"]
[{"$f":"IF(E24=\"\",\"\",SUBTOTAL(3,$E$16:E24))","v":9},{"$f":"COUNTIF($F$16:F24,F24)","v":9},"91/5","2010/6/6","حسين شهاب شهد عبود","الاول - أ","ذكر","الاول",2,1,8,null,null,null,null,null,null,null,1,"الخامس - د"]
[{"$f":"IF(E25=\"\",\"\",SUBTOTAL(3,$E$16:E25))","v":10},{"$f":"COUNTIF($F$16:F25,F25)","v":10},"92/5","2009/4/23","حيدر جياد أبو اللوح شنان","الاول - أ","ذكر","الاول",15,2,9,null,null,null,null,null,null,null,1,"السادس - أ"]
[{"$f":"IF(E26=\"\",\"\",SUBTOTAL(3,$E$16:E26))","v":11},{"$f":"COUNTIF($F$16:F26,F26)","v":11},"93/5","2011/8/19","حيدر علي داود سلمان راجوج","الاول - أ","ذكر","الاول",19,10,6,null,null,null,null,null,null,null,1,"السادس - ب"]
[{"$f":"IF(E27=\"\",\"\",SUBTOTAL(3,$E$16:E27))","v":12},{"$f":"COUNTIF($F$16:F27,F27)","v":12},"46/5","2010/2/8","رسول خالد نعمه عبيد ","الاول - أ","ذكر","الاول",0,5,8,null,null,null,null,null,null,null,1,"السادس - ج"]
[{"$f":"IF(E28=\"\",\"\",SUBTOTAL(3,$E$16:E28))","v":13},{"$f":"COUNTIF($F$16:F28,F28)","v":13},"94/5","2011/2/2","رضا عباس ناجي عيسى","الاول - أ","ذكر","الاول",6,5,7,null,null,null,null,null,null,null,1,"السادس - د"]
[{"$f":"IF(E29=\"\",\"\",SUBTOTAL(3,$E$16:E29))","v":14},{"$f":"COUNTIF($F$16:F29,F29)","v":14},"74/5","2010-10-19","ضياء ناجح مايح شاني","الاول - أ","ذكر","الاول",19,8,7,null,null,null,null,null,null,null,1]
[{"$f":"IF(E30=\"\",\"\",SUBTOTAL(3,$E$16:E30))","v":15},{"$f":"COUNTIF($F$16:F30,F30)","v":15},"41/5","2010/9/30","عباس تكليف جهادي عبد","الاول - أ","ذكر","الاول",8,9,7,null,null,null,null,null,null,null,1]
[{"$f":"IF(E31=\"\",\"\",SUBTOTAL(3,$E$16:E31))","v":16},{"$f":"COUNTIF($F$16:F31,F31)","v":16},"96/5","2011/2/20","علي سعد عناد ساجت","الاول - أ","ذكر","الاول",18,4,7,null,null,null,null,null,null,null,1]
[{"$f":"IF(E32=\"\",\"\",SUBTOTAL(3,$E$16:E32))","v":17},{"$f":"COUNTIF($F$16:F32,F32)","v":17},"97/5","2011/7/16","علي ماجد عطشان كاطع","الاول - أ","ذكر","الاول",22,11,6,null,null,null,null,null,null,null,1]
[{"$f":"IF(E33=\"\",\"\",SUBTOTAL(3,$E$16:E33))","v":18},{"$f":"COUNTIF($F$16:F33,F33)","v":18},"98/5","2011/7/11","علي محمد سلطان كريم","الاول - أ","ذكر","الاول",27,11,6,null,null,null,null,null,null,null,1]
[{"$f":"IF(E34=\"\",\"\",SUBTOTAL(3,$E$16:E34))","v":19},{"$f":"COUNTIF($F$16:F34,F34)","v":19},"9/5","2010/4/9","كاظم مشعل خنجر كمين ","الاول - أ","ذكر","الاول",29,2,8,null,null,null,null,null,null,null,1]
[{"$f":"IF(E35=\"\",\"\",SUBTOTAL(3,$E$16:E35))","v":20},{"$f":"COUNTIF($F$16:F35,F35)","v":20},"100/5","2011/2/24","كرار جبار عبد الحسين عواد","الاول - أ","ذكر","الاول",14,4,7,null,null,null,null,null,null,null,1]
[{"$f":"IF(E36=\"\",\"\",SUBTOTAL(3,$E$16:E36))","v":21},{"$f":"COUNTIF($F$16:F36,F36)","v":21},"101/5","2011/2/8","كرار عدنان حسين خضر","الاول - أ","ذكر","الاول",0,5,7,null,null,null,null,null,null,null,1]
[{"$f":"IF(E37=\"\",\"\",SUBTOTAL(3,$E$16:E37))","v":22},{"$f":"COUNTIF($F$16:F37,F37)","v":22},"355/4","2009/8/8","كريم عدنان كريم عطشان","الاول - أ","ذكر","الاول",0,11,8,null,null,null,null,null,null,null,1]
[{"$f":"IF(E38=\"\",\"\",SUBTOTAL(3,$E$16:E38))","v":23},{"$f":"COUNTIF($F$16:F38,F38)","v":23},"102/5","2011/10/16","محمد رائد عصيب علي","الاول - أ","ذكر","الاول",22,8,6,null,null,null,null,null,null,null,1]
[{"$f":"IF(E39=\"\",\"\",SUBTOTAL(3,$E$16:E39))","v":24},{"$f":"COUNTIF($F$16:F39,F39)","v":24},"103/5","2012/1/20","محمد مهران علي ساجت","الاول - أ","ذكر","الاول",18,5,6,null,null,null,null,null,null,null,1]
[{"$f":"IF(E40=\"\",\"\",SUBTOTAL(3,$E$16:E40))","v":25},{"$f":"COUNTIF($F$16:F40,F40)","v":25},"354/4","2010/4/4","يوسف حامد ارحيم كريم","الاول - أ","ذكر","الاول",4,3,8,null,null,null,null,null,null,null,1]
{"$rows_left_out":619}
{"sheet":"خرائط جلوس","index":1,"n_rows":28,"n_cols":13,"rows_kept":28,"cut":false,"hidden":false,"merged":[]}
[]
[]
[]
[null,null,"ت","الرابع","ت","الخامس","ت","السادس","ت","الرابع",null,null,"الرابع"]
[null,null,359,{"$f":"IFERROR(INDEX('بيانات التلاميذ'!$E$16:$E$658,SMALL(IF('بيانات التلاميذ'!$H$16:$H$658=$D$4,IF('بيانات التلاميذ'!$A$16:$A$658=$C5,ROW($H$16:$H$658)-ROW($H$16)+1)),ROWS($D$5:D5))),\"\")","v":"ابراهيم عبد القادر كريم عطشان"},490,{"$f":"IFERROR(INDEX('بيانات التلاميذ'!$E$16:$E$658,SMALL(IF('بيانات التلاميذ'!$H$16:$H$658=$F$4,IF('بيانات التلاميذ'!$A$16:$A$658=$E5,ROW($H$16:$H$658)-ROW($H$16)+1)),ROWS($D$5:F5))),\"\")","v":"علي رياض حسين كامل"},639,{"$f":"IFERROR(INDEX('بيانات التلاميذ'!$E$16:$E$658,SMALL(IF('بيانات التلاميذ'!$H$16:$H$658=$H$4,IF('بيانات التلاميذ'!$A$16:$A$658=$G5,ROW($H$16:$H$658)-ROW($H$16)+1)),ROWS($D$5:H5))),\"\")","v":"نرجس علي صالح غاوي"},371,{"$f":"IFERROR(INDEX('بيانات التلاميذ'!$E$16:$E$658,SMALL(IF('بيانات التلاميذ'!$H$16:$H$658=$J$4,IF('بيانات التلاميذ'!$A$16:$A$658=$I5,ROW($H$16:$H$658)-ROW($H$16)+1)),ROWS($D$5:J5))),\"\")","v":"حسن شناوه بلبول جبل"},null,null,"الخامس"]
[null,null,null,{"$f":"IFERROR(INDEX('بيانات التلاميذ'!$E$16:$E$658,SMALL(IF('بيانات التلاميذ'!$H$16:$H$658=$D$4,IF('بيانات التلاميذ'!$A$16:$A$658=$C6,ROW($H$16:$H$658)-ROW($H$16)+1)),ROWS($D$5:D6))),\"\")","v":""},null,{"$f":"IFERROR(INDEX('بيانات التلاميذ'!$E$16:$E$658,SMALL(IF('بيانات التلاميذ'!$H$16:$H$658=$F$4,IF('بيانات التلاميذ'!$A$16:$A$658=$E6,ROW($H$16:$H$658)-ROW($H$16)+1)),ROWS($D$5:F6))),\"\")","v":""},null,{"$f":"IFERROR(INDEX('بيانات التلاميذ'!$E$16:$E$658,SMALL(IF('بيانات التلاميذ'!$H$16:$H$658=$H$4,IF('بيانات التلاميذ'!$A$16:$A$658=$G6,ROW($H$16:$H$658)-ROW($H$16)+1)),ROWS($D$5:H6))),\"\")","v":""},null,{"$f":"IFERROR(INDEX('بيانات التلاميذ'!$E$16:$E$658,SMALL(IF('بيانات التلاميذ'!$H$16:$H$658=$J$4,IF('بيانات التلاميذ'!$A$16:$A$658=$I6,ROW($H$16:$H$658)-ROW($H$16)+1)),ROWS($D$5:J6))),\"\")","v":""},null,null,"السادس"]
[null,null,null,{"$f":"IFERROR(INDEX('بيانات التلاميذ'!$E$16:$E$658,SMALL(IF('بيانات التلاميذ'!$H$16:$H$658=$D$4,IF('بيانات التلاميذ'!$A$16:$A$658=$C7,ROW($H$16:$H$658)-ROW($H$16)+1)),ROWS($D$5:D7))),\"\")","v":""},null,{"$f":"IFERROR(INDEX('بيانات التلاميذ'!$E$16:$E$658,SMALL(IF('بيانات التلاميذ'!$H$16:$H$658=$F$4,IF('بيانات التلاميذ'!$A$16:$A$658=$E7,ROW($H$16:$H$658)-ROW($H$16)+1)),ROWS($D$5:F7))),\"\")","v":""},null,{"$f":"IFERROR(INDEX('بيانات التلاميذ'!$E$16:$E$658,SMALL(IF('بيانات التلاميذ'!$H$16:$H$658=$H$4,IF('بيانات التلاميذ'!$A$16:$A$658=$G7,ROW($H$16:$H$658)-ROW($H$16)+1)),ROWS($D$5:H7))),\"\")","v":""},null,{"$f":"IFERROR(INDEX('بيانات التلاميذ'!$E$16:$E$658,SMALL(IF('بيانات التلاميذ'!$H$16:$H$658=$J$4,IF('بيانات التلاميذ'!$A$16:$A$658=$I7,ROW($H$16:$H$658)-ROW($H$16)+1)),ROWS($D$5:J7))),\"\")","v":""}]
[null,null,null,{"$f":"IFERROR(INDEX('بيانات التلاميذ'!$E$16:$E$658,SMALL(IF('بيانات التلاميذ'!$H$16:$H$658=$D$4,IF('بيانات التلاميذ'!$A$16:$A$658=$C8,ROW($H$16:$H$658)-ROW($H$16)+1)),ROWS($D$5:D8))),\"\")","v":""},null,{"$f":"IFERROR(INDEX('بيانات التلاميذ'!$E$16:$E$658,SMALL(IF('بيانات التلاميذ'!$H$16:$H$658=$F$4,IF('بيانات التلاميذ'!$A$16:$A$658=$E8,ROW($H$16:$H$658)-ROW($H$16)+1)),ROWS($D$5:F8))),\"\")","v":""},null,{"$f":"IFERROR(INDEX('بيانات التلاميذ'!$E$16:$E$658,SMALL(IF('بيانات التلاميذ'!$H$16:$H$658=$H$4,IF('بيانات التلاميذ'!$A$16:$A$658=$G8,ROW($H$16:$H$658)-ROW($H$16)+1)),ROWS($D$5:H8))),\"\")","v":""},null,{"$f":"IFERROR(INDEX('بيانات التلاميذ'!$E$16:$E$658,SMALL(IF('بيانات التلاميذ'!$H$16:$H$658=$J$4,IF('بيانات التلاميذ'!$A$16:$A$658=$I8,ROW($H$16:$H$658)-ROW($H$16)+1)),ROWS($D$5:J8))),\"\")","v":""}]
[null,null,null,{"$f":"IFERROR(INDEX('بيانات التلاميذ'!$E$16:$E$658,SMALL(IF('بيانات التلاميذ'!$H$16:$H$658=$D$4,IF('بيانات التلاميذ'!$A$16:$A$658=$C9,ROW($H$16:$H$658)-ROW($H$16)+1)),ROWS($D$5:D9))),\"\")","v":""},null,{"$f":"IFERROR(INDEX('بيانات التلاميذ'!$E$16:$E$658,SMALL(IF('بيانات التلاميذ'!$H$16:$H$658=$F$4,IF('بيانات التلاميذ'!$A$16:$A$658=$E9,ROW($H$16:$H$658)-ROW($H$16)+1)),ROWS($D$5:F9))),\"\")","v":""},null,{"$f":"IFERROR(INDEX('بيانات التلاميذ'!$E$16:$E$658,SMALL(IF('بيانات التلاميذ'!$H$16:$H$658=$H$4,IF('بيانات التلاميذ'!$A$16:$A$658=$G9,ROW($H$16:$H$658)-ROW($H$16)+1)),ROWS($D$5:H9))),\"\")","v":""},null,{"$f":"IFERROR(INDEX('بيانات التلاميذ'!$E$16:$E$658,SMALL(IF('بيانات التلاميذ'!$H$16:$H$658=$J$4,IF('بيانات التلاميذ'!$A$16:$A$658=$I9,ROW($H$16:$H$658)-ROW($H$16)+1)),ROWS($D$5:J9))),\"\")","v":""}]
[null,null,null,{"$f":"IFERROR(INDEX('بيانات التلاميذ'!$E$16:$E$658,SMALL(IF('بيانات التلاميذ'!$H$16:$H$658=$D$4,IF('بيانات التلاميذ'!$A$16:$A$658=$C10,ROW($H$16:$H$658)-ROW($H$16)+1)),ROWS($D$5:D10))),\"\")","v":""},null,{"$f":"IFERROR(INDEX('بيانات التلاميذ'!$E$16:$E$658,SMALL(IF('بيانات التلاميذ'!$H$16:$H$658=$F$4,IF('بيانات التلاميذ'!$A$16:$A$658=$E10,ROW($H$16:$H$658)-ROW($H$16)+1)),ROWS($D$5:F10))),\"\")","v":""},null,{"$f":"IFERROR(INDEX('بيانات التلاميذ'!$E$16:$E$658,SMALL(IF('بيانات التلاميذ'!$H$16:$H$658=$H$4,IF('بيانات التلاميذ'!$A$16:$A$658=$G10,ROW($H$16:$H$658)-ROW($H$16)+1)),ROWS($D$5:H10))),\"\")","v":""},null,{"$f":"IFERROR(INDEX('بيانات التلاميذ'!$E$16:$E$658,SMALL(IF('بيانات التلاميذ'!$H$16:$H$658=$J$4,IF('بيانات التلاميذ'!$A$16:$A$658=$I10,ROW($H$16:$H$658)-ROW($H$16)+1)),ROWS($D$5:J10))),\"\")","v":""}]
[null,null,null,{"$f":"IFERROR(INDEX('بيانات التلاميذ'!$E$16:$E$658,SMALL(IF('بيانات التلاميذ'!$H$16:$H$658=$D$4,IF('بيانات التلاميذ'!$A$16:$A$658=$C11,ROW($H$16:$H$658)-ROW($H$16)+1)),ROWS($D$5:D11))),\"\")","v":""},null,{"$f":"IFERROR(INDEX('بيانات التلاميذ'!$E$16:$E$658,SMALL(IF('بيانات التلاميذ'!$H$16:$H$658=$F$4,IF('بيانات التلاميذ'!$A$16:$A$658=$E11,ROW($H$16:$H$658)-ROW($H$16)+1)),ROWS($D$5:F11))),\"\")","v":""},null,{"$f":"IFERROR(INDEX('بيانات التلاميذ'!$E$16:$E$658,SMALL(IF('بيانات التلاميذ'!$H$16:$H$658=$H$4,IF('بيانات التلاميذ'!$A$16:$A$658=$G11,ROW($H$16:$H$658)-ROW($H$16)+1)),ROWS($D$5:H11))),\"\")","v":""},null,{"$f":"IFERROR(INDEX('بيانات التلاميذ'!$E$16:$E$658,SMALL(IF('بيانات التلاميذ'!$H$16:$H$658=$J$4,IF('بيانات التلاميذ'!$A$16:$A$658=$I11,ROW($H$16:$H$658)-ROW($H$16)+1)),ROWS($D$5:J11))),\"\")","v":""}]
[null,null,null,{"$f":"IFERROR(INDEX('بيانات التلاميذ'!$E$16:$E$658,SMALL(IF('بيانات التلاميذ'!$H$16:$H$658=$D$4,IF('بيانات التلاميذ'!$A$16:$A$658=$C12,ROW($H$16:$H$658)-ROW($H$16)+1)),ROWS($D$5:D12))),\"\")","v":""},null,{"$f":"IFERROR(INDEX('بيانات التلاميذ'!$E$16:$E$658,SMALL(IF('بيانات التلاميذ'!$H$16:$H$658=$F$4,IF('بيانات التلاميذ'!$A$16:$A$658=$E12,ROW($H$16:$H$658)-ROW($H$16)+1)),ROWS($D$5:F12))),\"\")","v":""},null,{"$f":"IFERROR(INDEX('بيانات التلاميذ'!$E$16:$E$658,SMALL(IF('بيانات التلاميذ'!$H$16:$H$658=$H$4,IF('بيانات التلاميذ'!$A$16:$A$658=$G12,ROW($H$16:$H$658)-ROW($H$16)+1)),ROWS($D$5:H12))),\"\")","v":""},null,{"$f":"IFERROR(INDEX('بيانات التلاميذ'!$E$16:$E$658,SMALL(IF('بيانات التلاميذ'!$H$16:$H$658=$J$4,IF('بيانات التلاميذ'!$A$16:$A$658=$I12,ROW($H$16:$H$658)-ROW($H$16)+1)),ROWS($D$5:J12))),\"\")","v":""}]
[null,null,null,{"$f":"IFERROR(INDEX('بيانات التلاميذ'!$E$16:$E$658,SMALL(IF('بيانات التلاميذ'!$H$16:$H$658=$D$4,IF('بيانات التلاميذ'!$A$16:$A$658=$C13,ROW($H$16:$H$658)-ROW($H$16)+1)),ROWS($D$5:D13))),\"\")","v":""},null,{"$f":"IFERROR(INDEX('بيانات التلاميذ'!$E$16:$E$658,SMALL(IF('بيانات التلاميذ'!$H$16:$H$658=$F$4,IF('بيانات التلاميذ'!$A$16:$A$658=$E13,ROW($H$16:$H$658)-ROW($H$16)+1)),ROWS($D$5:F13))),\"\")","v":""},null,{"$f":"IFERROR(INDEX('بيانات التلاميذ'!$E$16:$E$658,SMALL(IF('بيانات التلاميذ'!$H$16:$H$658=$H$4,IF('بيانات التلاميذ'!$A$16:$A$658=$G13,ROW($H$16:$H$658)-ROW($H$16)+1)),ROWS($D$5:H13))),\"\")","v":""},null,{"$f":"IFERROR(INDEX('بيانات التلاميذ'!$E$16:$E$658,SMALL(IF('بيانات التلاميذ'!$H$16:$H$658=$J$4,IF('بيانات التلاميذ'!$A$16:$A$658=$I13,ROW($H$16:$H$658)-ROW($H$16)+1)),ROWS($D$5:J13))),\"\")","v":""}]
[null,null,null,{"$f":"IFERROR(INDEX('بيانات التلاميذ'!$E$16:$E$658,SMALL(IF('بيانات التلاميذ'!$H$16:$H$658=$D$4,IF('بيانات التلاميذ'!$A$16:$A$658=$C14,ROW($H$16:$H$658)-ROW($H$16)+1)),ROWS($D$5:D14))),\"\")","v":""},null,{"$f":"IFERROR(INDEX('بيانات التلاميذ'!$E$16:$E$658,SMALL(IF('بيانات التلاميذ'!$H$16:$H$658=$F$4,IF('بيانات التلاميذ'!$A$16:$A$658=$E14,ROW($H$16:$H$658)-ROW($H$16)+1)),ROWS($D$5:F14))),\"\")","v":""},null,{"$f":"IFERROR(INDEX('بيانات التلاميذ'!$E$16:$E$658,SMALL(IF('بيانات التلاميذ'!$H$16:$H$658=$H$4,IF('بيانات التلاميذ'!$A$16:$A$658=$G14,ROW($H$16:$H$658)-ROW($H$16)+1)),ROWS($D$5:H14))),\"\")","v":""},null,{"$f":"IFERROR(INDEX('بيانات التلاميذ'!$E$16:$E$658,SMALL(IF('بيانات التلاميذ'!$H$16:$H$658=$J$4,IF('بيانات التلاميذ'!$A$16:$A$658=$I14,ROW($H$16:$H$658)-ROW($H$16)+1)),ROWS($D$5:J14))),\"\")","v":""}]
[null,null,null,null,null,{"$f":"IFERROR(INDEX('بيانات التلاميذ'!$E$16:$E$658,SMALL(IF('بيانات التلاميذ'!$H$16:$H$658=$F$4,IF('بيانات التلاميذ'!$A$16:$A$658=$E15,ROW($H$16:$H$658)-ROW($H$16)+1)),ROWS($D$5:F15))),\"\")","v":""},null,{"$f":"IFERROR(INDEX('بيانات التلاميذ'!$E$16:$E$658,SMALL(IF('بيانات التلاميذ'!$H$16:$H$658=$H$4,IF('بيانات التلاميذ'!$A$16:$A$658=$G15,ROW($H$16:$H$658)-ROW($H$16)+1)),ROWS($D$5:H15))),\"\")","v":""},null,{"$f":"IFERROR(INDEX('بيانات التلاميذ'!$E$16:$E$658,SMALL(IF('بيانات التلاميذ'!$H$16:$H$658=$J$4,IF('بيانات التلاميذ'!$A$16:$A$658=$I15,ROW($H$16:$H$658)-ROW($H$16)+1)),ROWS($D$5:J15))),\"\")","v":""}]
[null,null,null,null,null,{"$f":"IFERROR(INDEX('بيانات التلاميذ'!$E$16:$E$658,SMALL(IF('بيانات التلاميذ'!$H$16:$H$658=$F$4,IF('بيانات التلاميذ'!$A$16:$A$658=$E16,ROW($H$16:$H$658)-ROW($H$16)+1)),ROWS($D$5:F16))),\"\")","v":""},null,{"$f":"IFERROR(INDEX('بيانات التلاميذ'!$E$16:$E$658,SMALL(IF('بيانات التلاميذ'!$H$16:$H$658=$H$4,IF('بيانات التلاميذ'!$A$16:$A$658=$G16,ROW($H$16:$H$658)-ROW($H$16)+1)),ROWS($D$5:H16))),\"\")","v":""},null,{"$f":"IFERROR(INDEX('بيانات التلاميذ'!$E$16:$E$658,SMALL(IF('بيانات التلاميذ'!$H$16:$H$658=$J$4,IF('بيانات التلاميذ'!$A$16:$A$658=$I16,ROW($H$16:$H$658)-ROW($H$16)+1)),ROWS($D$5:J16))),\"\")","v":""}]
[null,null,null,null,null,{"$f":"IFERROR(INDEX('بيانات التلاميذ'!$E$16:$E$658,SMALL(IF('بيانات التلاميذ'!$H$16:$H$658=$F$4,IF('بيانات التلاميذ'!$A$16:$A$658=$E17,ROW($H$16:$H$658)-ROW($H$16)+1)),ROWS($D$5:F17))),\"\")","v":""},null,{"$f":"IFERROR(INDEX('بيانات التلاميذ'!$E$16:$E$658,SMALL(IF('بيانات التلاميذ'!$H$16:$H$658=$H$4,IF('بيانات التلاميذ'!$A$16:$A$658=$G17,ROW($H$16:$H$658)-ROW($H$16)+1)),ROWS($D$5:H17))),\"\")","v":""},null,{"$f":"IFERROR(INDEX('بيانات التلاميذ'!$E$16:$E$658,SMALL(IF('بيانات التلاميذ'!$H$16:$H$658=$J$4,IF('بيانات التلاميذ'!$A$16:$A$658=$I17,ROW($H$16:$H$658)-ROW($H$16)+1)),ROWS($D$5:J17))),\"\")","v":""}]
[null,null,null,null,null,{"$f":"IFERROR(INDEX('بيانات التلاميذ'!$E$16:$E$658,SMALL(IF('بيانات التلاميذ'!$H$16:$H$658=$F$4,IF('بيانات التلاميذ'!$A$16:$A$658=$E18,ROW($H$16:$H$658)-ROW($H$16)+1)),ROWS($D$5:F18))),\"\")","v":""},null,{"$f":"IFERROR(INDEX('بيانات التلاميذ'!$E$16:$E$658,SMALL(IF('بيانات التلاميذ'!$H$16:$H$658=$H$4,IF('بيانات التلاميذ'!$A$16:$A$658=$G18,ROW($H$16:$H$658)-ROW($H$16)+1)),ROWS($D$5:H18))),\"\")","v":""},null,{"$f":"IFERROR(INDEX('بيانات التلاميذ'!$E$16:$E$658,SMALL(IF('بيانات التلاميذ'!$H$16:$H$658=$J$4,IF('بيانات التلاميذ'!$A$16:$A$658=$I18,ROW($H$16:$H$658)-ROW($H$16)+1)),ROWS($D$5:J18))),\"\")","v":""}]
[null,null,null,null,null,{"$f":"IFERROR(INDEX('بيانات التلاميذ'!$E$16:$E$658,SMALL(IF('بيانات التلاميذ'!$H$16:$H$658=$F$4,IF('بيانات التلاميذ'!$A$16:$A$658=$E19,ROW($H$16:$H$658)-ROW($H$16)+1)),ROWS($D$5:F19))),\"\")","v":""},null,{"$f":"IFERROR(INDEX('بيانات التلاميذ'!$E$16:$E$658,SMALL(IF('بيانات التلاميذ'!$H$16:$H$658=$H$4,IF('بيانات التلاميذ'!$A$16:$A$658=$G19,ROW($H$16:$H$658)-ROW($H$16)+1)),ROWS($D$5:H19))),\"\")","v":""},null,{"$f":"IFERROR(INDEX('بيانات التلاميذ'!$E$16:$E$658,SMALL(IF('بيانات التلاميذ'!$H$16:$H$658=$J$4,IF('بيانات التلاميذ'!$A$16:$A$658=$I19,ROW($H$16:$H$658)-ROW($H$16)+1)),ROWS($D$5:J19))),\"\")","v":""}]
[null,null,null,null,null,{"$f":"IFERROR(INDEX('بيانات التلاميذ'!$E$16:$E$658,SMALL(IF('بيانات التلاميذ'!$H$16:$H$658=$F$4,IF('بيانات التلاميذ'!$A$16:$A$658=$E20,ROW($H$16:$H$658)-ROW($H$16)+1)),ROWS($D$5:F20))),\"\")","v":""},null,null,null,{"$f":"IFERROR(INDEX('بيانات التلاميذ'!$E$16:$E$658,SMALL(IF('بيانات التلاميذ'!$H$16:$H$658=$J$4,IF('بيانات التلاميذ'!$A$16:$A$658=$I20,ROW($H$16:$H$658)-ROW($H$16)+1)),ROWS($D$5:J20))),\"\")","v":""}]
[null,null,null,null,null,{"$f":"IFERROR(INDEX('بيانات التلاميذ'!$E$16:$E$658,SMALL(IF('بيانات التلاميذ'!$H$16:$H$658=$F$4,IF('بيانات التلاميذ'!$A$16:$A$658=$E21,ROW($H$16:$H$658)-ROW($H$16)+1)),ROWS($D$5:F21))),\"\")","v":""},null,null,null,{"$f":"IFERROR(INDEX('بيانات التلاميذ'!$E$16:$E$658,SMALL(IF('بيانات التلاميذ'!$H$16:$H$658=$J$4,IF('بيانات التلاميذ'!$A$16:$A$658=$I21,ROW($H$16:$H$658)-ROW($H$16)+1)),ROWS($D$5:J21))),\"\")","v":""}]
[null,null,null,null,null,{"$f":"IFERROR(INDEX('بيانات التلاميذ'!$E$16:$E$658,SMALL(IF('بيانات التلاميذ'!$H$16:$H$658=$F$4,IF('بيانات التلاميذ'!$A$16:$A$658=$E22,ROW($H$16:$H$658)-ROW($H$16)+1)),ROWS($D$5:F22))),\"\")","v":""},null,null,null,{"$f":"IFERROR(INDEX('بيانات التلاميذ'!$E$16:$E$658,SMALL(IF('بيانات التلاميذ'!$H$16:$H$658=$J$4,IF('بيانات التلاميذ'!$A$16:$A$658=$I22,ROW($H$16:$H$658)-ROW($H$16)+1)),ROWS($D$5:J22))),\"\")","v":""}]
[null,null,null,null,null,{"$f":"IFERROR(INDEX('بيانات التلاميذ'!$E$16:$E$658,SMALL(IF('بيانات التلاميذ'!$H$16:$H$658=$F$4,IF('بيانات التلاميذ'!$A$16:$A$658=$E23,ROW($H$16:$H$658)-ROW($H$16)+1)),ROWS($D$5:F23))),\"\")","v":""},null,null,null,{"$f":"IFERROR(INDEX('بيانات التلاميذ'!$E$16:$E$658,SMALL(IF('بيانات التلاميذ'!$H$16:$H$658=$J$4,IF('بيانات التلاميذ'!$A$16:$A$658=$I23,ROW($H$16:$H$658)-ROW($H$16)+1)),ROWS($D$5:J23))),\"\")","v":""}]
[null,null,null,null,null,{"$f":"IFERROR(INDEX('بيانات التلاميذ'!$E$16:$E$658,SMALL(IF('بيانات التلاميذ'!$H$16:$H$658=$F$4,IF('بيانات التلاميذ'!$A$16:$A$658=$E24,ROW($H$16:$H$658)-ROW($H$16)+1)),ROWS($D$5:F24))),\"\")","v":""},null,null,null,{"$f":"IFERROR(INDEX('بيانات التلاميذ'!$E$16:$E$658,SMALL(IF('بيانات التلاميذ'!$H$16:$H$658=$J$4,IF('بيانات التلاميذ'!$A$16:$A$658=$I24,ROW($H$16:$H$658)-ROW($H$16)+1)),ROWS($D$5:J24))),\"\")","v":""}]
[null,null,null,null,null,{"$f":"IFERROR(INDEX('بيانات التلاميذ'!$E$16:$E$658,SMALL(IF('بيانات التلاميذ'!$H$16:$H$658=$F$4,IF('بيانات التلاميذ'!$A$16:$A$658=$E25,ROW($H$16:$H$658)-ROW($H$16)+1)),ROWS($D$5:F25))),\"\")","v":""},null,null,null,{"$f":"IFERROR(INDEX('بيانات التلاميذ'!$E$16:$E$658,SMALL(IF('بيانات التلاميذ'!$H$16:$H$658=$J$4,IF('بيانات التلاميذ'!$A$16:$A$658=$I25,ROW($H$16:$H$658)-ROW($H$16)+1)),ROWS($D$5:J25))),\"\")","v":""}]
[null,null,null,null,null,{"$f":"IFERROR(INDEX('بيانات التلاميذ'!$E$16:$E$658,SMALL(IF('بيانات التلاميذ'!$H$16:$H$658=$F$4,IF('بيانات التلاميذ'!$A$16:$A$658=$E26,ROW($H$16:$H$658)-ROW($H$16)+1)),ROWS($D$5:F26))),\"\")","v":""},null,null,null,{"$f":"IFERROR(INDEX('بيانات التلاميذ'!$E$16:$E$658,SMALL(IF('بيانات التلاميذ'!$H$16:$H$658=$J$4,IF('بيانات التلاميذ'!$A$16:$A$658=$I26,ROW($H$16:$H$658)-ROW($H$16)+1)),ROWS($D$5:J26))),\"\")","v":""}]
[null,null,null,null,null,{"$f":"IFERROR(INDEX('بيانات التلاميذ'!$E$16:$E$658,SMALL(IF('بيانات التلاميذ'!$H$16:$H$658=$F$4,IF('بيانات التلاميذ'!$A$16:$A$658=$E27,ROW($H$16:$H$658)-ROW($H$16)+1)),ROWS($D$5:F27))),\"\")","v":""},null,null,null,{"$f":"IFERROR(INDEX('بيانات التلاميذ'!$E$16:$E$658,SMALL(IF('بيانات التلاميذ'!$H$16:$H$658=$J$4,IF('بيانات التلاميذ'!$A$16:$A$658=$I27,ROW($H$16:$H$658)-ROW($H$16)+1)),ROWS($D$5:J27))),\"\")","v":""}]
[null,null,null,null,null,null,null,null,null,{"$f":"IFERROR(INDEX('بيانات التلاميذ'!$E$16:$E$658,SMALL(IF('بيانات التلاميذ'!$H$16:$H$658=$J$4,IF('بيانات التلاميذ'!$A$16:$A$658=$I28,ROW($H$16:$H$658)-ROW($H$16)+1)),ROWS($D$5:J28))),\"\")","v":""}]