{"text_format":"1","workbook":"xlsx","n_sheets":2,"sheets":["Data","SERCH"],"not_rendered":{"charts":0,"images":2,"macros":1,"external_links":1,"defined_names":5,"comments":0,"pivot_tables":0},"unopened":[],"bounds":{"document_bytes":16777216,"sheet_cells":100000,"rows_first":2000,"rows_last":500,"rows_between":2000,"halvings":0,"cell_chars":16384,"cell_head_chars":4096},"cells_cut":0,"cells_raw":0,"read":"whole","date_system":"1900"}

{"sheet":"Data","index":0,"n_rows":41,"n_cols":255,"rows_kept":41,"cut":false,"hidden":false,"merged":[[5,7,6,7],[5,9,5,10],[1,0,1,13],[2,0,2,13],[3,0,3,1],[3,2,3,3],[3,11,3,12]]}
[1,2,3,4,5,6,7,8,9,10,11,12,13,14,15,16,17]
["شركة خدمات للسيارات"]
[]
[]
["م","عمود2","عمود4","عمود5","عمود6","عمود7","عمود8","عمود9","عمود10","عمود11","عمود12","عمود13","عمود14","عمود15","عمود16","عمود17","عمود18","عمود19","عمود20","عمود21","عمود22","عمود23","عمود24","عمود25","عمود26","عمود27","عمود28","عمود29","عمود30","عمود31","عمود32","عمود33","عمود34","عمود35","عمود36","عمود37","عمود38","عمود39","عمود40","عمود41","عمود42","عمود43","عمود44","عمود45","عمود46","عمود47","عمود48","عمود49","عمود50","عمود51","عمود52","عمود53","عمود54","عمود55","عمود56","عمود57","عمود58","عمود59","عمود60","عمود61","عمود62","عمود63","عمود64","عمود65","عمود66","عمود67","عمود68","عمود69","عمود70","عمود71","عمود72","عمود73","عمود74","عمود75","عمود76","عمود77","عمود78","عمود79","عمود80","عمود81","عمود82","عمود83","عمود84","عمود85","عمود86","عمود87","عمود88","عمود89","عمود90","عمود91","عمود92","عمود93","عمود94","عمود95","عمود96","عمود97","عمود98","عمود99","عمود100","عمود101","عمود102","عمود103","عمود104","عمود105","عمود106","عمود107","عمود108","عمود109","عمود110","عمود111","عمود112","عمود113","عمود114","عمود115","عمود116","عمود117","عمود118","عمود119","عمود120","عمود121","عمود122","عمود123","عمود124","عمود125","عمود126","عمود127","عمود128","عمود129","عمود130","عمود131","عمود132","عمود133","عمود134","عمود135","عمود136","عمود137","عمود138","عمود139","عمود140","عمود141","عمود142","عمود143","عمود144","عمود145","عمود146","عمود147","عمود148","عمود149","عمود150","عمود151","عمود152","عمود153","عمود154","عمود155","عمود156","عمود157","عمود158","عمود159","عمود160","عمود161","عمود162","عمود163","عمود164","عمود165","عمود166","عمود167","عمود168","عمود169","عمود170","عمود171","عمود172","عمود173","عمود174","عمود175","عمود176","عمود177","عمود178","عمود179","عمود180","عمود181","عمود182","عمود183","عمود184","عمود185","عمود186","عمود187","عمود188","عمود189","عمود190","عمود191","عمود192","عمود193","عمود194","عمود195","عمود196","عمود197","عمود198","عمود199","عمود200","عمود201","عمود202","عمود203","عمود204","عمود205","عمود206","عمود207","عمود208","عمود209","عمود210","عمود211","عمود212","عمود213","عمود214","عمود215","عمود216","عمود217","عمود218","عمود219","عمود220","عمود221","عمود222","عمود223","عمود224","عمود225","عمود226","عمود227","عمود228","عمود229","عمود230","عمود231","عمود232","عمود233","عمود234","عمود235","عمود236","عمود237","عمود238","عمود239","عمود240","عمود241","عمود242","عمود243","عمود244","عمود245","عمود246","عمود247","عمود248","عمود249","عمود250","عمود251","عمود252","عمود253","عمود254","عمود255","عمود256"]
["م","Bilnumret","företag ","tjänsten","DATUM",null,"Antal"," Priset för tjänsten","Totalt ","MOMS",null,"den totala",null,"ملاحظـــات"]
[null,"رقم السيارة","الشركة","الخدمة","التاريخ",null,"العدد",null,"المجموع","Procent","värde","المجموع"]
[1,"DXV-54","VOLVO","غسيل داخل و خارج","2016-05-02",null,1,299,{"$f":"G8*H8","v":299},0.25,{"$f":"J8*I8","v":74.75},{"$f":"SUM(I8+K8)","v":373.75}]
[{"$f":"A8+1","v":2},"GVB-215","FAST","تغير عجل","2017-10-14",null,2,150,{"$f":"G9*H9","v":300},0.25,{"$f":"J9*I9","v":75},{"$f":"SUM(I9+K9)","v":375}]
[3,"DGT-325","FAST","غسيل داخل و خارج","2017-10-18",null,3,379,1137,0.25,{"$f":"J10*I10","v":284.25},1421.25]
[4,"JKY-876","FAST","تغير زيت","2018-01-04",null,4,200,800,0.25,{"$f":"J11*I11","v":200},1000]
[5,"DXV-543","VOLVO","تلميع السيارة","2018-02-03",null,5,600,3000,0.25,750,3750]
[6,"MRS-254","VOLVO","غسيل داخل و خارج","2018-03-04",null,6,299,1794,0.25,448.5,2242.5]
[{"$f":"A13+1","v":7},"VCB-635","VOLVO","غسيل داخل و خارج","2018-03-07",null,7,299,2093,0.25,523.25,2616.25]
[8,"DNC-587","VOLVO","غسيل داخل و خارج","2018-04-14",null,8,299,2392,0.25,598,2990]
[9,"KOY-632","VOLVO","غسيل داخل و خارج","2018-05-17",null,9,299,2691,0.25,672.75,3363.75]
[10,"UIB-554","VOLVO","تغير زيت","2018-06-22",null,10,200,2000,null,0,2000]
[11,null,null,null,null,null,null,null,0,null,0,0]
[12,null,null,null,null,null,null,null,0,null,0,0]
[null,null,null,null,null,null,null,null,0,null,0,0]
{"$rows_left_out":22}
{"sheet":"SERCH","index":1,"n_rows":64,"n_cols":23,"rows_kept":64,"cut":false,"hidden":false,"merged":[[5,0,5,14],[6,0,6,14],[7,3,7,4],[7,12,7,13],[12,0,13,0],[12,1,13,1],[7,0,7,2],[12,8,13,8],[9,0,9,3],[12,10,12,11]]}
[]
[]
[]
[]
[]
["الشركــة"]
["خدمات سيارات"]
[]
[]
["البحث  بكل العناوين اللي عندك",null,null,null,"V"]
[]
["ت",{"$f":"Data!A5","v":"م"},{"$f":"Data!B5","v":"عمود2"},{"$f":"Data!#REF!","v":{"$error":"#REF!"}},{"$f":"Data!C5","v":"عمود4"},{"$f":"Data!D5","v":"عمود5"},{"$f":"Data!E5","v":"عمود6"},{"$f":"Data!F5","v":"عمود7"},{"$f":"Data!G5","v":"عمود8"},{"$f":"Data!H5","v":"عمود9"},{"$f":"Data!I5","v":"عمود10"},{"$f":"Data!J5","v":"عمود11"},{"$f":"Data!K5","v":"عمود12"},{"$f":"Data!L5","v":"عمود13"},{"$f":"Data!M5","v":"عمود14"}]
["ت","تسلسل","Bilnumret","företag ","tjänsten","DATUM","Antal","Antal"," Priset för tjänsten","Totalt ","MOMS",null,"المجموع",null,"ملاحظـــات"]
[null,null,"رقم السيارة","الشركة","الخدمة","التاريخ","العدد","العدد",null,"المجموع","Procent","värde","den totala",null,null,null,null,null,null,null,"ترقيم الصفوف","إيجاد الصفوف","ترتيب الصفوف"]
[{"$f":"IF(B15=\"\",\"\",1)","v":1},{"$f":"IFERROR(INDEX(Data!$A$8:$O$40,SERCH!$W15,COLUMNS(Data!$B$8:B8)),\"\")","v":1},{"$f":"IFERROR(INDEX(Data!$A$8:$O$40,SERCH!$W15,COLUMNS(Data!$B$8:C8)),\"\")","v":"DXV-54"},{"$f":"IFERROR(INDEX(Data!$A$8:$O$40,SERCH!$W15,COLUMNS(Data!$B$8:D8)),\"\")","v":"VOLVO"},{"$f":"IFERROR(INDEX(Data!$A$8:$O$40,SERCH!$W15,COLUMNS(Data!$B$8:E8)),\"\")","v":"غسيل داخل و خارج"},{"$f":"IFERROR(INDEX(Data!$A$8:$O$40,SERCH!$W15,COLUMNS(Data!$B$8:F8)),\"\")","v":"2016-05-02"},{"$f":"IFERROR(INDEX(Data!$A$8:$O$40,SERCH!$W15,COLUMNS(Data!$B$8:G8)),\"\")","v":0},{"$f":"IFERROR(INDEX(Data!$A$8:$O$40,SERCH!$W15,COLUMNS(Data!$B$8:H8)),\"\")","v":1},{"$f":"IFERROR(INDEX(Data!$A$8:$O$40,SERCH!$W15,COLUMNS(Data!$B$8:I8)),\"\")","v":299},{"$f":"IFERROR(INDEX(Data!$A$8:$O$40,SERCH!$W15,COLUMNS(Data!$B$8:J8)),\"\")","v":299},{"$f":"IFERROR(INDEX(Data!$A$8:$O$40,SERCH!$W15,COLUMNS(Data!$B$8:K8)),\"\")","v":0.25},{"$f":"IFERROR(INDEX(Data!$A$8:$O$40,SERCH!$W15,COLUMNS(Data!$B$8:L8)),\"\")","v":74.75},{"$f":"IFERROR(INDEX(Data!$A$8:$O$40,SERCH!$W15,COLUMNS(Data!$B$8:M8)),\"\")","v":373.75},null,{"$f":"IFERROR(INDEX(Data!$A$8:$O$40,SERCH!$W15,COLUMNS(Data!$B$8:O8)),\"\")","v":0},null,null,null,null,null,{"$f":"ROWS(Data!$B$8:B8)","v":1},{"$f":"IF(ISNUMBER(SEARCH($E$10,Data!B8&\" \"&Data!C8&\" \"&Data!D8&\" \"&Data!E8&\" \"&Data!F8&\" \"&Data!G8&\" \"&Data!H8&\" \"&Data!I8&\" \"&Data!J8&\" \"&Data!K8&\" \"&Data!L8&\" \"&Data!M8&\" \"&Data!N8)),U15,\"\")","v":1},{"$f":"IFERROR(SMALL(V15:V64,U15),\"\")","v":1}]
[{"$f":"IF(B16=\"\",\"\",A15+1)","v":2},{"$f":"IFERROR(INDEX(Data!$A$8:$O$40,SERCH!$W16,COLUMNS(Data!$B$8:B9)),\"\")","v":5},{"$f":"IFERROR(INDEX(Data!$A$8:$O$40,SERCH!$W16,COLUMNS(Data!$B$8:C9)),\"\")","v":"DXV-543"},{"$f":"IFERROR(INDEX(Data!$A$8:$O$40,SERCH!$W16,COLUMNS(Data!$B$8:D9)),\"\")","v":"VOLVO"},{"$f":"IFERROR(INDEX(Data!$A$8:$O$40,SERCH!$W16,COLUMNS(Data!$B$8:E9)),\"\")","v":"تلميع السيارة"},{"$f":"IFERROR(INDEX(Data!$A$8:$O$40,SERCH!$W16,COLUMNS(Data!$B$8:F9)),\"\")","v":"2018-02-03"},{"$f":"IFERROR(INDEX(Data!$A$8:$O$40,SERCH!$W16,COLUMNS(Data!$B$8:G9)),\"\")","v":0},{"$f":"IFERROR(INDEX(Data!$A$8:$O$40,SERCH!$W16,COLUMNS(Data!$B$8:H9)),\"\")","v":5},{"$f":"IFERROR(INDEX(Data!$A$8:$O$40,SERCH!$W16,COLUMNS(Data!$B$8:I9)),\"\")","v":600},{"$f":"IFERROR(INDEX(Data!$A$8:$O$40,SERCH!$W16,COLUMNS(Data!$B$8:J9)),\"\")","v":3000},{"$f":"IFERROR(INDEX(Data!$A$8:$O$40,SERCH!$W16,COLUMNS(Data!$B$8:K9)),\"\")","v":0.25},{"$f":"IFERROR(INDEX(Data!$A$8:$O$40,SERCH!$W16,COLUMNS(Data!$B$8:L9)),\"\")","v":750},{"$f":"IFERROR(INDEX(Data!$A$8:$O$40,SERCH!$W16,COLUMNS(Data!$B$8:M9)),\"\")","v":3750},{"$f":"IFERROR(INDEX(Data!$A$8:$O$40,SERCH!$W16,COLUMNS(Data!$B$8:N9)),\"\")","v":0},{"$f":"IFERROR(INDEX(Data!$A$8:$O$40,SERCH!$W16,COLUMNS(Data!$B$8:O9)),\"\")","v":0},null,null,null,null,null,{"$f":"ROWS(Data!$B$8:B9)","v":2},{"$f":"IF(ISNUMBER(SEARCH($E$10,Data!B9&\" \"&Data!C9&\" \"&Data!D9&\" \"&Data!E9&\" \"&Data!F9&\" \"&Data!G9&\" \"&Data!H9&\" \"&Data!I9&\" \"&Data!J9&\" \"&Data!K9&\" \"&Data!L9&\" \"&Data!M9&\" \"&Data!N9)),U16,\"\")","v":2},{"$f":"IFERROR(SMALL(V16:V65,U16),\"\")","v":5}]
[{"$f":"IF(B17=\"\",\"\",A16+1)","v":3},{"$f":"IFERROR(INDEX(Data!$A$8:$O$40,SERCH!$W17,COLUMNS(Data!$B$8:B10)),\"\")","v":7},{"$f":"IFERROR(INDEX(Data!$A$8:$O$40,SERCH!$W17,COLUMNS(Data!$B$8:C10)),\"\")","v":"VCB-635"},{"$f":"IFERROR(INDEX(Data!$A$8:$O$40,SERCH!$W17,COLUMNS(Data!$B$8:D10)),\"\")","v":"VOLVO"},{"$f":"IFERROR(INDEX(Data!$A$8:$O$40,SERCH!$W17,COLUMNS(Data!$B$8:E10)),\"\")","v":"غسيل داخل و خارج"},{"$f":"IFERROR(INDEX(Data!$A$8:$O$40,SERCH!$W17,COLUMNS(Data!$B$8:F10)),\"\")","v":"2018-03-07"},{"$f":"IFERROR(INDEX(Data!$A$8:$O$40,SERCH!$W17,COLUMNS(Data!$B$8:G10)),\"\")","v":0},{"$f":"IFERROR(INDEX(Data!$A$8:$O$40,SERCH!$W17,COLUMNS(Data!$B$8:H10)),\"\")","v":7},{"$f":"IFERROR(INDEX(Data!$A$8:$O$40,SERCH!$W17,COLUMNS(Data!$B$8:I10)),\"\")","v":299},{"$f":"IFERROR(INDEX(Data!$A$8:$O$40,SERCH!$W17,COLUMNS(Data!$B$8:J10)),\"\")","v":2093},{"$f":"IFERROR(INDEX(Data!$A$8:$O$40,SERCH!$W17,COLUMNS(Data!$B$8:K10)),\"\")","v":0.25},{"$f":"IFERROR(INDEX(Data!$A$8:$O$40,SERCH!$W17,COLUMNS(Data!$B$8:L10)),\"\")","v":523.25},{"$f":"IFERROR(INDEX(Data!$A$8:$O$40,SERCH!$W17,COLUMNS(Data!$B$8:M10)),\"\")","v":2616.25},{"$f":"IFERROR(INDEX(Data!$A$8:$O$40,SERCH!$W17,COLUMNS(Data!$B$8:N10)),\"\")","v":0},{"$f":"IFERROR(INDEX(Data!$A$8:$O$40,SERCH!$W17,COLUMNS(Data!$B$8:O10)),\"\")","v":0},{"$f":"IFERROR(INDEX(Data!$A$8:$O$40,SERCH!$W17,COLUMNS(Data!$B$8:P10)),\"\")","v":0},null,null,null,null,{"$f":"ROWS(Data!$B$8:B10)","v":3},{"$f":"IF(ISNUMBER(SEARCH($E$10,Data!B10&\" \"&Data!C10&\" \"&Data!D10&\" \"&Data!E10&\" \"&Data!F10&\" \"&Data!G10&\" \"&Data!H10&\" \"&Data!I10&\" \"&Data!J10&\" \"&Data!K10&\" \"&Data!L10&\" \"&Data!M10&\" \"&Data!N10)),U17,\"\")","v":""},7]
[4,{"$f":"IFERROR(INDEX(Data!$A$8:$O$40,SERCH!$W18,COLUMNS(Data!$B$8:B11)),\"\")","v":8},{"$f":"IFERROR(INDEX(Data!$A$8:$O$40,SERCH!$W18,COLUMNS(Data!$B$8:C11)),\"\")","v":"DNC-587"},{"$f":"IFERROR(INDEX(Data!$A$8:$O$40,SERCH!$W18,COLUMNS(Data!$B$8:D11)),\"\")","v":"VOLVO"},{"$f":"IFERROR(INDEX(Data!$A$8:$O$40,SERCH!$W18,COLUMNS(Data!$B$8:E11)),\"\")","v":"غسيل داخل و خارج"},{"$f":"IFERROR(INDEX(Data!$A$8:$O$40,SERCH!$W18,COLUMNS(Data!$B$8:F11)),\"\")","v":"2018-04-14"},{"$f":"IFERROR(INDEX(Data!$A$8:$O$40,SERCH!$W18,COLUMNS(Data!$B$8:G11)),\"\")","v":0},{"$f":"IFERROR(INDEX(Data!$A$8:$O$40,SERCH!$W18,COLUMNS(Data!$B$8:H11)),\"\")","v":8},{"$f":"IFERROR(INDEX(Data!$A$8:$O$40,SERCH!$W18,COLUMNS(Data!$B$8:I11)),\"\")","v":299},{"$f":"IFERROR(INDEX(Data!$A$8:$O$40,SERCH!$W18,COLUMNS(Data!$B$8:J11)),\"\")","v":2392},{"$f":"IFERROR(INDEX(Data!$A$8:$O$40,SERCH!$W18,COLUMNS(Data!$B$8:K11)),\"\")","v":0.25},{"$f":"IFERROR(INDEX(Data!$A$8:$O$40,SERCH!$W18,COLUMNS(Data!$B$8:L11)),\"\")","v":598},{"$f":"IFERROR(INDEX(Data!$A$8:$O$40,SERCH!$W18,COLUMNS(Data!$B$8:M11)),\"\")","v":2990},{"$f":"IFERROR(INDEX(Data!$A$8:$O$40,SERCH!$W18,COLUMNS(Data!$B$8:N11)),\"\")","v":0},{"$f":"IFERROR(INDEX(Data!$A$8:$O$40,SERCH!$W18,COLUMNS(Data!$B$8:O11)),\"\")","v":0},{"$f":"IFERROR(INDEX(Data!$A$8:$O$40,SERCH!$W18,COLUMNS(Data!$B$8:P11)),\"\")","v":0},null,null,null,null,{"$f":"ROWS(Data!$B$8:B11)","v":4},{"$f":"IF(ISNUMBER(SEARCH($E$10,Data!B11&\" \"&Data!C11&\" \"&Data!D11&\" \"&Data!E11&\" \"&Data!F11&\" \"&Data!G11&\" \"&Data!H11&\" \"&Data!I11&\" \"&Data!J11&\" \"&Data!K11&\" \"&Data!L11&\" \"&Data!M11&\" \"&Data!N11)),U18,\"\")","v":""},8]
[5,{"$f":"IFERROR(INDEX(Data!$A$8:$O$40,SERCH!$W19,COLUMNS(Data!$B$8:B12)),\"\")","v":9},{"$f":"IFERROR(INDEX(Data!$A$8:$O$40,SERCH!$W19,COLUMNS(Data!$B$8:C12)),\"\")","v":"KOY-632"},{"$f":"IFERROR(INDEX(Data!$A$8:$O$40,SERCH!$W19,COLUMNS(Data!$B$8:D12)),\"\")","v":"VOLVO"},{"$f":"IFERROR(INDEX(Data!$A$8:$O$40,SERCH!$W19,COLUMNS(Data!$B$8:E12)),\"\")","v":"غسيل داخل و خارج"},{"$f":"IFERROR(INDEX(Data!$A$8:$O$40,SERCH!$W19,COLUMNS(Data!$B$8:F12)),\"\")","v":"2018-05-17"},{"$f":"IFERROR(INDEX(Data!$A$8:$O$40,SERCH!$W19,COLUMNS(Data!$B$8:G12)),\"\")","v":0},{"$f":"IFERROR(INDEX(Data!$A$8:$O$40,SERCH!$W19,COLUMNS(Data!$B$8:H11)),\"\")","v":9},{"$f":"IFERROR(INDEX(Data!$A$8:$O$40,SERCH!$W19,COLUMNS(Data!$B$8:I12)),\"\")","v":299},{"$f":"IFERROR(INDEX(Data!$A$8:$O$40,SERCH!$W19,COLUMNS(Data!$B$8:J12)),\"\")","v":2691},{"$f":"IFERROR(INDEX(Data!$A$8:$O$40,SERCH!$W19,COLUMNS(Data!$B$8:K12)),\"\")","v":0.25},{"$f":"IFERROR(INDEX(Data!$A$8:$O$40,SERCH!$W19,COLUMNS(Data!$B$8:L12)),\"\")","v":672.75},{"$f":"IFERROR(INDEX(Data!$A$8:$O$40,SERCH!$W19,COLUMNS(Data!$B$8:M12)),\"\")","v":3363.75},{"$f":"IFERROR(INDEX(Data!$A$8:$O$40,SERCH!$W19,COLUMNS(Data!$B$8:N12)),\"\")","v":0},{"$f":"IFERROR(INDEX(Data!$A$8:$O$40,SERCH!$W19,COLUMNS(Data!$B$8:O12)),\"\")","v":0},{"$f":"IFERROR(INDEX(Data!$A$8:$O$40,SERCH!$W19,COLUMNS(Data!$B$8:P12)),\"\")","v":0},null,null,null,null,{"$f":"ROWS(Data!$B$8:B12)","v":5},{"$f":"IF(ISNUMBER(SEARCH($E$10,Data!B12&\" \"&Data!C12&\" \"&Data!D12&\" \"&Data!E12&\" \"&Data!F12&\" \"&Data!G12&\" \"&Data!H12&\" \"&Data!I12&\" \"&Data!J12&\" \"&Data!K12&\" \"&Data!L12&\" \"&Data!M12&\" \"&Data!N12)),U19,\"\")","v":5},9]
["",{"$f":"IFERROR(INDEX(Data!$A$8:$O$40,SERCH!$W20,COLUMNS(Data!$B$8:B13)),\"\")","v":""},{"$f":"IFERROR(INDEX(Data!$A$8:$O$40,SERCH!$W20,COLUMNS(Data!$B$8:C13)),\"\")","v":""},{"$f":"IFERROR(INDEX(Data!$A$8:$O$40,SERCH!$W20,COLUMNS(Data!$B$8:D13)),\"\")","v":""},{"$f":"IFERROR(INDEX(Data!$A$8:$O$40,SERCH!$W20,COLUMNS(Data!$B$8:E13)),\"\")","v":""},{"$f":"IFERROR(INDEX(Data!$A$8:$O$40,SERCH!$W20,COLUMNS(Data!$B$8:F13)),\"\")","v":""},{"$f":"IFERROR(INDEX(Data!$A$8:$O$40,SERCH!$W20,COLUMNS(Data!$B$8:G13)),\"\")","v":""},{"$f":"IFERROR(INDEX(Data!$A$8:$O$40,SERCH!$W20,COLUMNS(Data!$B$8:H13)),\"\")","v":""},{"$f":"IFERROR(INDEX(Data!$A$8:$O$40,SERCH!$W20,COLUMNS(Data!$B$8:I13)),\"\")","v":""},{"$f":"IFERROR(INDEX(Data!$A$8:$O$40,SERCH!$W20,COLUMNS(Data!$B$8:J13)),\"\")","v":""},{"$f":"IFERROR(INDEX(Data!$A$8:$O$40,SERCH!$W20,COLUMNS(Data!$B$8:K13)),\"\")","v":""},{"$f":"IFERROR(INDEX(Data!$A$8:$O$40,SERCH!$W20,COLUMNS(Data!$B$8:L13)),\"\")","v":""},{"$f":"IFERROR(INDEX(Data!$A$8:$O$40,SERCH!$W20,COLUMNS(Data!$B$8:M13)),\"\")","v":""},{"$f":"IFERROR(INDEX(Data!$A$8:$O$40,SERCH!$W20,COLUMNS(Data!$B$8:N13)),\"\")","v":""},{"$f":"IFERROR(INDEX(Data!$A$8:$O$40,SERCH!$W20,COLUMNS(Data!$B$8:O13)),\"\")","v":""},{"$f":"IFERROR(INDEX(Data!$A$8:$O$40,SERCH!$W20,COLUMNS(Data!$B$8:P13)),\"\")","v":""},null,null,null,null,{"$f":"ROWS(Data!$B$8:B13)","v":6},{"$f":"IF(ISNUMBER(SEARCH($E$10,Data!B13&\" \"&Data!C13&\" \"&Data!D13&\" \"&Data!E13&\" \"&Data!F13&\" \"&Data!G13&\" \"&Data!H13&\" \"&Data!I13&\" \"&Data!J13&\" \"&Data!K13&\" \"&Data!L13&\" \"&Data!M13&\" \"&Data!N13)),U20,\"\")","v":6},""]
{"$rows_left_out":44}