{"text_format":"1","workbook":"xlsx","n_sheets":17,"sheets":["الواجهة","الإشعارات","التقرير اليومي","غيابات التلاميذ","تعداد  التلاميذ","ALL","Single","الإشعار الأول","الإشعار الثاني","الإعذار","الشطب","إستدعاء","تعهد ولي التلميذ","تعهد تلميذ","اليومية","ورقة20","Salim"],"not_rendered":{"charts":0,"images":3,"macros":1,"external_links":2,"defined_names":24,"comments":1,"pivot_tables":0},"unopened":[],"bounds":{"document_bytes":16777216,"sheet_cells":100000,"rows_first":2000,"rows_last":500,"rows_between":2000,"halvings":0,"cell_chars":16384,"cell_head_chars":4096},"cells_cut":0,"cells_raw":0,"read":"whole","date_system":"1900"}

{"sheet":"الواجهة","index":0,"n_rows":519,"n_cols":148,"rows_kept":519,"cut":false,"hidden":false,"merged":[[71,0,71,1],[73,0,73,1],[74,0,74,1],[76,3,76,5],[7,6,7,7],[9,6,9,7],[15,6,15,7],[58,0,58,5],[63,0,63,1],[63,2,63,3],[65,1,65,2],[67,0,67,2],[69,0,69,1],[19,3,19,5],[49,0,49,3],[56,0,56,1],[56,3,56,5],[21,3,21,5],[22,3,22,5],[6,6,6,7],[1,1,1,6],[2,1,2,2],[2,6,2,8],[3,1,3,2],[4,1,4,2],[5,1,5,2]]}
[]
[]
[null,"المديريـة  ",null,"مديريـة التربيـة لولاية ",null,null,null,null,null,null,null,null,null,null,null,null,null,null,null,null,null,null,null,null,null,null,null,null,null,null,null,null,null,null,null,null,null,null,null,null,null,null,null,106]
[null,"المؤسســــــــــــة",null,"ثانويـــة الوادي",null,null,null,null,null,null,null,null,null,null,null,null,null,411]
[null,"البلديـــــــــــــــة",null,"الوادي"]
[null,"السنـــــة الدراسيـــــــــة",null,"2018/2017/"]
{"$rows_left_out":514}
{"sheet":"الإشعارات","index":1,"n_rows":0,"n_cols":0,"rows_kept":0,"cut":false,"hidden":false,"merged":[]}

{"sheet":"التقرير اليومي","index":2,"n_rows":56,"n_cols":35,"rows_kept":56,"cut":false,"hidden":false,"merged":[[2,2,2,5],[18,2,18,3],[4,2,4,5],[8,2,8,5],[15,2,15,3],[3,2,3,5],[55,1,55,17],[37,2,37,5],[46,2,46,6],[47,2,47,6],[17,2,17,3],[39,10,39,11],[42,4,42,5],[42,2,42,3],[41,14,41,16],[42,14,42,16],[41,10,41,11],[40,4,40,5],[41,4,41,5],[39,2,39,3],[39,4,39,5],[41,2,41,3],[0,19,0,26],[4,14,4,15],[5,23,5,24],[9,2,9,8],[15,13,15,15],[9,10,9,15],[14,13,14,15],[13,2,13,3],[14,2,14,3],[1,14,1,15],[3,18,5,19],[7,18,8,19],[0,1,0,17],[1,5,1,11],[12,2,12,3],[5,5,7,11],[10,13,10,15],[16,2,16,3],[3,12,3,13],[10,2,10,3],[3,14,3,15],[16,13,16,15],[13,13,13,15],[5,14,5,15],[6,14,6,15],[44,2,44,5],[45,2,45,6],[43,2,43,3],[43,4,43,5],[19,2,19,15],[20,2,20,3],[37,7,37,15],[22,2,22,4],[21,2,21,15],[27,2,29,3],[35,4,35,15],[36,2,36,15],[35,0,35,3],[31,11,33,14],[31,2,33,3],[23,2,25,3],[39,12,39,13],[40,12,40,13],[23,11,25,14],[38,2,38,3],[11,2,11,3],[38,4,38,5],[40,2,40,3],[20,4,20,15],[27,12,29,14],[39,14,39,16],[11,13,11,15],[12,13,12,15],[17,13,17,15],[18,13,18,15],[46,8,46,16],[40,10,40,11],[40,8,40,9],[41,8,41,9],[42,8,42,9],[44,7,44,14],[41,12,41,13],[40,14,40,16],[45,8,45,16],[42,12,42,13],[42,10,42,11],[47,8,47,16],[48,8,48,16],[49,8,49,16],[48,2,48,6],[49,2,49,6]]}
[null,"الجمهورية الجزائرية الديمقراطية الشعبية"]
[null,null,null,null,null,"وزارة التربية الوطنية",null,null,null,null,null,null,null,"الرقـــم:",200,null,null,null,null,null,null,null,null,null,null,null,null,"ســبب الغيــاب","الاقسام","ايام الاسبوع","المواد",null,"الاستاذ","المساعدين"]
[null,null,{"$f":"الواجهة!D3","v":"مديريـة التربيـة لولاية "},null,null,null,null,null,null,null,null,null,null,"                                     ",null,null,null,null,null,null,1]
[null,null,{"$f":"الواجهة!D4","v":"ثانويـــة الوادي"},null,null,null,null,null,null,null,null,null,"السنة الدراسية:",null,{"$f":"الواجهة!D6","v":"2018/2017/"},null,null,null,null,null,2,null,null,null,null,null,null,"غياب غير مبرر","1ع1","الاحد","فلسفة",{"$f":"IF(AG4<>\"\",1,\"\")","v":1},"دبابسية منية","صالح1",{"$f":"IF(AH4<>\"\",1,\"\")","v":1}]
[null,null,{"$f":"الواجهة!D5","v":"الوادي"},null,null,null,null,null,null,null,null,null," اليـوم: ",{"$f":"O5","v":"2018-07-01"},"2018-07-01",null,null,null,null,null,3,null,null,null,null,null,null,"عطلة مرضية","1ع2","الاثنين","عربية ",{"$f":"IF(AG5<>\"\",1,\"\")","v":1},"ذياب","صالح2",{"$f":"IF(AH5<>\"\",1,\"\")","v":1}]
[null,null,null,null,null,null,null,null,null,null,null,null,null,null,null,null,null,null,null,null,4,null,null,null,null,null,null,"عطلة امومة","1ع3","الثلاثاء","فيزياء",1,"جديد نوال","صالح3",1]
{"$rows_left_out":51}
{"sheet":"غيابات التلاميذ","index":3,"n_rows":44,"n_cols":23,"rows_kept":44,"cut":false,"hidden":false,"merged":[[1,13,2,13],[5,13,6,13],[34,9,34,10],[35,9,35,10],[36,9,36,10],[43,4,44,7],[43,1,44,2],[43,9,44,10],[37,5,37,7],[38,0,38,4],[37,0,37,2],[42,4,42,7],[42,9,42,10],[42,1,42,2],[39,0,39,10],[40,0,40,10],[41,0,41,10],[37,3,37,4],[0,0,0,10],[33,3,33,4],[33,5,33,7],[33,0,33,2],[33,9,33,10],[32,0,32,4],[36,0,36,2],[37,9,37,10],[35,0,35,2],[7,15,8,15],[10,18,11,19],[34,0,34,2],[35,3,35,4],[36,3,36,4],[35,5,35,7],[36,5,36,7],[34,3,34,4],[34,5,34,7],[13,17,15,18],[5,19,6,19],[5,20,6,20],[2,15,4,15],[5,16,6,17],[5,14,6,14],[5,15,6,15],[5,18,6,18]]}
["7ـ غيـابــات التلاميـــذ حسـب الأقســـــام"]
["الرقم","ر.ت","لقب و اسم التلميذ","القسم","الغياب",null,"الرقم","ر.ت","لقب و اسم التلميذ","القسم","الغياب",null,null,null,null,null,null,null,null,null,null,null,"مدة الغياب"]
[{"$f":"IFERROR(IF(B3<>\"\",1,\"\"),\"\")","v":""},null,{"$f":"IFERROR(VLOOKUP($B3,school2,3,FALSE)&\"  \"&VLOOKUP($B3,school2,4,FALSE),\"\")","v":""},{"$f":"IFERROR(VLOOKUP($B3,school2,8,FALSE),\"\")","v":""},null,null,{"$f":"IFERROR(IF(H3<>\"\",A32+1,\"\"),\"\")","v":""},null,{"$f":"IFERROR(VLOOKUP($H3,school2,3,FALSE)&\"  \"&VLOOKUP($H3,school2,4,FALSE),\"\")","v":""},{"$f":"IFERROR(VLOOKUP($H3,school2,8,FALSE),\"\")","v":""}]
[{"$f":"IFERROR(IF(B4<>\"\",A3+1,\"\"),\"\")","v":""},null,"","","حصتين",null,{"$f":"IFERROR(IF(H4<>\"\",G3+1,\"\"),\"\")","v":""},null,"","","مساءا",null,null,null,null,null,null,null,null,null,null,null,"حصــــة"]
[{"$f":"IFERROR(IF(B5<>\"\",A4+1,\"\"),\"\")","v":""},null,"","",null,null,{"$f":"IFERROR(IF(H5<>\"\",G4+1,\"\"),\"\")","v":""},null,"","",null,null,null,null,null,null,null,null,null,null,null,null,"حصتين"]
["",null,"","",null,null,"",null,"","",null,null,null,null,null,49,{"$f":"IFERROR(VLOOKUP($P6,school2,2,FALSE)&\"  \"&VLOOKUP($P6,school2,3,FALSE),\"\")","v":"49  مراد 49"},null,{"$f":"IFERROR(VLOOKUP($P6,school2,8,FALSE),\"\")","v":"1آف2"},{"$f":"IFERROR(VLOOKUP($P6,school2,7,FALSE),\"\")","v":2},{"$f":"IFERROR(VLOOKUP($P6,school2,10,FALSE),\"\")","v":"البياضة"},null,"ثلاث حصص"]
{"$rows_left_out":39}
{"sheet":"تعداد  التلاميذ","index":4,"n_rows":20,"n_cols":4,"rows_kept":20,"cut":false,"hidden":false,"merged":[]}
["القسم","عمود2","عدد التلاميذ","عمود1"]
[{"$f":"IFERROR(VLOOKUP($D2,school2,5,FALSE)&\"  \"&(VLOOKUP($D2,school2,6,FALSE)&\"  \"&(VLOOKUP($D2,school2,7,FALSE))),\"\")","v":"أولى  جدع مشترك آداب  1"},{"$f":"IFERROR(VLOOKUP($D2,school2,8,FALSE),\"\")","v":"1آف1"},{"$f":"COUNTIF(ALL!$H$6:$H$1005,\"1آف1\")","v":29},1]
[{"$f":"IFERROR(VLOOKUP($D3,school2,5,FALSE)&\"  \"&(VLOOKUP($D3,school2,6,FALSE)&\"  \"&(VLOOKUP($D3,school2,7,FALSE))),\"\")","v":"أولى  جدع مشترك آداب  2"},{"$f":"IFERROR(VLOOKUP($D3,school2,8,FALSE),\"\")","v":"1آف2"},{"$f":"COUNTIF(ALL!$H$6:$H$1005,\"1آف2\")","v":27},30]
["أولى  جذع مشترك علوم وتكنولوجيا  1",{"$f":"IFERROR(VLOOKUP($D4,school2,8,FALSE),\"\")","v":"1ع1"},{"$f":"COUNTIF(ALL!$H$6:$H$1005,\"1ع1\")","v":39},80]
["أولى  جذع مشترك علوم وتكنولوجيا  2","1ع2",{"$f":"COUNTIF(ALL!$H$6:$H$1005,\"1ع2\")","v":41},113]
["أولى  جذع مشترك علوم وتكنولوجيا  3","1ع3",{"$f":"COUNTIF(ALL!$H$6:$H$1005,\"1ع3\")","v":37},140]
{"$rows_left_out":15}
{"sheet":"ALL","index":5,"n_rows":605,"n_cols":36,"rows_kept":605,"cut":false,"hidden":false,"merged":[[1,23,1,28],[1,21,1,22],[2,3,2,5],[1,3,1,6],[1,8,1,10],[1,11,1,13]]}
[1,2,3,4,5,6,7,8,9,10,11,12,13,14,15,16,17,18,19,20,21,22,23,24,25,26,27,28,29,30,31,32,33,34,35,36]
[null,null,null,"قائمة التلاميذ -- حالة أول أكتوبر",null,null,null,null,"البحث عن إسم",null,null,"الوادي"]
[null,null,null,"عـــــدد التلاميـــــذ",null,null,{"$f":"COUNTA(D6:D2001)","v":600},null,null,null,null,{"$f":"IFERROR(IF($L$2=\"\",\"\",SEARCH($L$2,$A6&\" \"&$C6&\" \"&$D6&\" \"&$E6&\" \"&$F6&\" \"&$G6&\" \"&$H6&\" \"&$I6&\" \"&$J6&\" \"&$K6&\" \"&$L6&\" \"&$M6&\" \"&$N6&\" \"&$O6&\" \"&$P6&\" \"&$Q6&\" \"&$R6&\" \"&$S6&\" \"&$T6&\" \"&$U6&\" \"&$V6&\" \"&$W6&\" \"&$X6)),\"\")","v":""}]
[]
["رقم التسجيل","الرقم التسلسلي","الإسم ","اللقب","السنة","الشعبة","القسم","القسم مختصر","تاريخ الميلاد","مكان الميلاد","الجنس","إسم الأب","العنوان","أول يوم غياب","إشعار1","رقمــه","إشعار2","رقمــه","إعـــــذار","رقمـــه","الشطـــب","حركة التلاميذ","تاريخ الدخول","تاريخ الحروج","أ"]
[1,{"$f":"IF(C6=\"\",\"\",MAX($B$5:B5)+1)","v":1},"مراد 1","فريدة1","أولى","جدع مشترك آداب",1,"1آف1","12/2/2000","البياضة","ذ","محمد علي1","حي الإزدهار - البياضة","2018-04-12","2018-02-12",1,"2018-03-12",5,"2019-01-06",8,null,"دخـــول","2018-01-12",null,"ذ",{"$f":"IF($V$2=\"\",\"\",SEARCH($V$2,$A6&\"\"&#REF!&\"\"&$D6&\"\"&$F6&\"\"&$I6&\"\"&$J6&\"\"&$K6))","v":""},{"$f":"IF($X$2=\"\",\"\",SEARCH($X$2,$A6&\" \"&#REF!&\" \"&$D6&\" \"&$F6&\" \"&$I6&\" \"&$J6&\" \"&$K6&\" \"&$O6&\" \"&$Q6&\" \"&#REF!&\" \"&$U6&\" \"&$V6&\" \"&$W6&\" \"&$X6))","v":""},{"$f":"IF($L$2=\"\",\"\",SEARCH($L$2,$A6&\" \"&$D6&\" \"&$E6&\" \"&$F6&\" \"&$G6&\" \"&$H6&\" \"&$I6&\" \"&$J6&\" \"&$K6&\" \"&$L6&\" \"&$N6&\" \"&$O6&\" \"&$P6&\" \"&$Q6&\" \"&$R6&\" \"&$S6&\" \"&$T6&\" \"&$U6&\" \"&$V6&\" \"&$W6&\" \"&$X6))","v":{"$error":"#VALUE!"}}]
{"$rows_left_out":600}
{"sheet":"Single","index":6,"n_rows":27,"n_cols":40,"rows_kept":27,"cut":false,"hidden":false,"merged":[[0,0,0,5],[1,0,1,5],[6,0,6,1],[7,0,7,1]]}
["الجمهورية الجزائرية الديمقراطية الشعبية"]
["وزارة التربية الوطنية"]
[]
[null,null,"مديرية التربية لولاية",null,null,"ثانوية الوادي الجديدة"]
[null,null,null,null,null,"الجزائر"]
[]
{"$rows_left_out":22}
{"sheet":"الإشعار الأول","index":7,"n_rows":38,"n_cols":13,"rows_kept":38,"cut":false,"hidden":false,"merged":[[37,0,37,5],[24,6,24,7],[33,0,33,5],[35,0,35,5],[19,0,19,2],[19,3,19,4],[19,5,19,6],[19,7,19,8],[20,0,20,1],[20,2,20,4],[21,0,21,2],[21,3,21,5],[24,9,24,10],[29,7,29,9],[29,1,29,4],[31,0,31,5],[27,7,27,9],[0,0,0,10],[1,0,1,10],[2,0,2,5],[2,7,2,8],[22,1,22,9],[6,2,6,3],[10,2,12,8],[21,7,21,8],[7,7,7,9],[4,7,4,10],[5,7,5,10],[6,7,6,10],[13,2,13,8],[15,2,15,8],[16,2,16,8],[19,9,19,10]]}
["الجمهورية الجزائرية الديمقراطية الشعبية"]
["وزارة التربية الوطنية"]
[{"$f":"الواجهة!D3","v":"مديريـة التربيـة لولاية "},null,null,null,null,null,null,{"$f":"الواجهة!D4","v":"ثانويـــة الوادي"},null,{"$f":"الواجهة!D5","v":"الوادي"}]
[null,null,null,null,null,null,null,null,null,null,null,null,16]
[null,null,null,null,null,null,"السيـــــــــــــد :",{"$f":"IFERROR(VLOOKUP($M4,school1,12,FALSE),\"\")","v":"محمد علي16"}]
[null,null,null,null,null,null,"العنـــــــــــــوان:",{"$f":"IFERROR(VLOOKUP($M4,school1,13,FALSE),\"\")","v":"حي السلام -البياضة"}]
{"$rows_left_out":33}
{"sheet":"الإشعار الثاني","index":8,"n_rows":38,"n_cols":12,"rows_kept":38,"cut":false,"hidden":false,"merged":[[18,0,18,1],[18,2,18,4],[19,0,19,2],[19,3,19,5],[19,7,19,8],[17,0,17,2],[17,3,17,4],[17,5,17,6],[17,7,17,8],[17,9,17,10],[37,0,37,5],[22,1,22,9],[24,9,24,10],[24,1,24,4],[29,6,29,7],[29,9,29,10],[27,6,27,7],[27,9,27,10],[0,0,0,10],[1,0,1,10],[20,0,20,3],[20,4,20,6],[20,7,20,10],[6,2,6,3],[10,2,12,8],[15,0,15,9],[16,0,16,6],[6,7,6,10],[2,0,2,5],[2,7,2,8],[4,7,4,10],[5,7,5,10],[7,7,7,9],[13,2,13,8]]}
["الجمهورية الجزائرية الديمقراطية الشعبية"]
["وزارة التربيـــــــــة الوطنيـــــــــة"]
[{"$f":"الواجهة!D3","v":"مديريـة التربيـة لولاية "},null,null,null,null,null,null,{"$f":"الواجهة!D4","v":"ثانويـــة الوادي"},null,{"$f":"الواجهة!D5","v":"الوادي"}]
[null,null,null,null,null,null,null,null,null,null,null,210]
[null,null,null,null,null,null,"السيـــــــــــــد :",{"$f":"IFERROR(VLOOKUP($L4,school2,12,FALSE),\"\")","v":"محمد علي210"}]
[null,null,null,null,null,null,"العنـــــــــــــوان:",{"$f":"IFERROR(VLOOKUP($L4,school2,13,FALSE),\"\")","v":"حي السلام -البياضة"}]
{"$rows_left_out":33}
{"sheet":"الإعذار","index":9,"n_rows":31,"n_cols":12,"rows_kept":31,"cut":false,"hidden":false,"merged":[[3,5,3,6],[26,9,26,10],[28,6,28,8],[30,6,30,8],[19,0,19,3],[17,0,17,3],[6,2,6,3],[4,7,4,10],[6,7,6,10],[9,2,11,8],[4,5,4,6],[6,5,6,6],[25,0,25,2],[13,0,13,10],[0,0,0,10],[1,0,1,10],[24,0,24,2],[2,0,2,5],[2,7,2,8],[12,2,12,8],[21,0,21,7],[22,0,22,2],[23,0,23,5],[7,5,7,6],[7,7,7,9],[15,0,15,6],[15,7,15,8],[15,9,15,10],[17,4,17,5],[19,4,19,5]]}
["الجمهورية الجزائرية الديمقراطية الشعبية"]
["وزارة التربية الوطنية"]
[{"$f":"الواجهة!D3","v":"مديريـة التربيـة لولاية "},null,null,null,null,null,null,{"$f":"الواجهة!D4","v":"ثانويـــة الوادي"},null,{"$f":"الواجهة!D5","v":"الوادي"}]
[null,null,null,null,null,"إلى السيد:",null,{"$f":"IFERROR(VLOOKUP($L4,school2,12,FALSE),\"\")","v":"محمد علي91"},null,null,null,91]
[null,null,null,null,null,"العنـــــوان:",null,{"$f":"IFERROR(VLOOKUP($L4,school2,13,FALSE),\"\")","v":"حي الإزدهار - البياضة"}]
[]
{"$rows_left_out":26}
{"sheet":"الشطب","index":10,"n_rows":33,"n_cols":13,"rows_kept":33,"cut":false,"hidden":false,"merged":[[16,1,16,4],[3,12,3,13],[7,2,7,8],[19,3,19,4],[20,3,20,4],[15,0,15,1],[17,2,17,3],[15,2,15,4],[14,3,14,5],[5,7,5,10],[4,2,4,3],[6,7,6,10],[9,2,10,8],[11,0,11,9],[21,3,21,4],[18,0,18,5],[19,6,19,7],[20,6,20,7],[21,6,21,7],[30,6,30,8],[32,6,32,8],[3,7,3,9],[8,3,8,7],[24,0,24,2],[25,0,25,5],[26,0,26,2],[27,0,27,2],[28,9,28,10],[23,0,23,9],[12,0,12,10],[14,7,14,8],[14,9,14,10],[15,6,15,8],[15,9,15,10],[14,0,14,2],[0,0,0,10],[1,0,1,10],[2,0,2,5],[2,7,2,8],[4,7,4,10]]}
["الجمهورية الجزائرية الديمقراطية الشعبية",null,null,null,null,null,null,null,null,null,null,4]
["وزارة التربية الوطنية"]
[{"$f":"الواجهة!D3","v":"مديريـة التربيـة لولاية "},null,null,null,null,null,null,{"$f":"الواجهة!D4","v":"ثانويـــة الوادي"},null,{"$f":"الواجهة!D5","v":"الوادي"}]
[null,null,null,null,null,null,null,"السيد: مدير المؤسسة",null,null,null,null,434]
["الرقــــــــم",null,{"$f":"الواجهة!D6","v":"2018/2017/"},null,null,null,"إلى السيد",{"$f":"IFERROR(VLOOKUP($M4,school2,12,FALSE),\"\")","v":"محمد علي434"}]
[null,null,null,null,null,null,"العنـــــوان:",{"$f":"IFERROR(VLOOKUP($M4,school2,13,FALSE),\"\")","v":"حي السلام -البياضة"}]
{"$rows_left_out":28}
{"sheet":"إستدعاء","index":11,"n_rows":43,"n_cols":13,"rows_kept":43,"cut":false,"hidden":false,"merged":[[14,2,14,3],[14,4,14,5],[3,12,3,13],[0,0,0,10],[1,0,1,10],[2,0,2,5],[2,7,2,8],[3,7,3,9],[9,2,10,8],[11,0,11,9],[4,2,4,3],[4,7,4,10],[5,7,5,10],[6,7,6,10],[7,2,7,8],[8,2,8,8],[29,6,29,9],[38,6,38,8],[40,6,40,8],[12,0,12,10],[13,0,13,10],[14,6,14,9],[36,9,36,10],[29,0,29,3],[31,0,31,11],[17,0,17,3],[21,0,21,3],[14,0,14,1],[17,6,17,9],[32,1,32,11],[33,1,33,11],[19,0,19,3],[19,6,19,9],[23,0,23,3],[25,0,25,3],[27,0,27,3],[21,6,21,9],[23,6,23,9],[25,6,25,9],[27,6,27,9]]}
["الجمهورية الجزائرية الديمقراطية الشعبية"]
["وزارة التربية الوطنية"]
[{"$f":"الواجهة!D3","v":"مديريـة التربيـة لولاية "},null,null,null,null,null,null,{"$f":"الواجهة!D4","v":"ثانويـــة الوادي"},null,{"$f":"الواجهة!D5","v":"الوادي"}]
[null,null,null,null,null,null,null,"السيد: مدير المؤسسة",null,null,null,null,116]
["الرقــــــــم",null,{"$f":"الواجهة!D6","v":"2018/2017/"},null,null,null,"إلى السيد",{"$f":"IFERROR(VLOOKUP($M4,school2,12,FALSE),\"\")","v":"محمد علي116"}]
[null,null,null,null,null,null,"العنـــــوان:",{"$f":"IFERROR(VLOOKUP($M4,school2,13,FALSE),\"\")","v":"حي السلام -البياضة"}]
{"$rows_left_out":38}
{"sheet":"تعهد ولي التلميذ","index":12,"n_rows":40,"n_cols":10,"rows_kept":40,"cut":false,"hidden":false,"merged":[[0,0,0,10],[1,0,1,10],[2,0,2,5],[2,7,2,8],[8,2,9,8],[7,2,7,8],[2,9,2,10],[3,12,3,13],[4,2,4,3],[4,7,4,10],[5,7,5,10],[6,2,6,8],[3,7,3,10],[35,9,35,10],[37,6,37,8],[39,6,39,8],[31,0,31,11],[26,0,26,10],[28,0,28,10],[33,0,33,2],[30,0,30,11],[11,0,11,10],[22,0,22,10],[24,0,24,10],[18,0,18,10],[12,0,12,10],[13,0,13,10],[14,0,14,10],[16,0,16,10],[20,0,20,3],[20,4,20,6]]}
["الجمهورية الجزائرية الديمقراطية الشعبية"]
["وزارة التربية الوطنية"]
[{"$f":"الواجهة!D3","v":"مديريـة التربيـة لولاية "},null,null,null,null,null,null,{"$f":"الواجهة!D4","v":"ثانويـــة الوادي"},null,{"$f":"الواجهة!D5","v":"الوادي"}]
[null,null,null,null,null,null,null,{"$f":"الواجهة!B6","v":"السنـــــة الدراسيـــــــــة"}]
[null,null,null,null,null,null,null,{"$f":"الواجهة!D6","v":"2018/2017/"}]
[]
{"$rows_left_out":35}
{"sheet":"تعهد تلميذ","index":13,"n_rows":32,"n_cols":14,"rows_kept":32,"cut":false,"hidden":false,"merged":[[0,0,0,10],[1,0,1,10],[2,0,2,5],[2,7,2,8],[10,0,10,2],[10,7,10,8],[10,9,10,10],[3,0,3,1],[27,6,27,8],[29,6,29,8],[27,0,27,1],[25,8,25,10],[15,0,15,3],[18,4,18,5],[18,6,18,8],[20,0,20,9],[21,0,21,9],[18,1,18,2],[15,4,15,10],[2,13,3,13],[9,3,9,5],[9,6,9,8],[16,0,16,10],[17,0,17,10],[7,2,8,8],[11,0,11,10],[9,0,9,2],[3,2,3,3],[4,7,4,10],[5,2,5,8],[6,2,6,8],[12,2,12,4],[12,0,12,1],[10,3,10,4],[10,5,10,6]]}
["الجمهورية الجزائرية الديمقراطية الشعبية"]
["وزارة التربية الوطنية"]
[{"$f":"الواجهة!D3","v":"مديريـة التربيـة لولاية "},null,null,null,null,null,null,{"$f":"الواجهة!D4","v":"ثانويـــة الوادي"},null,{"$f":"الواجهة!D5","v":"الوادي"},null,null,null,379]
["السنة الدراسية",null,{"$f":"الواجهة!D6","v":"2018/2017/"}]
[]
[null,null,"وثيقـة إعتـراف و التزام التلميـذ(ة)"]
{"$rows_left_out":27}
{"sheet":"اليومية","index":14,"n_rows":42,"n_cols":27,"rows_kept":42,"cut":false,"hidden":false,"merged":[[34,1,34,8],[34,10,34,17],[34,19,34,26],[26,1,26,8],[26,10,26,17],[26,19,26,26],[6,0,6,27],[7,12,7,15],[9,10,9,14],[18,1,18,8],[18,10,18,17],[18,19,18,26],[7,8,7,10],[9,15,9,16],[10,1,10,8],[8,8,8,15],[10,10,10,17],[10,19,10,26]]}
[null,null,"Jan","Apr","Jul","Oct",null,null,null,null,null,null,"Feb","May","Aug","Nov",null,null,null,null,"Mar","Jun","Sep","Dec"]
[null,null,{"$f":"\"1/1/\" &I8","v":"1/1/2018"},{"$f":"U2+31","v":"2018-04-01"},{"$f":"V2+30","v":"2018-07-01"},{"$f":"W2+30","v":"2018-10-01"},null,null,null,null,null,{"$f":"IF(OR((AND(MOD(YEAR(C2),4)=0,MOD(YEAR(C2),100)<>0)), (MOD(YEAR(C2),400)=0)), 29,28)","v":28},{"$f":"C2+31","v":"2018-02-01"},{"$f":"D2+30","v":"2018-05-01"},{"$f":"E2+31","v":"2018-08-01"},{"$f":"F2+31","v":"2018-11-01"},null,null,null,null,{"$f":"M2+L2","v":"2018-03-01"},{"$f":"N2+31","v":"2018-06-01"},{"$f":"O2+31","v":"2018-09-01"},{"$f":"P2+30","v":"2018-12-01"}]
["Jan",null,{"$f":"IF(WEEKDAY($C$2)=1,1,0)","v":0},{"$f":"IF(WEEKDAY($C$2)=2,1,0)","v":1},{"$f":"IF(WEEKDAY($C$2)=3,1,0)","v":0},{"$f":"IF(WEEKDAY($C$2)=4,1,0)","v":0},{"$f":"IF(WEEKDAY($C$2)=5,1,0)","v":0},{"$f":"IF(WEEKDAY($C$2)=6,1,0)","v":0},{"$f":"IF(WEEKDAY($C$2)=7,1,0)","v":0},"Feb",null,{"$f":"IF(WEEKDAY($M$2)=1,1,0)","v":0},{"$f":"IF(WEEKDAY($M$2)=2,1,0)","v":0},{"$f":"IF(WEEKDAY($M$2)=3,1,0)","v":0},{"$f":"IF(WEEKDAY($M$2)=4,1,0)","v":0},{"$f":"IF(WEEKDAY($M$2)=5,1,0)","v":1},{"$f":"IF(WEEKDAY($M$2)=6,1,0)","v":0},{"$f":"IF(WEEKDAY($M$2)=7,1,0)","v":0},"Mar",null,{"$f":"IF(WEEKDAY($U$2)=1,1,0)","v":0},{"$f":"IF(WEEKDAY($U$2)=2,1,0)","v":0},{"$f":"IF(WEEKDAY($U$2)=3,1,0)","v":0},{"$f":"IF(WEEKDAY($U$2)=4,1,0)","v":0},{"$f":"IF(WEEKDAY($U$2)=5,1,0)","v":1},{"$f":"IF(WEEKDAY($U$2)=6,1,0)","v":0},{"$f":"IF(WEEKDAY($U$2)=7,1,0)","v":0}]
["Apr",null,{"$f":"IF(WEEKDAY($D$2)=1,1,0)","v":1},{"$f":"IF(WEEKDAY($D$2)=2,1,0)","v":0},{"$f":"IF(WEEKDAY($D$2)=3,1,0)","v":0},{"$f":"IF(WEEKDAY($D$2)=4,1,0)","v":0},{"$f":"IF(WEEKDAY($D$2)=5,1,0)","v":0},{"$f":"IF(WEEKDAY($D$2)=6,1,0)","v":0},{"$f":"IF(WEEKDAY($D$2)=7,1,0)","v":0},"May",null,{"$f":"IF(WEEKDAY($N$2)=1,1,0)","v":0},{"$f":"IF(WEEKDAY($N$2)=2,1,0)","v":0},{"$f":"IF(WEEKDAY($N$2)=3,1,0)","v":1},{"$f":"IF(WEEKDAY($N$2)=4,1,0)","v":0},{"$f":"IF(WEEKDAY($N$2)=5,1,0)","v":0},{"$f":"IF(WEEKDAY($N$2)=6,1,0)","v":0},{"$f":"IF(WEEKDAY($N$2)=7,1,0)","v":0},"Jun",null,{"$f":"IF(WEEKDAY($V$2)=1,1,0)","v":0},{"$f":"IF(WEEKDAY($V$2)=2,1,0)","v":0},{"$f":"IF(WEEKDAY($V$2)=3,1,0)","v":0},{"$f":"IF(WEEKDAY($V$2)=4,1,0)","v":0},{"$f":"IF(WEEKDAY($V$2)=5,1,0)","v":0},{"$f":"IF(WEEKDAY($V$2)=6,1,0)","v":1},{"$f":"IF(WEEKDAY($V$2)=7,1,0)","v":0}]
["Jul",null,{"$f":"IF(WEEKDAY($E$2)=1,1,0)","v":1},{"$f":"IF(WEEKDAY($E$2)=2,1,0)","v":0},{"$f":"IF(WEEKDAY($E$2)=3,1,0)","v":0},{"$f":"IF(WEEKDAY($E$2)=4,1,0)","v":0},{"$f":"IF(WEEKDAY($E$2)=5,1,0)","v":0},{"$f":"IF(WEEKDAY($E$2)=6,1,0)","v":0},{"$f":"IF(WEEKDAY($E$2)=7,1,0)","v":0},"Aug",null,{"$f":"IF(WEEKDAY($O$2)=1,1,0)","v":0},{"$f":"IF(WEEKDAY($O$2)=2,1,0)","v":0},{"$f":"IF(WEEKDAY($O$2)=3,1,0)","v":0},{"$f":"IF(WEEKDAY($O$2)=4,1,0)","v":1},{"$f":"IF(WEEKDAY($O$2)=5,1,0)","v":0},{"$f":"IF(WEEKDAY($O$2)=6,1,0)","v":0},{"$f":"IF(WEEKDAY($O$2)=7,1,0)","v":0},"Sep",null,{"$f":"IF(WEEKDAY($W$2)=1,1,0)","v":0},{"$f":"IF(WEEKDAY($W$2)=2,1,0)","v":0},{"$f":"IF(WEEKDAY($W$2)=3,1,0)","v":0},{"$f":"IF(WEEKDAY($W$2)=4,1,0)","v":0},{"$f":"IF(WEEKDAY($W$2)=5,1,0)","v":0},{"$f":"IF(WEEKDAY($W$2)=6,1,0)","v":0},{"$f":"IF(WEEKDAY($W$2)=7,1,0)","v":1}]
["Oct",null,{"$f":"IF(WEEKDAY($F$2)=1,1,0)","v":0},{"$f":"IF(WEEKDAY($F$2)=2,1,0)","v":1},{"$f":"IF(WEEKDAY($F$2)=3,1,0)","v":0},{"$f":"IF(WEEKDAY($F$2)=4,1,0)","v":0},{"$f":"IF(WEEKDAY($F$2)=5,1,0)","v":0},{"$f":"IF(WEEKDAY($F$2)=6,1,0)","v":0},{"$f":"IF(WEEKDAY($F$2)=7,1,0)","v":0},"Nov",null,{"$f":"IF(WEEKDAY($P$2)=1,1,0)","v":0},{"$f":"IF(WEEKDAY($P$2)=2,1,0)","v":0},{"$f":"IF(WEEKDAY($P$2)=3,1,0)","v":0},{"$f":"IF(WEEKDAY($P$2)=4,1,0)","v":0},{"$f":"IF(WEEKDAY($P$2)=5,1,0)","v":1},{"$f":"IF(WEEKDAY($P$2)=6,1,0)","v":0},{"$f":"IF(WEEKDAY($P$2)=7,1,0)","v":0},"Dec",null,{"$f":"IF(WEEKDAY($X$2)=1,1,0)","v":0},{"$f":"IF(WEEKDAY($X$2)=2,1,0)","v":0},{"$f":"IF(WEEKDAY($X$2)=3,1,0)","v":0},{"$f":"IF(WEEKDAY($X$2)=4,1,0)","v":0},{"$f":"IF(WEEKDAY($X$2)=5,1,0)","v":0},{"$f":"IF(WEEKDAY($X$2)=6,1,0)","v":0},{"$f":"IF(WEEKDAY($X$2)=7,1,0)","v":1}]
{"$rows_left_out":37}
{"sheet":"ورقة20","index":15,"n_rows":164,"n_cols":21,"rows_kept":164,"cut":false,"hidden":false,"merged":[[51,13,51,14],[51,10,51,11],[3,10,5,13],[1,18,1,21],[10,4,10,5],[10,7,10,8],[10,10,10,11],[10,13,10,14],[10,16,10,17],[10,19,10,20],[51,7,51,8],[51,4,51,5],[11,4,11,5],[11,19,11,20],[11,16,11,17],[11,7,11,8],[50,4,50,5],[50,7,50,8],[50,10,50,11],[50,13,50,14],[50,16,50,17],[50,19,50,20],[51,19,51,20],[11,13,11,14],[11,10,11,11],[51,16,51,17]]}
[]
[]
[]
[null,null,null,null,null,null,null,null,null,null,2001]
[]
[]
{"$rows_left_out":159}
{"sheet":"Salim","index":16,"n_rows":19,"n_cols":30,"rows_kept":19,"cut":false,"hidden":true,"merged":[]}
[null,null,null,null,null,null,null,null,null,null,null,null,null,null,null,null,null,null,null,null,null,null,null,null,null,"القسم مختصر"]
[null,null,null,null,null,null,null,null,null,null,null,null,null,null,null,null,null,null,null,null,null,null,null,null,null,"3هط1"]
[]
["رقم التسجيل","الرقم التسلسلي","الإسم ","اللقب","السنة","الشعبة","القسم","القسم مختصر","تاريخ الميلاد","مكان الميلاد","الجنس","إسم الأب","العنوان","أول يوم غياب","إشعار1","رقمــه","إشعار2","رقمــه","إعـــــذار","رقمـــه","الشطـــب","حركة التلاميذ","تاريخ الدخول","تاريخ الحروج"]
[529,529,"مراد 529","فريدة529","ثالثة","تقني رياضي",1,"3هط1","12/2/2528","البياضة","ذ","محمد علي529","حي الإزدهار - البياضة",null,"2019-07-25",529,"2019-08-22",529,"2020-06-17",529,null,null,null,null,null,null,null,null,null,{"$f":"INDEX(ALL!$E$6:$E$1500,MATCH(H5,ALL!$H$6:$H$13500,0))&\" \"&INDEX(ALL!$F$6:$F$1500,MATCH(H5,ALL!$H$6:$H$1500,0))","v":"ثالثة تقني رياضي"}]
[530,530,"مراد 530","فريدة530","ثالثة","تقني رياضي",1,"3هط1","12/2/2529","البياضة","ذ","محمد علي530","حي السلام -البياضة",null,"2019-07-26",530,"2019-08-23",530,"2020-06-18",530]
{"$rows_left_out":13}