{"text_format":"1","workbook":"xlsx","n_sheets":3,"sheets":["Sheet1","SALIM","Sheet3"],"not_rendered":{"charts":0,"images":0,"macros":1,"external_links":1,"defined_names":0,"comments":0,"pivot_tables":0},"unopened":[],"bounds":{"document_bytes":16777216,"sheet_cells":100000,"rows_first":2000,"rows_last":500,"rows_between":2000,"halvings":0,"cell_chars":16384,"cell_head_chars":4096},"cells_cut":0,"cells_raw":0,"read":"whole","date_system":"1900"}

{"sheet":"Sheet1","index":0,"n_rows":99,"n_cols":5,"rows_kept":99,"cut":false,"hidden":false,"merged":[]}
[]
[1,{"$f":"[1]!Order_Salim(A2)","v":"الأوّل"},null,null," =Order_Salim(A2)"]
[5,{"$f":"[1]!Order_Salim(A3)","v":"الخامس"}]
[31,"الحادي والثّلاثون"]
[84,"الرّابع والثّمانون"]
[95,"الخامس والتّسعون"]
[45,"الخامس والأربعون"]
[80,"الثّمانون"]
[13,"الثّالث عشر"]
[2,"الثّاني"]
[100,"المائة"]
[103,"too Big Number"]
[]
[null,""]
[null,""]
[null,""]
[null,""]
[null,""]
[null,""]
[null,""]
[null,""]
[null,""]
[null,""]
[null,""]
[null,""]
[null,""]
[null,""]
[null,""]
[null,""]
[null,""]
[null,""]
[null,""]
[null,""]
[null,""]
[null,""]
[null,""]
[null,""]
[null,""]
[null,""]
[null,""]
[null,""]
[null,""]
[null,""]
[null,""]
[null,""]
[null,""]
[null,""]
[null,""]
[null,""]
[null,""]
[null,""]
[null,""]
[null,""]
[null,""]
[null,""]
[null,""]
[null,""]
[null,""]
[null,""]
[null,""]
[null,""]
[null,""]
[null,""]
[null,""]
[null,""]
[null,""]
[null,{"$f":"[1]!Order_Salim(A67)","v":""}]
[null,""]
[null,""]
[null,""]
[null,""]
[null,""]
[null,""]
[null,""]
[null,""]
[null,""]
[null,""]
[null,""]
[null,""]
[null,""]
[null,""]
[null,""]
[null,""]
[null,""]
[null,""]
[null,""]
[null,""]
[null,""]
[null,""]
[null,""]
[null,""]
[null,""]
[null,""]
[null,""]
[null,""]
[null,""]
[null,""]
[null,""]
[null,""]

{"sheet":"SALIM","index":1,"n_rows":101,"n_cols":8,"rows_kept":101,"cut":false,"hidden":false,"merged":[]}
["Name","Notes",null,null,"name \nAccording notes","Notes In Order","Order","How the First"]
["Studiante1",{"$f":"RANDBETWEEN(30,80)","v":79},null,null,{"$f":"INDEX($A$2:$A$101,SMALL(IF($B$2:$B$101<>\"\",IF($B$2:$B$101=$F2,ROW($B$2:$B$101)-ROW($B$2)+1)),COUNTIF($F$2:F2,F2)))","v":"Studiante28"},{"$f":"LARGE($B$2:$B$101,ROWS($F$2:F2))","v":80},{"$f":"RANK(F2,$F$2:$F$101)","v":1},{"$f":"IF(COUNTIF($G$2:G2,G2)=1,[1]!Order_Salim(G2),[1]!Order_Salim(G2)&\" \"&\"مكرر  \"& COUNTIF($G$2:G2,G2)-1)","v":"الأوّل"}]
["Studiante2",45,null,null,{"$f":"INDEX($A$2:$A$101,SMALL(IF($B$2:$B$101<>\"\",IF($B$2:$B$101=$F3,ROW($B$2:$B$101)-ROW($B$2)+1)),COUNTIF($F$2:F3,F3)))","v":"Studiante37"},{"$f":"LARGE($B$2:$B$101,ROWS($F$2:F3))","v":80},{"$f":"RANK(F3,$F$2:$F$101)","v":1},{"$f":"IF(COUNTIF($G$2:G3,G3)=1,[1]!Order_Salim(G3),[1]!Order_Salim(G3)&\" \"&\"مكرر  \"& COUNTIF($G$2:G3,G3)-1)","v":"الأوّل مكرر  1"}]
["Studiante3",59,null,null,{"$f":"INDEX($A$2:$A$101,SMALL(IF($B$2:$B$101<>\"\",IF($B$2:$B$101=$F4,ROW($B$2:$B$101)-ROW($B$2)+1)),COUNTIF($F$2:F4,F4)))","v":"Studiante1"},{"$f":"LARGE($B$2:$B$101,ROWS($F$2:F4))","v":79},3,{"$f":"IF(COUNTIF($G$2:G4,G4)=1,[1]!Order_Salim(G4),[1]!Order_Salim(G4)&\" \"&\"مكرر  \"& COUNTIF($G$2:G4,G4)-1)","v":"الثّالث"}]
["Studiante4",60,null,null,{"$f":"INDEX($A$2:$A$101,SMALL(IF($B$2:$B$101<>\"\",IF($B$2:$B$101=$F5,ROW($B$2:$B$101)-ROW($B$2)+1)),COUNTIF($F$2:F5,F5)))","v":"Studiante33"},{"$f":"LARGE($B$2:$B$101,ROWS($F$2:F5))","v":79},3,{"$f":"IF(COUNTIF($G$2:G5,G5)=1,[1]!Order_Salim(G5),[1]!Order_Salim(G5)&\" \"&\"مكرر  \"& COUNTIF($G$2:G5,G5)-1)","v":"الثّالث مكرر  1"}]
["Studiante5",37,null,null,{"$f":"INDEX($A$2:$A$101,SMALL(IF($B$2:$B$101<>\"\",IF($B$2:$B$101=$F6,ROW($B$2:$B$101)-ROW($B$2)+1)),COUNTIF($F$2:F6,F6)))","v":"Studiante8"},{"$f":"LARGE($B$2:$B$101,ROWS($F$2:F6))","v":78},5,{"$f":"IF(COUNTIF($G$2:G6,G6)=1,[1]!Order_Salim(G6),[1]!Order_Salim(G6)&\" \"&\"مكرر  \"& COUNTIF($G$2:G6,G6)-1)","v":"الخامس"}]
["Studiante6",59,null,null,{"$f":"INDEX($A$2:$A$101,SMALL(IF($B$2:$B$101<>\"\",IF($B$2:$B$101=$F7,ROW($B$2:$B$101)-ROW($B$2)+1)),COUNTIF($F$2:F7,F7)))","v":"Studiante48"},{"$f":"LARGE($B$2:$B$101,ROWS($F$2:F7))","v":78},5,{"$f":"IF(COUNTIF($G$2:G7,G7)=1,[1]!Order_Salim(G7),[1]!Order_Salim(G7)&\" \"&\"مكرر  \"& COUNTIF($G$2:G7,G7)-1)","v":"الخامس مكرر  1"}]
["Studiante7",58,null,null,{"$f":"INDEX($A$2:$A$101,SMALL(IF($B$2:$B$101<>\"\",IF($B$2:$B$101=$F8,ROW($B$2:$B$101)-ROW($B$2)+1)),COUNTIF($F$2:F8,F8)))","v":"Studiante65"},{"$f":"LARGE($B$2:$B$101,ROWS($F$2:F8))","v":78},5,{"$f":"IF(COUNTIF($G$2:G8,G8)=1,[1]!Order_Salim(G8),[1]!Order_Salim(G8)&\" \"&\"مكرر  \"& COUNTIF($G$2:G8,G8)-1)","v":"الخامس مكرر  2"}]
["Studiante8",78,null,null,{"$f":"INDEX($A$2:$A$101,SMALL(IF($B$2:$B$101<>\"\",IF($B$2:$B$101=$F9,ROW($B$2:$B$101)-ROW($B$2)+1)),COUNTIF($F$2:F9,F9)))","v":"Studiante23"},{"$f":"LARGE($B$2:$B$101,ROWS($F$2:F9))","v":77},8,{"$f":"IF(COUNTIF($G$2:G9,G9)=1,[1]!Order_Salim(G9),[1]!Order_Salim(G9)&\" \"&\"مكرر  \"& COUNTIF($G$2:G9,G9)-1)","v":"الثّامن"}]
["Studiante9",38,null,null,{"$f":"INDEX($A$2:$A$101,SMALL(IF($B$2:$B$101<>\"\",IF($B$2:$B$101=$F10,ROW($B$2:$B$101)-ROW($B$2)+1)),COUNTIF($F$2:F10,F10)))","v":"Studiante88"},{"$f":"LARGE($B$2:$B$101,ROWS($F$2:F10))","v":77},8,{"$f":"IF(COUNTIF($G$2:G10,G10)=1,[1]!Order_Salim(G10),[1]!Order_Salim(G10)&\" \"&\"مكرر  \"& COUNTIF($G$2:G10,G10)-1)","v":"الثّامن مكرر  1"}]
["Studiante10",64,null,null,{"$f":"INDEX($A$2:$A$101,SMALL(IF($B$2:$B$101<>\"\",IF($B$2:$B$101=$F11,ROW($B$2:$B$101)-ROW($B$2)+1)),COUNTIF($F$2:F11,F11)))","v":"Studiante17"},{"$f":"LARGE($B$2:$B$101,ROWS($F$2:F11))","v":76},10,{"$f":"IF(COUNTIF($G$2:G11,G11)=1,[1]!Order_Salim(G11),[1]!Order_Salim(G11)&\" \"&\"مكرر  \"& COUNTIF($G$2:G11,G11)-1)","v":"العاشر"}]
["Studiante11",42,null,null,{"$f":"INDEX($A$2:$A$101,SMALL(IF($B$2:$B$101<>\"\",IF($B$2:$B$101=$F12,ROW($B$2:$B$101)-ROW($B$2)+1)),COUNTIF($F$2:F12,F12)))","v":"Studiante21"},{"$f":"LARGE($B$2:$B$101,ROWS($F$2:F12))","v":76},10,{"$f":"IF(COUNTIF($G$2:G12,G12)=1,[1]!Order_Salim(G12),[1]!Order_Salim(G12)&\" \"&\"مكرر  \"& COUNTIF($G$2:G12,G12)-1)","v":"العاشر مكرر  1"}]
["Studiante12",69,null,null,{"$f":"INDEX($A$2:$A$101,SMALL(IF($B$2:$B$101<>\"\",IF($B$2:$B$101=$F13,ROW($B$2:$B$101)-ROW($B$2)+1)),COUNTIF($F$2:F13,F13)))","v":"Studiante69"},{"$f":"LARGE($B$2:$B$101,ROWS($F$2:F13))","v":76},10,{"$f":"IF(COUNTIF($G$2:G13,G13)=1,[1]!Order_Salim(G13),[1]!Order_Salim(G13)&\" \"&\"مكرر  \"& COUNTIF($G$2:G13,G13)-1)","v":"العاشر مكرر  2"}]
["Studiante13",44,null,null,{"$f":"INDEX($A$2:$A$101,SMALL(IF($B$2:$B$101<>\"\",IF($B$2:$B$101=$F14,ROW($B$2:$B$101)-ROW($B$2)+1)),COUNTIF($F$2:F14,F14)))","v":"Studiante71"},{"$f":"LARGE($B$2:$B$101,ROWS($F$2:F14))","v":76},10,{"$f":"IF(COUNTIF($G$2:G14,G14)=1,[1]!Order_Salim(G14),[1]!Order_Salim(G14)&\" \"&\"مكرر  \"& COUNTIF($G$2:G14,G14)-1)","v":"العاشر مكرر  3"}]
["Studiante14",61,null,null,{"$f":"INDEX($A$2:$A$101,SMALL(IF($B$2:$B$101<>\"\",IF($B$2:$B$101=$F15,ROW($B$2:$B$101)-ROW($B$2)+1)),COUNTIF($F$2:F15,F15)))","v":"Studiante99"},{"$f":"LARGE($B$2:$B$101,ROWS($F$2:F15))","v":76},10,{"$f":"IF(COUNTIF($G$2:G15,G15)=1,[1]!Order_Salim(G15),[1]!Order_Salim(G15)&\" \"&\"مكرر  \"& COUNTIF($G$2:G15,G15)-1)","v":"العاشر مكرر  4"}]
["Studiante15",72,null,null,{"$f":"INDEX($A$2:$A$101,SMALL(IF($B$2:$B$101<>\"\",IF($B$2:$B$101=$F16,ROW($B$2:$B$101)-ROW($B$2)+1)),COUNTIF($F$2:F16,F16)))","v":"Studiante22"},{"$f":"LARGE($B$2:$B$101,ROWS($F$2:F16))","v":75},15,{"$f":"IF(COUNTIF($G$2:G16,G16)=1,[1]!Order_Salim(G16),[1]!Order_Salim(G16)&\" \"&\"مكرر  \"& COUNTIF($G$2:G16,G16)-1)","v":"الخامس عشر"}]
["Studiante16",68,null,null,{"$f":"INDEX($A$2:$A$101,SMALL(IF($B$2:$B$101<>\"\",IF($B$2:$B$101=$F17,ROW($B$2:$B$101)-ROW($B$2)+1)),COUNTIF($F$2:F17,F17)))","v":"Studiante87"},{"$f":"LARGE($B$2:$B$101,ROWS($F$2:F17))","v":75},15,{"$f":"IF(COUNTIF($G$2:G17,G17)=1,[1]!Order_Salim(G17),[1]!Order_Salim(G17)&\" \"&\"مكرر  \"& COUNTIF($G$2:G17,G17)-1)","v":"الخامس عشر مكرر  1"}]
["Studiante17",76,null,null,{"$f":"INDEX($A$2:$A$101,SMALL(IF($B$2:$B$101<>\"\",IF($B$2:$B$101=$F18,ROW($B$2:$B$101)-ROW($B$2)+1)),COUNTIF($F$2:F18,F18)))","v":"Studiante92"},{"$f":"LARGE($B$2:$B$101,ROWS($F$2:F18))","v":75},15,{"$f":"IF(COUNTIF($G$2:G18,G18)=1,[1]!Order_Salim(G18),[1]!Order_Salim(G18)&\" \"&\"مكرر  \"& COUNTIF($G$2:G18,G18)-1)","v":"الخامس عشر مكرر  2"}]
["Studiante18",37,null,null,{"$f":"INDEX($A$2:$A$101,SMALL(IF($B$2:$B$101<>\"\",IF($B$2:$B$101=$F19,ROW($B$2:$B$101)-ROW($B$2)+1)),COUNTIF($F$2:F19,F19)))","v":"Studiante95"},{"$f":"LARGE($B$2:$B$101,ROWS($F$2:F19))","v":75},15,{"$f":"IF(COUNTIF($G$2:G19,G19)=1,[1]!Order_Salim(G19),[1]!Order_Salim(G19)&\" \"&\"مكرر  \"& COUNTIF($G$2:G19,G19)-1)","v":"الخامس عشر مكرر  3"}]
["Studiante19",45,null,null,{"$f":"INDEX($A$2:$A$101,SMALL(IF($B$2:$B$101<>\"\",IF($B$2:$B$101=$F20,ROW($B$2:$B$101)-ROW($B$2)+1)),COUNTIF($F$2:F20,F20)))","v":"Studiante34"},{"$f":"LARGE($B$2:$B$101,ROWS($F$2:F20))","v":73},19,{"$f":"IF(COUNTIF($G$2:G20,G20)=1,[1]!Order_Salim(G20),[1]!Order_Salim(G20)&\" \"&\"مكرر  \"& COUNTIF($G$2:G20,G20)-1)","v":"التّاسع عشر"}]
["Studiante20",32,null,null,{"$f":"INDEX($A$2:$A$101,SMALL(IF($B$2:$B$101<>\"\",IF($B$2:$B$101=$F21,ROW($B$2:$B$101)-ROW($B$2)+1)),COUNTIF($F$2:F21,F21)))","v":"Studiante39"},{"$f":"LARGE($B$2:$B$101,ROWS($F$2:F21))","v":73},19,{"$f":"IF(COUNTIF($G$2:G21,G21)=1,[1]!Order_Salim(G21),[1]!Order_Salim(G21)&\" \"&\"مكرر  \"& COUNTIF($G$2:G21,G21)-1)","v":"التّاسع عشر مكرر  1"}]
["Studiante21",76,null,null,{"$f":"INDEX($A$2:$A$101,SMALL(IF($B$2:$B$101<>\"\",IF($B$2:$B$101=$F22,ROW($B$2:$B$101)-ROW($B$2)+1)),COUNTIF($F$2:F22,F22)))","v":"Studiante52"},{"$f":"LARGE($B$2:$B$101,ROWS($F$2:F22))","v":73},19,{"$f":"IF(COUNTIF($G$2:G22,G22)=1,[1]!Order_Salim(G22),[1]!Order_Salim(G22)&\" \"&\"مكرر  \"& COUNTIF($G$2:G22,G22)-1)","v":"التّاسع عشر مكرر  2"}]
["Studiante22",75,null,null,{"$f":"INDEX($A$2:$A$101,SMALL(IF($B$2:$B$101<>\"\",IF($B$2:$B$101=$F23,ROW($B$2:$B$101)-ROW($B$2)+1)),COUNTIF($F$2:F23,F23)))","v":"Studiante15"},{"$f":"LARGE($B$2:$B$101,ROWS($F$2:F23))","v":72},22,{"$f":"IF(COUNTIF($G$2:G23,G23)=1,[1]!Order_Salim(G23),[1]!Order_Salim(G23)&\" \"&\"مكرر  \"& COUNTIF($G$2:G23,G23)-1)","v":"الثّاني والعشرون"}]
["Studiante23",77,null,null,{"$f":"INDEX($A$2:$A$101,SMALL(IF($B$2:$B$101<>\"\",IF($B$2:$B$101=$F24,ROW($B$2:$B$101)-ROW($B$2)+1)),COUNTIF($F$2:F24,F24)))","v":"Studiante27"},{"$f":"LARGE($B$2:$B$101,ROWS($F$2:F24))","v":72},22,{"$f":"IF(COUNTIF($G$2:G24,G24)=1,[1]!Order_Salim(G24),[1]!Order_Salim(G24)&\" \"&\"مكرر  \"& COUNTIF($G$2:G24,G24)-1)","v":"الثّاني والعشرون مكرر  1"}]
["Studiante24",36,null,null,{"$f":"INDEX($A$2:$A$101,SMALL(IF($B$2:$B$101<>\"\",IF($B$2:$B$101=$F25,ROW($B$2:$B$101)-ROW($B$2)+1)),COUNTIF($F$2:F25,F25)))","v":"Studiante46"},{"$f":"LARGE($B$2:$B$101,ROWS($F$2:F25))","v":72},22,{"$f":"IF(COUNTIF($G$2:G25,G25)=1,[1]!Order_Salim(G25),[1]!Order_Salim(G25)&\" \"&\"مكرر  \"& COUNTIF($G$2:G25,G25)-1)","v":"الثّاني والعشرون مكرر  2"}]
["Studiante25",44,null,null,{"$f":"INDEX($A$2:$A$101,SMALL(IF($B$2:$B$101<>\"\",IF($B$2:$B$101=$F26,ROW($B$2:$B$101)-ROW($B$2)+1)),COUNTIF($F$2:F26,F26)))","v":"Studiante60"},{"$f":"LARGE($B$2:$B$101,ROWS($F$2:F26))","v":72},22,{"$f":"IF(COUNTIF($G$2:G26,G26)=1,[1]!Order_Salim(G26),[1]!Order_Salim(G26)&\" \"&\"مكرر  \"& COUNTIF($G$2:G26,G26)-1)","v":"الثّاني والعشرون مكرر  3"}]
["Studiante26",60,null,null,{"$f":"INDEX($A$2:$A$101,SMALL(IF($B$2:$B$101<>\"\",IF($B$2:$B$101=$F27,ROW($B$2:$B$101)-ROW($B$2)+1)),COUNTIF($F$2:F27,F27)))","v":"Studiante67"},{"$f":"LARGE($B$2:$B$101,ROWS($F$2:F27))","v":71},26,{"$f":"IF(COUNTIF($G$2:G27,G27)=1,[1]!Order_Salim(G27),[1]!Order_Salim(G27)&\" \"&\"مكرر  \"& COUNTIF($G$2:G27,G27)-1)","v":"السّادس والعشرون"}]
["Studiante27",72,null,null,{"$f":"INDEX($A$2:$A$101,SMALL(IF($B$2:$B$101<>\"\",IF($B$2:$B$101=$F28,ROW($B$2:$B$101)-ROW($B$2)+1)),COUNTIF($F$2:F28,F28)))","v":"Studiante12"},{"$f":"LARGE($B$2:$B$101,ROWS($F$2:F28))","v":69},27,{"$f":"IF(COUNTIF($G$2:G28,G28)=1,[1]!Order_Salim(G28),[1]!Order_Salim(G28)&\" \"&\"مكرر  \"& COUNTIF($G$2:G28,G28)-1)","v":"السّابع والعشرون"}]
["Studiante28",80,null,null,{"$f":"INDEX($A$2:$A$101,SMALL(IF($B$2:$B$101<>\"\",IF($B$2:$B$101=$F29,ROW($B$2:$B$101)-ROW($B$2)+1)),COUNTIF($F$2:F29,F29)))","v":"Studiante16"},{"$f":"LARGE($B$2:$B$101,ROWS($F$2:F29))","v":68},28,{"$f":"IF(COUNTIF($G$2:G29,G29)=1,[1]!Order_Salim(G29),[1]!Order_Salim(G29)&\" \"&\"مكرر  \"& COUNTIF($G$2:G29,G29)-1)","v":"الثّامن والعشرون"}]
["Studiante29",67,null,null,{"$f":"INDEX($A$2:$A$101,SMALL(IF($B$2:$B$101<>\"\",IF($B$2:$B$101=$F30,ROW($B$2:$B$101)-ROW($B$2)+1)),COUNTIF($F$2:F30,F30)))","v":"Studiante29"},{"$f":"LARGE($B$2:$B$101,ROWS($F$2:F30))","v":67},29,{"$f":"IF(COUNTIF($G$2:G30,G30)=1,[1]!Order_Salim(G30),[1]!Order_Salim(G30)&\" \"&\"مكرر  \"& COUNTIF($G$2:G30,G30)-1)","v":"التّاسع والعشرون"}]
["Studiante30",67,null,null,{"$f":"INDEX($A$2:$A$101,SMALL(IF($B$2:$B$101<>\"\",IF($B$2:$B$101=$F31,ROW($B$2:$B$101)-ROW($B$2)+1)),COUNTIF($F$2:F31,F31)))","v":"Studiante30"},{"$f":"LARGE($B$2:$B$101,ROWS($F$2:F31))","v":67},29,{"$f":"IF(COUNTIF($G$2:G31,G31)=1,[1]!Order_Salim(G31),[1]!Order_Salim(G31)&\" \"&\"مكرر  \"& COUNTIF($G$2:G31,G31)-1)","v":"التّاسع والعشرون مكرر  1"}]
["Studiante31",60,null,null,{"$f":"INDEX($A$2:$A$101,SMALL(IF($B$2:$B$101<>\"\",IF($B$2:$B$101=$F32,ROW($B$2:$B$101)-ROW($B$2)+1)),COUNTIF($F$2:F32,F32)))","v":"Studiante82"},{"$f":"LARGE($B$2:$B$101,ROWS($F$2:F32))","v":67},29,{"$f":"IF(COUNTIF($G$2:G32,G32)=1,[1]!Order_Salim(G32),[1]!Order_Salim(G32)&\" \"&\"مكرر  \"& COUNTIF($G$2:G32,G32)-1)","v":"التّاسع والعشرون مكرر  2"}]
["Studiante32",40,null,null,{"$f":"INDEX($A$2:$A$101,SMALL(IF($B$2:$B$101<>\"\",IF($B$2:$B$101=$F33,ROW($B$2:$B$101)-ROW($B$2)+1)),COUNTIF($F$2:F33,F33)))","v":"Studiante44"},{"$f":"LARGE($B$2:$B$101,ROWS($F$2:F33))","v":66},32,{"$f":"IF(COUNTIF($G$2:G33,G33)=1,[1]!Order_Salim(G33),[1]!Order_Salim(G33)&\" \"&\"مكرر  \"& COUNTIF($G$2:G33,G33)-1)","v":"الثّاني والثّلاثون"}]
["Studiante33",79,null,null,{"$f":"INDEX($A$2:$A$101,SMALL(IF($B$2:$B$101<>\"\",IF($B$2:$B$101=$F34,ROW($B$2:$B$101)-ROW($B$2)+1)),COUNTIF($F$2:F34,F34)))","v":"Studiante78"},{"$f":"LARGE($B$2:$B$101,ROWS($F$2:F34))","v":66},32,{"$f":"IF(COUNTIF($G$2:G34,G34)=1,[1]!Order_Salim(G34),[1]!Order_Salim(G34)&\" \"&\"مكرر  \"& COUNTIF($G$2:G34,G34)-1)","v":"الثّاني والثّلاثون مكرر  1"}]
["Studiante34",73,null,null,{"$f":"INDEX($A$2:$A$101,SMALL(IF($B$2:$B$101<>\"\",IF($B$2:$B$101=$F35,ROW($B$2:$B$101)-ROW($B$2)+1)),COUNTIF($F$2:F35,F35)))","v":"Studiante86"},{"$f":"LARGE($B$2:$B$101,ROWS($F$2:F35))","v":65},34,{"$f":"IF(COUNTIF($G$2:G35,G35)=1,[1]!Order_Salim(G35),[1]!Order_Salim(G35)&\" \"&\"مكرر  \"& COUNTIF($G$2:G35,G35)-1)","v":"الرّابع والثّلاثون"}]
["Studiante35",41,null,null,{"$f":"INDEX($A$2:$A$101,SMALL(IF($B$2:$B$101<>\"\",IF($B$2:$B$101=$F36,ROW($B$2:$B$101)-ROW($B$2)+1)),COUNTIF($F$2:F36,F36)))","v":"Studiante10"},{"$f":"LARGE($B$2:$B$101,ROWS($F$2:F36))","v":64},35,{"$f":"IF(COUNTIF($G$2:G36,G36)=1,[1]!Order_Salim(G36),[1]!Order_Salim(G36)&\" \"&\"مكرر  \"& COUNTIF($G$2:G36,G36)-1)","v":"الخامس والثّلاثون"}]
["Studiante36",47,null,null,{"$f":"INDEX($A$2:$A$101,SMALL(IF($B$2:$B$101<>\"\",IF($B$2:$B$101=$F37,ROW($B$2:$B$101)-ROW($B$2)+1)),COUNTIF($F$2:F37,F37)))","v":"Studiante45"},{"$f":"LARGE($B$2:$B$101,ROWS($F$2:F37))","v":64},35,{"$f":"IF(COUNTIF($G$2:G37,G37)=1,[1]!Order_Salim(G37),[1]!Order_Salim(G37)&\" \"&\"مكرر  \"& COUNTIF($G$2:G37,G37)-1)","v":"الخامس والثّلاثون مكرر  1"}]
["Studiante37",80,null,null,{"$f":"INDEX($A$2:$A$101,SMALL(IF($B$2:$B$101<>\"\",IF($B$2:$B$101=$F38,ROW($B$2:$B$101)-ROW($B$2)+1)),COUNTIF($F$2:F38,F38)))","v":"Studiante96"},{"$f":"LARGE($B$2:$B$101,ROWS($F$2:F38))","v":64},35,{"$f":"IF(COUNTIF($G$2:G38,G38)=1,[1]!Order_Salim(G38),[1]!Order_Salim(G38)&\" \"&\"مكرر  \"& COUNTIF($G$2:G38,G38)-1)","v":"الخامس والثّلاثون مكرر  2"}]
["Studiante38",50,null,null,{"$f":"INDEX($A$2:$A$101,SMALL(IF($B$2:$B$101<>\"\",IF($B$2:$B$101=$F39,ROW($B$2:$B$101)-ROW($B$2)+1)),COUNTIF($F$2:F39,F39)))","v":"Studiante80"},{"$f":"LARGE($B$2:$B$101,ROWS($F$2:F39))","v":63},38,{"$f":"IF(COUNTIF($G$2:G39,G39)=1,[1]!Order_Salim(G39),[1]!Order_Salim(G39)&\" \"&\"مكرر  \"& COUNTIF($G$2:G39,G39)-1)","v":"الثّامن والثّلاثون"}]
["Studiante39",73,null,null,{"$f":"INDEX($A$2:$A$101,SMALL(IF($B$2:$B$101<>\"\",IF($B$2:$B$101=$F40,ROW($B$2:$B$101)-ROW($B$2)+1)),COUNTIF($F$2:F40,F40)))","v":"Studiante14"},{"$f":"LARGE($B$2:$B$101,ROWS($F$2:F40))","v":61},39,{"$f":"IF(COUNTIF($G$2:G40,G40)=1,[1]!Order_Salim(G40),[1]!Order_Salim(G40)&\" \"&\"مكرر  \"& COUNTIF($G$2:G40,G40)-1)","v":"التّاسع والثّلاثون"}]
["Studiante40",30,null,null,{"$f":"INDEX($A$2:$A$101,SMALL(IF($B$2:$B$101<>\"\",IF($B$2:$B$101=$F41,ROW($B$2:$B$101)-ROW($B$2)+1)),COUNTIF($F$2:F41,F41)))","v":"Studiante50"},{"$f":"LARGE($B$2:$B$101,ROWS($F$2:F41))","v":61},39,{"$f":"IF(COUNTIF($G$2:G41,G41)=1,[1]!Order_Salim(G41),[1]!Order_Salim(G41)&\" \"&\"مكرر  \"& COUNTIF($G$2:G41,G41)-1)","v":"التّاسع والثّلاثون مكرر  1"}]
["Studiante41",43,null,null,{"$f":"INDEX($A$2:$A$101,SMALL(IF($B$2:$B$101<>\"\",IF($B$2:$B$101=$F42,ROW($B$2:$B$101)-ROW($B$2)+1)),COUNTIF($F$2:F42,F42)))","v":"Studiante55"},{"$f":"LARGE($B$2:$B$101,ROWS($F$2:F42))","v":61},39,{"$f":"IF(COUNTIF($G$2:G42,G42)=1,[1]!Order_Salim(G42),[1]!Order_Salim(G42)&\" \"&\"مكرر  \"& COUNTIF($G$2:G42,G42)-1)","v":"التّاسع والثّلاثون مكرر  2"}]
["Studiante42",57,null,null,{"$f":"INDEX($A$2:$A$101,SMALL(IF($B$2:$B$101<>\"\",IF($B$2:$B$101=$F43,ROW($B$2:$B$101)-ROW($B$2)+1)),COUNTIF($F$2:F43,F43)))","v":"Studiante63"},{"$f":"LARGE($B$2:$B$101,ROWS($F$2:F43))","v":61},39,{"$f":"IF(COUNTIF($G$2:G43,G43)=1,[1]!Order_Salim(G43),[1]!Order_Salim(G43)&\" \"&\"مكرر  \"& COUNTIF($G$2:G43,G43)-1)","v":"التّاسع والثّلاثون مكرر  3"}]
["Studiante43",39,null,null,{"$f":"INDEX($A$2:$A$101,SMALL(IF($B$2:$B$101<>\"\",IF($B$2:$B$101=$F44,ROW($B$2:$B$101)-ROW($B$2)+1)),COUNTIF($F$2:F44,F44)))","v":"Studiante4"},{"$f":"LARGE($B$2:$B$101,ROWS($F$2:F44))","v":60},43,{"$f":"IF(COUNTIF($G$2:G44,G44)=1,[1]!Order_Salim(G44),[1]!Order_Salim(G44)&\" \"&\"مكرر  \"& COUNTIF($G$2:G44,G44)-1)","v":"الثّالث والأربعون"}]
["Studiante44",66,null,null,{"$f":"INDEX($A$2:$A$101,SMALL(IF($B$2:$B$101<>\"\",IF($B$2:$B$101=$F45,ROW($B$2:$B$101)-ROW($B$2)+1)),COUNTIF($F$2:F45,F45)))","v":"Studiante26"},{"$f":"LARGE($B$2:$B$101,ROWS($F$2:F45))","v":60},43,{"$f":"IF(COUNTIF($G$2:G45,G45)=1,[1]!Order_Salim(G45),[1]!Order_Salim(G45)&\" \"&\"مكرر  \"& COUNTIF($G$2:G45,G45)-1)","v":"الثّالث والأربعون مكرر  1"}]
["Studiante45",64,null,null,{"$f":"INDEX($A$2:$A$101,SMALL(IF($B$2:$B$101<>\"\",IF($B$2:$B$101=$F46,ROW($B$2:$B$101)-ROW($B$2)+1)),COUNTIF($F$2:F46,F46)))","v":"Studiante31"},{"$f":"LARGE($B$2:$B$101,ROWS($F$2:F46))","v":60},43,{"$f":"IF(COUNTIF($G$2:G46,G46)=1,[1]!Order_Salim(G46),[1]!Order_Salim(G46)&\" \"&\"مكرر  \"& COUNTIF($G$2:G46,G46)-1)","v":"الثّالث والأربعون مكرر  2"}]
["Studiante46",72,null,null,{"$f":"INDEX($A$2:$A$101,SMALL(IF($B$2:$B$101<>\"\",IF($B$2:$B$101=$F47,ROW($B$2:$B$101)-ROW($B$2)+1)),COUNTIF($F$2:F47,F47)))","v":"Studiante91"},{"$f":"LARGE($B$2:$B$101,ROWS($F$2:F47))","v":60},43,{"$f":"IF(COUNTIF($G$2:G47,G47)=1,[1]!Order_Salim(G47),[1]!Order_Salim(G47)&\" \"&\"مكرر  \"& COUNTIF($G$2:G47,G47)-1)","v":"الثّالث والأربعون مكرر  3"}]
["Studiante47",33,null,null,{"$f":"INDEX($A$2:$A$101,SMALL(IF($B$2:$B$101<>\"\",IF($B$2:$B$101=$F48,ROW($B$2:$B$101)-ROW($B$2)+1)),COUNTIF($F$2:F48,F48)))","v":"Studiante3"},{"$f":"LARGE($B$2:$B$101,ROWS($F$2:F48))","v":59},47,{"$f":"IF(COUNTIF($G$2:G48,G48)=1,[1]!Order_Salim(G48),[1]!Order_Salim(G48)&\" \"&\"مكرر  \"& COUNTIF($G$2:G48,G48)-1)","v":"السّابع والأربعون"}]
["Studiante48",78,null,null,{"$f":"INDEX($A$2:$A$101,SMALL(IF($B$2:$B$101<>\"\",IF($B$2:$B$101=$F49,ROW($B$2:$B$101)-ROW($B$2)+1)),COUNTIF($F$2:F49,F49)))","v":"Studiante6"},{"$f":"LARGE($B$2:$B$101,ROWS($F$2:F49))","v":59},47,{"$f":"IF(COUNTIF($G$2:G49,G49)=1,[1]!Order_Salim(G49),[1]!Order_Salim(G49)&\" \"&\"مكرر  \"& COUNTIF($G$2:G49,G49)-1)","v":"السّابع والأربعون مكرر  1"}]
["Studiante49",33,null,null,{"$f":"INDEX($A$2:$A$101,SMALL(IF($B$2:$B$101<>\"\",IF($B$2:$B$101=$F50,ROW($B$2:$B$101)-ROW($B$2)+1)),COUNTIF($F$2:F50,F50)))","v":"Studiante77"},{"$f":"LARGE($B$2:$B$101,ROWS($F$2:F50))","v":59},47,{"$f":"IF(COUNTIF($G$2:G50,G50)=1,[1]!Order_Salim(G50),[1]!Order_Salim(G50)&\" \"&\"مكرر  \"& COUNTIF($G$2:G50,G50)-1)","v":"السّابع والأربعون مكرر  2"}]
["Studiante50",61,null,null,{"$f":"INDEX($A$2:$A$101,SMALL(IF($B$2:$B$101<>\"\",IF($B$2:$B$101=$F51,ROW($B$2:$B$101)-ROW($B$2)+1)),COUNTIF($F$2:F51,F51)))","v":"Studiante7"},{"$f":"LARGE($B$2:$B$101,ROWS($F$2:F51))","v":58},50,{"$f":"IF(COUNTIF($G$2:G51,G51)=1,[1]!Order_Salim(G51),[1]!Order_Salim(G51)&\" \"&\"مكرر  \"& COUNTIF($G$2:G51,G51)-1)","v":"الخمسون"}]
["Studiante51",33,null,null,{"$f":"INDEX($A$2:$A$101,SMALL(IF($B$2:$B$101<>\"\",IF($B$2:$B$101=$F52,ROW($B$2:$B$101)-ROW($B$2)+1)),COUNTIF($F$2:F52,F52)))","v":"Studiante54"},{"$f":"LARGE($B$2:$B$101,ROWS($F$2:F52))","v":58},50,{"$f":"IF(COUNTIF($G$2:G52,G52)=1,[1]!Order_Salim(G52),[1]!Order_Salim(G52)&\" \"&\"مكرر  \"& COUNTIF($G$2:G52,G52)-1)","v":"الخمسون مكرر  1"}]
["Studiante52",73,null,null,{"$f":"INDEX($A$2:$A$101,SMALL(IF($B$2:$B$101<>\"\",IF($B$2:$B$101=$F53,ROW($B$2:$B$101)-ROW($B$2)+1)),COUNTIF($F$2:F53,F53)))","v":"Studiante42"},{"$f":"LARGE($B$2:$B$101,ROWS($F$2:F53))","v":57},52,{"$f":"IF(COUNTIF($G$2:G53,G53)=1,[1]!Order_Salim(G53),[1]!Order_Salim(G53)&\" \"&\"مكرر  \"& COUNTIF($G$2:G53,G53)-1)","v":"الثّاني والخمسون"}]
["Studiante53",31,null,null,{"$f":"INDEX($A$2:$A$101,SMALL(IF($B$2:$B$101<>\"\",IF($B$2:$B$101=$F54,ROW($B$2:$B$101)-ROW($B$2)+1)),COUNTIF($F$2:F54,F54)))","v":"Studiante68"},{"$f":"LARGE($B$2:$B$101,ROWS($F$2:F54))","v":57},52,{"$f":"IF(COUNTIF($G$2:G54,G54)=1,[1]!Order_Salim(G54),[1]!Order_Salim(G54)&\" \"&\"مكرر  \"& COUNTIF($G$2:G54,G54)-1)","v":"الثّاني والخمسون مكرر  1"}]
["Studiante54",58,null,null,{"$f":"INDEX($A$2:$A$101,SMALL(IF($B$2:$B$101<>\"\",IF($B$2:$B$101=$F55,ROW($B$2:$B$101)-ROW($B$2)+1)),COUNTIF($F$2:F55,F55)))","v":"Studiante94"},{"$f":"LARGE($B$2:$B$101,ROWS($F$2:F55))","v":54},54,{"$f":"IF(COUNTIF($G$2:G55,G55)=1,[1]!Order_Salim(G55),[1]!Order_Salim(G55)&\" \"&\"مكرر  \"& COUNTIF($G$2:G55,G55)-1)","v":"الرّابع والخمسون"}]
["Studiante55",61,null,null,{"$f":"INDEX($A$2:$A$101,SMALL(IF($B$2:$B$101<>\"\",IF($B$2:$B$101=$F56,ROW($B$2:$B$101)-ROW($B$2)+1)),COUNTIF($F$2:F56,F56)))","v":"Studiante62"},{"$f":"LARGE($B$2:$B$101,ROWS($F$2:F56))","v":53},55,{"$f":"IF(COUNTIF($G$2:G56,G56)=1,[1]!Order_Salim(G56),[1]!Order_Salim(G56)&\" \"&\"مكرر  \"& COUNTIF($G$2:G56,G56)-1)","v":"الخامس والخمسون"}]
["Studiante56",42,null,null,{"$f":"INDEX($A$2:$A$101,SMALL(IF($B$2:$B$101<>\"\",IF($B$2:$B$101=$F57,ROW($B$2:$B$101)-ROW($B$2)+1)),COUNTIF($F$2:F57,F57)))","v":"Studiante58"},{"$f":"LARGE($B$2:$B$101,ROWS($F$2:F57))","v":52},56,{"$f":"IF(COUNTIF($G$2:G57,G57)=1,[1]!Order_Salim(G57),[1]!Order_Salim(G57)&\" \"&\"مكرر  \"& COUNTIF($G$2:G57,G57)-1)","v":"السّادس والخمسون"}]
["Studiante57",30,null,null,{"$f":"INDEX($A$2:$A$101,SMALL(IF($B$2:$B$101<>\"\",IF($B$2:$B$101=$F58,ROW($B$2:$B$101)-ROW($B$2)+1)),COUNTIF($F$2:F58,F58)))","v":"Studiante66"},{"$f":"LARGE($B$2:$B$101,ROWS($F$2:F58))","v":52},56,{"$f":"IF(COUNTIF($G$2:G58,G58)=1,[1]!Order_Salim(G58),[1]!Order_Salim(G58)&\" \"&\"مكرر  \"& COUNTIF($G$2:G58,G58)-1)","v":"السّادس والخمسون مكرر  1"}]
["Studiante58",52,null,null,{"$f":"INDEX($A$2:$A$101,SMALL(IF($B$2:$B$101<>\"\",IF($B$2:$B$101=$F59,ROW($B$2:$B$101)-ROW($B$2)+1)),COUNTIF($F$2:F59,F59)))","v":"Studiante76"},{"$f":"LARGE($B$2:$B$101,ROWS($F$2:F59))","v":52},56,{"$f":"IF(COUNTIF($G$2:G59,G59)=1,[1]!Order_Salim(G59),[1]!Order_Salim(G59)&\" \"&\"مكرر  \"& COUNTIF($G$2:G59,G59)-1)","v":"السّادس والخمسون مكرر  2"}]
["Studiante59",41,null,null,{"$f":"INDEX($A$2:$A$101,SMALL(IF($B$2:$B$101<>\"\",IF($B$2:$B$101=$F60,ROW($B$2:$B$101)-ROW($B$2)+1)),COUNTIF($F$2:F60,F60)))","v":"Studiante38"},{"$f":"LARGE($B$2:$B$101,ROWS($F$2:F60))","v":50},59,{"$f":"IF(COUNTIF($G$2:G60,G60)=1,[1]!Order_Salim(G60),[1]!Order_Salim(G60)&\" \"&\"مكرر  \"& COUNTIF($G$2:G60,G60)-1)","v":"التّاسع والخمسون"}]
["Studiante60",72,null,null,{"$f":"INDEX($A$2:$A$101,SMALL(IF($B$2:$B$101<>\"\",IF($B$2:$B$101=$F61,ROW($B$2:$B$101)-ROW($B$2)+1)),COUNTIF($F$2:F61,F61)))","v":"Studiante70"},{"$f":"LARGE($B$2:$B$101,ROWS($F$2:F61))","v":49},60,{"$f":"IF(COUNTIF($G$2:G61,G61)=1,[1]!Order_Salim(G61),[1]!Order_Salim(G61)&\" \"&\"مكرر  \"& COUNTIF($G$2:G61,G61)-1)","v":"الستون"}]
["Studiante61",46,null,null,{"$f":"INDEX($A$2:$A$101,SMALL(IF($B$2:$B$101<>\"\",IF($B$2:$B$101=$F62,ROW($B$2:$B$101)-ROW($B$2)+1)),COUNTIF($F$2:F62,F62)))","v":"Studiante97"},{"$f":"LARGE($B$2:$B$101,ROWS($F$2:F62))","v":48},61,{"$f":"IF(COUNTIF($G$2:G62,G62)=1,[1]!Order_Salim(G62),[1]!Order_Salim(G62)&\" \"&\"مكرر  \"& COUNTIF($G$2:G62,G62)-1)","v":"الحادي والستون"}]
["Studiante62",53,null,null,{"$f":"INDEX($A$2:$A$101,SMALL(IF($B$2:$B$101<>\"\",IF($B$2:$B$101=$F63,ROW($B$2:$B$101)-ROW($B$2)+1)),COUNTIF($F$2:F63,F63)))","v":"Studiante36"},{"$f":"LARGE($B$2:$B$101,ROWS($F$2:F63))","v":47},62,{"$f":"IF(COUNTIF($G$2:G63,G63)=1,[1]!Order_Salim(G63),[1]!Order_Salim(G63)&\" \"&\"مكرر  \"& COUNTIF($G$2:G63,G63)-1)","v":"الثّاني والستون"}]
["Studiante63",61,null,null,{"$f":"INDEX($A$2:$A$101,SMALL(IF($B$2:$B$101<>\"\",IF($B$2:$B$101=$F64,ROW($B$2:$B$101)-ROW($B$2)+1)),COUNTIF($F$2:F64,F64)))","v":"Studiante73"},{"$f":"LARGE($B$2:$B$101,ROWS($F$2:F64))","v":47},62,{"$f":"IF(COUNTIF($G$2:G64,G64)=1,[1]!Order_Salim(G64),[1]!Order_Salim(G64)&\" \"&\"مكرر  \"& COUNTIF($G$2:G64,G64)-1)","v":"الثّاني والستون مكرر  1"}]
["Studiante64",46,null,null,{"$f":"INDEX($A$2:$A$101,SMALL(IF($B$2:$B$101<>\"\",IF($B$2:$B$101=$F65,ROW($B$2:$B$101)-ROW($B$2)+1)),COUNTIF($F$2:F65,F65)))","v":"Studiante89"},{"$f":"LARGE($B$2:$B$101,ROWS($F$2:F65))","v":47},62,{"$f":"IF(COUNTIF($G$2:G65,G65)=1,[1]!Order_Salim(G65),[1]!Order_Salim(G65)&\" \"&\"مكرر  \"& COUNTIF($G$2:G65,G65)-1)","v":"الثّاني والستون مكرر  2"}]
["Studiante65",78,null,null,{"$f":"INDEX($A$2:$A$101,SMALL(IF($B$2:$B$101<>\"\",IF($B$2:$B$101=$F66,ROW($B$2:$B$101)-ROW($B$2)+1)),COUNTIF($F$2:F66,F66)))","v":"Studiante61"},{"$f":"LARGE($B$2:$B$101,ROWS($F$2:F66))","v":46},65,{"$f":"IF(COUNTIF($G$2:G66,G66)=1,[1]!Order_Salim(G66),[1]!Order_Salim(G66)&\" \"&\"مكرر  \"& COUNTIF($G$2:G66,G66)-1)","v":"الخامس والستون"}]
["Studiante66",52,null,null,{"$f":"INDEX($A$2:$A$101,SMALL(IF($B$2:$B$101<>\"\",IF($B$2:$B$101=$F67,ROW($B$2:$B$101)-ROW($B$2)+1)),COUNTIF($F$2:F67,F67)))","v":"Studiante64"},{"$f":"LARGE($B$2:$B$101,ROWS($F$2:F67))","v":46},{"$f":"RANK(F67,$F$2:$F$101)","v":65},{"$f":"IF(COUNTIF($G$2:G67,G67)=1,[1]!Order_Salim(G67),[1]!Order_Salim(G67)&\" \"&\"مكرر  \"& COUNTIF($G$2:G67,G67)-1)","v":"الخامس والستون مكرر  1"}]
["Studiante67",71,null,null,{"$f":"INDEX($A$2:$A$101,SMALL(IF($B$2:$B$101<>\"\",IF($B$2:$B$101=$F68,ROW($B$2:$B$101)-ROW($B$2)+1)),COUNTIF($F$2:F68,F68)))","v":"Studiante72"},{"$f":"LARGE($B$2:$B$101,ROWS($F$2:F68))","v":46},65,{"$f":"IF(COUNTIF($G$2:G68,G68)=1,[1]!Order_Salim(G68),[1]!Order_Salim(G68)&\" \"&\"مكرر  \"& COUNTIF($G$2:G68,G68)-1)","v":"الخامس والستون مكرر  2"}]
["Studiante68",57,null,null,{"$f":"INDEX($A$2:$A$101,SMALL(IF($B$2:$B$101<>\"\",IF($B$2:$B$101=$F69,ROW($B$2:$B$101)-ROW($B$2)+1)),COUNTIF($F$2:F69,F69)))","v":"Studiante84"},{"$f":"LARGE($B$2:$B$101,ROWS($F$2:F69))","v":46},65,{"$f":"IF(COUNTIF($G$2:G69,G69)=1,[1]!Order_Salim(G69),[1]!Order_Salim(G69)&\" \"&\"مكرر  \"& COUNTIF($G$2:G69,G69)-1)","v":"الخامس والستون مكرر  3"}]
["Studiante69",76,null,null,{"$f":"INDEX($A$2:$A$101,SMALL(IF($B$2:$B$101<>\"\",IF($B$2:$B$101=$F70,ROW($B$2:$B$101)-ROW($B$2)+1)),COUNTIF($F$2:F70,F70)))","v":"Studiante2"},{"$f":"LARGE($B$2:$B$101,ROWS($F$2:F70))","v":45},69,{"$f":"IF(COUNTIF($G$2:G70,G70)=1,[1]!Order_Salim(G70),[1]!Order_Salim(G70)&\" \"&\"مكرر  \"& COUNTIF($G$2:G70,G70)-1)","v":"التّاسع والستون"}]
["Studiante70",49,null,null,{"$f":"INDEX($A$2:$A$101,SMALL(IF($B$2:$B$101<>\"\",IF($B$2:$B$101=$F71,ROW($B$2:$B$101)-ROW($B$2)+1)),COUNTIF($F$2:F71,F71)))","v":"Studiante19"},{"$f":"LARGE($B$2:$B$101,ROWS($F$2:F71))","v":45},69,{"$f":"IF(COUNTIF($G$2:G71,G71)=1,[1]!Order_Salim(G71),[1]!Order_Salim(G71)&\" \"&\"مكرر  \"& COUNTIF($G$2:G71,G71)-1)","v":"التّاسع والستون مكرر  1"}]
["Studiante71",76,null,null,{"$f":"INDEX($A$2:$A$101,SMALL(IF($B$2:$B$101<>\"\",IF($B$2:$B$101=$F72,ROW($B$2:$B$101)-ROW($B$2)+1)),COUNTIF($F$2:F72,F72)))","v":"Studiante13"},{"$f":"LARGE($B$2:$B$101,ROWS($F$2:F72))","v":44},71,{"$f":"IF(COUNTIF($G$2:G72,G72)=1,[1]!Order_Salim(G72),[1]!Order_Salim(G72)&\" \"&\"مكرر  \"& COUNTIF($G$2:G72,G72)-1)","v":"الحادي والسّبعون"}]
["Studiante72",46,null,null,{"$f":"INDEX($A$2:$A$101,SMALL(IF($B$2:$B$101<>\"\",IF($B$2:$B$101=$F73,ROW($B$2:$B$101)-ROW($B$2)+1)),COUNTIF($F$2:F73,F73)))","v":"Studiante25"},{"$f":"LARGE($B$2:$B$101,ROWS($F$2:F73))","v":44},71,{"$f":"IF(COUNTIF($G$2:G73,G73)=1,[1]!Order_Salim(G73),[1]!Order_Salim(G73)&\" \"&\"مكرر  \"& COUNTIF($G$2:G73,G73)-1)","v":"الحادي والسّبعون مكرر  1"}]
["Studiante73",47,null,null,{"$f":"INDEX($A$2:$A$101,SMALL(IF($B$2:$B$101<>\"\",IF($B$2:$B$101=$F74,ROW($B$2:$B$101)-ROW($B$2)+1)),COUNTIF($F$2:F74,F74)))","v":"Studiante41"},{"$f":"LARGE($B$2:$B$101,ROWS($F$2:F74))","v":43},73,{"$f":"IF(COUNTIF($G$2:G74,G74)=1,[1]!Order_Salim(G74),[1]!Order_Salim(G74)&\" \"&\"مكرر  \"& COUNTIF($G$2:G74,G74)-1)","v":"الثّالث والسّبعون"}]
["Studiante74",33,null,null,{"$f":"INDEX($A$2:$A$101,SMALL(IF($B$2:$B$101<>\"\",IF($B$2:$B$101=$F75,ROW($B$2:$B$101)-ROW($B$2)+1)),COUNTIF($F$2:F75,F75)))","v":"Studiante11"},{"$f":"LARGE($B$2:$B$101,ROWS($F$2:F75))","v":42},74,{"$f":"IF(COUNTIF($G$2:G75,G75)=1,[1]!Order_Salim(G75),[1]!Order_Salim(G75)&\" \"&\"مكرر  \"& COUNTIF($G$2:G75,G75)-1)","v":"الرّابع والسّبعون"}]
["Studiante75",33,null,null,{"$f":"INDEX($A$2:$A$101,SMALL(IF($B$2:$B$101<>\"\",IF($B$2:$B$101=$F76,ROW($B$2:$B$101)-ROW($B$2)+1)),COUNTIF($F$2:F76,F76)))","v":"Studiante56"},{"$f":"LARGE($B$2:$B$101,ROWS($F$2:F76))","v":42},74,{"$f":"IF(COUNTIF($G$2:G76,G76)=1,[1]!Order_Salim(G76),[1]!Order_Salim(G76)&\" \"&\"مكرر  \"& COUNTIF($G$2:G76,G76)-1)","v":"الرّابع والسّبعون مكرر  1"}]
["Studiante76",52,null,null,{"$f":"INDEX($A$2:$A$101,SMALL(IF($B$2:$B$101<>\"\",IF($B$2:$B$101=$F77,ROW($B$2:$B$101)-ROW($B$2)+1)),COUNTIF($F$2:F77,F77)))","v":"Studiante35"},{"$f":"LARGE($B$2:$B$101,ROWS($F$2:F77))","v":41},76,{"$f":"IF(COUNTIF($G$2:G77,G77)=1,[1]!Order_Salim(G77),[1]!Order_Salim(G77)&\" \"&\"مكرر  \"& COUNTIF($G$2:G77,G77)-1)","v":"السّادس والسّبعون"}]
["Studiante77",59,null,null,{"$f":"INDEX($A$2:$A$101,SMALL(IF($B$2:$B$101<>\"\",IF($B$2:$B$101=$F78,ROW($B$2:$B$101)-ROW($B$2)+1)),COUNTIF($F$2:F78,F78)))","v":"Studiante59"},{"$f":"LARGE($B$2:$B$101,ROWS($F$2:F78))","v":41},76,{"$f":"IF(COUNTIF($G$2:G78,G78)=1,[1]!Order_Salim(G78),[1]!Order_Salim(G78)&\" \"&\"مكرر  \"& COUNTIF($G$2:G78,G78)-1)","v":"السّادس والسّبعون مكرر  1"}]
["Studiante78",66,null,null,{"$f":"INDEX($A$2:$A$101,SMALL(IF($B$2:$B$101<>\"\",IF($B$2:$B$101=$F79,ROW($B$2:$B$101)-ROW($B$2)+1)),COUNTIF($F$2:F79,F79)))","v":"Studiante85"},{"$f":"LARGE($B$2:$B$101,ROWS($F$2:F79))","v":41},76,{"$f":"IF(COUNTIF($G$2:G79,G79)=1,[1]!Order_Salim(G79),[1]!Order_Salim(G79)&\" \"&\"مكرر  \"& COUNTIF($G$2:G79,G79)-1)","v":"السّادس والسّبعون مكرر  2"}]
["Studiante79",37,null,null,{"$f":"INDEX($A$2:$A$101,SMALL(IF($B$2:$B$101<>\"\",IF($B$2:$B$101=$F80,ROW($B$2:$B$101)-ROW($B$2)+1)),COUNTIF($F$2:F80,F80)))","v":"Studiante32"},{"$f":"LARGE($B$2:$B$101,ROWS($F$2:F80))","v":40},79,{"$f":"IF(COUNTIF($G$2:G80,G80)=1,[1]!Order_Salim(G80),[1]!Order_Salim(G80)&\" \"&\"مكرر  \"& COUNTIF($G$2:G80,G80)-1)","v":"التّاسع والسّبعون"}]
["Studiante80",63,null,null,{"$f":"INDEX($A$2:$A$101,SMALL(IF($B$2:$B$101<>\"\",IF($B$2:$B$101=$F81,ROW($B$2:$B$101)-ROW($B$2)+1)),COUNTIF($F$2:F81,F81)))","v":"Studiante98"},{"$f":"LARGE($B$2:$B$101,ROWS($F$2:F81))","v":40},79,{"$f":"IF(COUNTIF($G$2:G81,G81)=1,[1]!Order_Salim(G81),[1]!Order_Salim(G81)&\" \"&\"مكرر  \"& COUNTIF($G$2:G81,G81)-1)","v":"التّاسع والسّبعون مكرر  1"}]
["Studiante81",37,null,null,{"$f":"INDEX($A$2:$A$101,SMALL(IF($B$2:$B$101<>\"\",IF($B$2:$B$101=$F82,ROW($B$2:$B$101)-ROW($B$2)+1)),COUNTIF($F$2:F82,F82)))","v":"Studiante43"},{"$f":"LARGE($B$2:$B$101,ROWS($F$2:F82))","v":39},81,{"$f":"IF(COUNTIF($G$2:G82,G82)=1,[1]!Order_Salim(G82),[1]!Order_Salim(G82)&\" \"&\"مكرر  \"& COUNTIF($G$2:G82,G82)-1)","v":"الحادي والثّمانون"}]
["Studiante82",67,null,null,{"$f":"INDEX($A$2:$A$101,SMALL(IF($B$2:$B$101<>\"\",IF($B$2:$B$101=$F83,ROW($B$2:$B$101)-ROW($B$2)+1)),COUNTIF($F$2:F83,F83)))","v":"Studiante83"},{"$f":"LARGE($B$2:$B$101,ROWS($F$2:F83))","v":39},81,{"$f":"IF(COUNTIF($G$2:G83,G83)=1,[1]!Order_Salim(G83),[1]!Order_Salim(G83)&\" \"&\"مكرر  \"& COUNTIF($G$2:G83,G83)-1)","v":"الحادي والثّمانون مكرر  1"}]
["Studiante83",39,null,null,{"$f":"INDEX($A$2:$A$101,SMALL(IF($B$2:$B$101<>\"\",IF($B$2:$B$101=$F84,ROW($B$2:$B$101)-ROW($B$2)+1)),COUNTIF($F$2:F84,F84)))","v":"Studiante9"},{"$f":"LARGE($B$2:$B$101,ROWS($F$2:F84))","v":38},83,{"$f":"IF(COUNTIF($G$2:G84,G84)=1,[1]!Order_Salim(G84),[1]!Order_Salim(G84)&\" \"&\"مكرر  \"& COUNTIF($G$2:G84,G84)-1)","v":"الثّالث والثّمانون"}]
["Studiante84",46,null,null,{"$f":"INDEX($A$2:$A$101,SMALL(IF($B$2:$B$101<>\"\",IF($B$2:$B$101=$F85,ROW($B$2:$B$101)-ROW($B$2)+1)),COUNTIF($F$2:F85,F85)))","v":"Studiante5"},{"$f":"LARGE($B$2:$B$101,ROWS($F$2:F85))","v":37},84,{"$f":"IF(COUNTIF($G$2:G85,G85)=1,[1]!Order_Salim(G85),[1]!Order_Salim(G85)&\" \"&\"مكرر  \"& COUNTIF($G$2:G85,G85)-1)","v":"الرّابع والثّمانون"}]
["Studiante85",41,null,null,{"$f":"INDEX($A$2:$A$101,SMALL(IF($B$2:$B$101<>\"\",IF($B$2:$B$101=$F86,ROW($B$2:$B$101)-ROW($B$2)+1)),COUNTIF($F$2:F86,F86)))","v":"Studiante18"},{"$f":"LARGE($B$2:$B$101,ROWS($F$2:F86))","v":37},84,{"$f":"IF(COUNTIF($G$2:G86,G86)=1,[1]!Order_Salim(G86),[1]!Order_Salim(G86)&\" \"&\"مكرر  \"& COUNTIF($G$2:G86,G86)-1)","v":"الرّابع والثّمانون مكرر  1"}]
["Studiante86",65,null,null,{"$f":"INDEX($A$2:$A$101,SMALL(IF($B$2:$B$101<>\"\",IF($B$2:$B$101=$F87,ROW($B$2:$B$101)-ROW($B$2)+1)),COUNTIF($F$2:F87,F87)))","v":"Studiante79"},{"$f":"LARGE($B$2:$B$101,ROWS($F$2:F87))","v":37},84,{"$f":"IF(COUNTIF($G$2:G87,G87)=1,[1]!Order_Salim(G87),[1]!Order_Salim(G87)&\" \"&\"مكرر  \"& COUNTIF($G$2:G87,G87)-1)","v":"الرّابع والثّمانون مكرر  2"}]
["Studiante87",75,null,null,{"$f":"INDEX($A$2:$A$101,SMALL(IF($B$2:$B$101<>\"\",IF($B$2:$B$101=$F88,ROW($B$2:$B$101)-ROW($B$2)+1)),COUNTIF($F$2:F88,F88)))","v":"Studiante81"},{"$f":"LARGE($B$2:$B$101,ROWS($F$2:F88))","v":37},84,{"$f":"IF(COUNTIF($G$2:G88,G88)=1,[1]!Order_Salim(G88),[1]!Order_Salim(G88)&\" \"&\"مكرر  \"& COUNTIF($G$2:G88,G88)-1)","v":"الرّابع والثّمانون مكرر  3"}]
["Studiante88",77,null,null,{"$f":"INDEX($A$2:$A$101,SMALL(IF($B$2:$B$101<>\"\",IF($B$2:$B$101=$F89,ROW($B$2:$B$101)-ROW($B$2)+1)),COUNTIF($F$2:F89,F89)))","v":"Studiante24"},{"$f":"LARGE($B$2:$B$101,ROWS($F$2:F89))","v":36},88,{"$f":"IF(COUNTIF($G$2:G89,G89)=1,[1]!Order_Salim(G89),[1]!Order_Salim(G89)&\" \"&\"مكرر  \"& COUNTIF($G$2:G89,G89)-1)","v":"الثّامن والثّمانون"}]
["Studiante89",47,null,null,{"$f":"INDEX($A$2:$A$101,SMALL(IF($B$2:$B$101<>\"\",IF($B$2:$B$101=$F90,ROW($B$2:$B$101)-ROW($B$2)+1)),COUNTIF($F$2:F90,F90)))","v":"Studiante90"},{"$f":"LARGE($B$2:$B$101,ROWS($F$2:F90))","v":35},89,{"$f":"IF(COUNTIF($G$2:G90,G90)=1,[1]!Order_Salim(G90),[1]!Order_Salim(G90)&\" \"&\"مكرر  \"& COUNTIF($G$2:G90,G90)-1)","v":"التّاسع والثّمانون"}]
["Studiante90",35,null,null,{"$f":"INDEX($A$2:$A$101,SMALL(IF($B$2:$B$101<>\"\",IF($B$2:$B$101=$F91,ROW($B$2:$B$101)-ROW($B$2)+1)),COUNTIF($F$2:F91,F91)))","v":"Studiante100"},{"$f":"LARGE($B$2:$B$101,ROWS($F$2:F91))","v":35},89,{"$f":"IF(COUNTIF($G$2:G91,G91)=1,[1]!Order_Salim(G91),[1]!Order_Salim(G91)&\" \"&\"مكرر  \"& COUNTIF($G$2:G91,G91)-1)","v":"التّاسع والثّمانون مكرر  1"}]
["Studiante91",60,null,null,{"$f":"INDEX($A$2:$A$101,SMALL(IF($B$2:$B$101<>\"\",IF($B$2:$B$101=$F92,ROW($B$2:$B$101)-ROW($B$2)+1)),COUNTIF($F$2:F92,F92)))","v":"Studiante47"},{"$f":"LARGE($B$2:$B$101,ROWS($F$2:F92))","v":33},91,{"$f":"IF(COUNTIF($G$2:G92,G92)=1,[1]!Order_Salim(G92),[1]!Order_Salim(G92)&\" \"&\"مكرر  \"& COUNTIF($G$2:G92,G92)-1)","v":"الحادي والتّسعون"}]
["Studiante92",75,null,null,{"$f":"INDEX($A$2:$A$101,SMALL(IF($B$2:$B$101<>\"\",IF($B$2:$B$101=$F93,ROW($B$2:$B$101)-ROW($B$2)+1)),COUNTIF($F$2:F93,F93)))","v":"Studiante49"},{"$f":"LARGE($B$2:$B$101,ROWS($F$2:F93))","v":33},91,{"$f":"IF(COUNTIF($G$2:G93,G93)=1,[1]!Order_Salim(G93),[1]!Order_Salim(G93)&\" \"&\"مكرر  \"& COUNTIF($G$2:G93,G93)-1)","v":"الحادي والتّسعون مكرر  1"}]
["Studiante93",31,null,null,{"$f":"INDEX($A$2:$A$101,SMALL(IF($B$2:$B$101<>\"\",IF($B$2:$B$101=$F94,ROW($B$2:$B$101)-ROW($B$2)+1)),COUNTIF($F$2:F94,F94)))","v":"Studiante51"},{"$f":"LARGE($B$2:$B$101,ROWS($F$2:F94))","v":33},91,{"$f":"IF(COUNTIF($G$2:G94,G94)=1,[1]!Order_Salim(G94),[1]!Order_Salim(G94)&\" \"&\"مكرر  \"& COUNTIF($G$2:G94,G94)-1)","v":"الحادي والتّسعون مكرر  2"}]
["Studiante94",54,null,null,{"$f":"INDEX($A$2:$A$101,SMALL(IF($B$2:$B$101<>\"\",IF($B$2:$B$101=$F95,ROW($B$2:$B$101)-ROW($B$2)+1)),COUNTIF($F$2:F95,F95)))","v":"Studiante74"},{"$f":"LARGE($B$2:$B$101,ROWS($F$2:F95))","v":33},91,{"$f":"IF(COUNTIF($G$2:G95,G95)=1,[1]!Order_Salim(G95),[1]!Order_Salim(G95)&\" \"&\"مكرر  \"& COUNTIF($G$2:G95,G95)-1)","v":"الحادي والتّسعون مكرر  3"}]
["Studiante95",75,null,null,{"$f":"INDEX($A$2:$A$101,SMALL(IF($B$2:$B$101<>\"\",IF($B$2:$B$101=$F96,ROW($B$2:$B$101)-ROW($B$2)+1)),COUNTIF($F$2:F96,F96)))","v":"Studiante75"},{"$f":"LARGE($B$2:$B$101,ROWS($F$2:F96))","v":33},91,{"$f":"IF(COUNTIF($G$2:G96,G96)=1,[1]!Order_Salim(G96),[1]!Order_Salim(G96)&\" \"&\"مكرر  \"& COUNTIF($G$2:G96,G96)-1)","v":"الحادي والتّسعون مكرر  4"}]
["Studiante96",64,null,null,{"$f":"INDEX($A$2:$A$101,SMALL(IF($B$2:$B$101<>\"\",IF($B$2:$B$101=$F97,ROW($B$2:$B$101)-ROW($B$2)+1)),COUNTIF($F$2:F97,F97)))","v":"Studiante20"},{"$f":"LARGE($B$2:$B$101,ROWS($F$2:F97))","v":32},96,{"$f":"IF(COUNTIF($G$2:G97,G97)=1,[1]!Order_Salim(G97),[1]!Order_Salim(G97)&\" \"&\"مكرر  \"& COUNTIF($G$2:G97,G97)-1)","v":"السّادس والتّسعون"}]
["Studiante97",48,null,null,{"$f":"INDEX($A$2:$A$101,SMALL(IF($B$2:$B$101<>\"\",IF($B$2:$B$101=$F98,ROW($B$2:$B$101)-ROW($B$2)+1)),COUNTIF($F$2:F98,F98)))","v":"Studiante53"},{"$f":"LARGE($B$2:$B$101,ROWS($F$2:F98))","v":31},97,{"$f":"IF(COUNTIF($G$2:G98,G98)=1,[1]!Order_Salim(G98),[1]!Order_Salim(G98)&\" \"&\"مكرر  \"& COUNTIF($G$2:G98,G98)-1)","v":"السّابع والتّسعون"}]
["Studiante98",40,null,null,{"$f":"INDEX($A$2:$A$101,SMALL(IF($B$2:$B$101<>\"\",IF($B$2:$B$101=$F99,ROW($B$2:$B$101)-ROW($B$2)+1)),COUNTIF($F$2:F99,F99)))","v":"Studiante93"},{"$f":"LARGE($B$2:$B$101,ROWS($F$2:F99))","v":31},97,{"$f":"IF(COUNTIF($G$2:G99,G99)=1,[1]!Order_Salim(G99),[1]!Order_Salim(G99)&\" \"&\"مكرر  \"& COUNTIF($G$2:G99,G99)-1)","v":"السّابع والتّسعون مكرر  1"}]
["Studiante99",76,null,null,{"$f":"INDEX($A$2:$A$101,SMALL(IF($B$2:$B$101<>\"\",IF($B$2:$B$101=$F100,ROW($B$2:$B$101)-ROW($B$2)+1)),COUNTIF($F$2:F100,F100)))","v":"Studiante40"},{"$f":"LARGE($B$2:$B$101,ROWS($F$2:F100))","v":30},99,{"$f":"IF(COUNTIF($G$2:G100,G100)=1,[1]!Order_Salim(G100),[1]!Order_Salim(G100)&\" \"&\"مكرر  \"& COUNTIF($G$2:G100,G100)-1)","v":"التّاسع والتّسعون"}]
["Studiante100",35,null,null,{"$f":"INDEX($A$2:$A$101,SMALL(IF($B$2:$B$101<>\"\",IF($B$2:$B$101=$F101,ROW($B$2:$B$101)-ROW($B$2)+1)),COUNTIF($F$2:F101,F101)))","v":"Studiante57"},{"$f":"LARGE($B$2:$B$101,ROWS($F$2:F101))","v":30},99,{"$f":"IF(COUNTIF($G$2:G101,G101)=1,[1]!Order_Salim(G101),[1]!Order_Salim(G101)&\" \"&\"مكرر  \"& COUNTIF($G$2:G101,G101)-1)","v":"التّاسع والتّسعون مكرر  1"}]

{"sheet":"Sheet3","index":2,"n_rows":0,"n_cols":0,"rows_kept":0,"cut":false,"hidden":false,"merged":[]}