{"text_format":"1","workbook":"xlsx","n_sheets":2,"sheets":["sh1","sh2"],"not_rendered":{"charts":0,"images":1,"macros":1,"external_links":0,"defined_names":0,"comments":0,"pivot_tables":0},"unopened":[],"bounds":{"document_bytes":16777216,"sheet_cells":100000,"rows_first":2000,"rows_last":500,"rows_between":2000,"halvings":0,"cell_chars":16384,"cell_head_chars":4096},"cells_cut":0,"cells_raw":0,"read":"whole","date_system":"1900"}

{"sheet":"sh1","index":0,"n_rows":15,"n_cols":7,"rows_kept":15,"cut":false,"hidden":false,"merged":[]}
[]
[]
[null,"العميل ","يناير","فبراير","مارس","ابريل","إجمالي العميل"]
[null,"محمد ",1000,1500,0,6500,{"$f":"SUM(C4:F4)","v":9000}]
[null,"سالم ",1500,2000,4500,1200,{"$f":"SUM(C5:F5)","v":9200}]
[null,"علي",0,2500,5500,4500,12500]
[null,"ناصر ",1200,null,1200,0,2400]
[null,"زيد ",500,4500,6500,6500,18000]
[null,"إجمالي العملاء ",{"$f":"SUM(C4:C8)","v":4200},{"$f":"SUM(D4:D8)","v":10500},17700,18700,51100]
[]
[null,"المورد","يناير","فبراير","مارس","ابريل","إجمالي المورد"]
[null,"نعمان",1100,1600,100,6600,{"$f":"SUM(C12:F12)","v":9400}]
[null,"مبارك",1600,null,4600,0,{"$f":"SUM(C13:F13)","v":6200}]
[null,"بسام ",100,2600,0,4600,{"$f":"SUM(C14:F14)","v":7300}]
[null,"إجمالي الموردين",{"$f":"SUM(C12:C14)","v":2800},{"$f":"SUM(D12:D14)","v":4200},4700,11200,22900]

{"sheet":"sh2","index":1,"n_rows":16,"n_cols":11,"rows_kept":16,"cut":false,"hidden":false,"merged":[]}
[]
[null,null,"فبراير"]
[]
[null,"العميل ","المبلغ",null,null,null,null,null,null,null,"يناير"]
[null,"محمد ",{"$f":"INDEX('sh1'!$C$4:$G$8,MATCH($C$2,'sh1'!$C$3:$G$3,0),MATCH(B5,'sh1'!$B$4:$B$8,0))","v":1500},null,null,null,null,null,null,null,"فبراير"]
[null,"سالم ",{"$f":"INDEX('sh1'!$C$4:$G$8,MATCH($C$2,'sh1'!$C$3:$G$3,0),MATCH(B6,'sh1'!$B$4:$B$8,0))","v":2000},null,null,null,null,null,null,null,"مارس"]
[null,"علي",{"$f":"INDEX('sh1'!$C$4:$G$8,MATCH($C$2,'sh1'!$C$3:$G$3,0),MATCH(B7,'sh1'!$B$4:$B$8,0))","v":4500},null,null,null,null,null,null,null,"ابريل"]
[null,"ناصر ",{"$f":"INDEX('sh1'!$C$4:$G$8,MATCH($C$2,'sh1'!$C$3:$G$3,0),MATCH(B8,'sh1'!$B$4:$B$8,0))","v":1200},null,null,null,null,null,null,null,"إجمالي العميل"]
[null,"زيد ",{"$f":"INDEX('sh1'!$C$4:$G$8,MATCH($C$2,'sh1'!$C$3:$G$3,0),MATCH(B9,'sh1'!$B$4:$B$8,0))","v":9200},null,null,null,null,null,null,null,"إجمالي المورد"]
[null,"إجمالي العميل",{"$f":"SUM(C5:C9)","v":18400}]
[]
[null,"المورد","المبلغ"]
[null,"نعمان",{"$f":"INDEX('sh1'!$C$12:$G$14,MATCH($C$2,'sh1'!$C$11:$G$11,0),MATCH(B13,'sh1'!$B$12:$B$14,0))","v":1600}]
[null,"مبارك",{"$f":"INDEX('sh1'!$C$12:$G$14,MATCH($C$2,'sh1'!$C$11:$G$11,0),MATCH(B14,'sh1'!$B$12:$B$14,0))","v":0}]
[null,"بسام ",{"$f":"INDEX('sh1'!$C$12:$G$14,MATCH($C$2,'sh1'!$C$11:$G$11,0),MATCH(B15,'sh1'!$B$12:$B$14,0))","v":4600}]
[null,"الإجمالي ",{"$f":"SUM(C13:C15)","v":6200}]