{"text_format":"1","workbook":"xlsx","n_sheets":5,"sheets":["البحث","بنزين","كاز","نفط","الموقف"],"not_rendered":{"charts":0,"images":0,"macros":1,"external_links":0,"defined_names":2,"comments":0,"pivot_tables":0},"unopened":[],"bounds":{"document_bytes":16777216,"sheet_cells":100000,"rows_first":2000,"rows_last":500,"rows_between":2000,"halvings":0,"cell_chars":16384,"cell_head_chars":4096},"cells_cut":0,"cells_raw":0,"read":"whole","date_system":"1900"}

{"sheet":"البحث","index":0,"n_rows":3,"n_cols":13,"rows_kept":3,"cut":false,"hidden":false,"merged":[]}
[null,null,null,null,null,null,555014]
[]
["ت","اسم المحطة","رقم المستند","تاريخ التحميل","تاريخ التفريغ","رقم السيارة","اسم السائق","الكمية (طبيعي)","المحمل (قياسي)","القياسي (المفرغ)","السعر","المبلغ الكلي","نوع المنتوج"]

{"sheet":"بنزين","index":1,"n_rows":23,"n_cols":15,"rows_kept":23,"cut":false,"hidden":false,"merged":[]}
["ت",null,null,"تاريخ التحميل",null,"رقم السيارة","اسم السائق",null,null,null,null,null,"نوع المنتوج","موجود/غير موجود"]
[1,null,null,"2018-07-04",null,29911,"مهدي صالح حماد",null,null,null,null,null,"بنزين",{"$f":"IF(O2=\"\",\"غير موجود\",\"موجود\")","v":"غير موجود"},{"$f":"IFERROR(INDEX(الموقف!$B$2:$B$1000,MATCH(D2,الموقف!$D$2:$D$1000,0),MATCH(F2,الموقف!$A$2:$A$1000,0)),\"\")","v":""}]
[2,null,null,"2018-07-07",null,33465,"حيدر علي عبد",null,null,null,null,null,"بنزين",{"$f":"IF(O3=\"\",\"غير موجود\",\"موجود\")","v":"غير موجود"},{"$f":"IFERROR(INDEX(الموقف!$B$2:$B$1000,MATCH(D3,الموقف!$D$2:$D$1000,0),MATCH(F3,الموقف!$A$2:$A$1000,0)),\"\")","v":""}]
[3,null,null,"2018-07-02",null,6414,"ماهر جمعة حمد",null,null,null,null,null,"بنزين","موجود",{"$f":"IFERROR(INDEX(الموقف!$B$2:$B$1000,MATCH(D4,الموقف!$D$2:$D$1000,0),MATCH(F4,الموقف!$A$2:$A$1000,0)),\"\")","v":"ماهر جمعة حمد"}]
[4,null,null,"2018-07-06",null,6414,"ماهر جمعة حمد",null,null,null,null,null,"بنزين","موجود",{"$f":"IFERROR(INDEX(الموقف!$B$2:$B$1000,MATCH(D5,الموقف!$D$2:$D$1000,0),MATCH(F5,الموقف!$A$2:$A$1000,0)),\"\")","v":"سلام حسين عبد"}]
[5,null,null,"2018-07-12",null,20859,"مثنى عدنان حمد",null,null,null,null,null,"بنزين","غير موجود",{"$f":"IFERROR(INDEX(الموقف!$B$2:$B$1000,MATCH(D6,الموقف!$D$2:$D$1000,0),MATCH(F6,الموقف!$A$2:$A$1000,0)),\"\")","v":""}]
[6,null,null,"2018-07-12",null,29839,"احمد إبراهيم علي",null,null,null,null,null,"بنزين","غير موجود",{"$f":"IFERROR(INDEX(الموقف!$B$2:$B$1000,MATCH(D7,الموقف!$D$2:$D$1000,0),MATCH(F7,الموقف!$A$2:$A$1000,0)),\"\")","v":""}]
[7,null,null,"2018-07-12",null,71793,"انس مشعان حمد",null,null,null,null,null,"بنزين","غير موجود",{"$f":"IFERROR(INDEX(الموقف!$B$2:$B$1000,MATCH(D8,الموقف!$D$2:$D$1000,0),MATCH(F8,الموقف!$A$2:$A$1000,0)),\"\")","v":""}]
[8,null,null,"2018-07-12",null,123456,"علاء حاتم محمد",null,null,null,null,null,"بنزين","غير موجود",{"$f":"IFERROR(INDEX(الموقف!$B$2:$B$1000,MATCH(D9,الموقف!$D$2:$D$1000,0),MATCH(F9,الموقف!$A$2:$A$1000,0)),\"\")","v":""}]
[9,null,null,"2018-07-14",null,50522,"شاكر جبر لاحج",null,null,null,null,null,"بنزين","غير موجود",{"$f":"IFERROR(INDEX(الموقف!$B$2:$B$1000,MATCH(D10,الموقف!$D$2:$D$1000,0),MATCH(F10,الموقف!$A$2:$A$1000,0)),\"\")","v":""}]
[10,null,null,"2018-07-17",null,15419,"صلاح نوري زيدان",null,null,null,null,null,"بنزين","غير موجود",{"$f":"IFERROR(INDEX(الموقف!$B$2:$B$1000,MATCH(D11,الموقف!$D$2:$D$1000,0),MATCH(F11,الموقف!$A$2:$A$1000,0)),\"\")","v":""}]
[11,null,null,"2018-07-17",null,39418,"عماد كامل محمد",null,null,null,null,null,"بنزين","غير موجود",{"$f":"IFERROR(INDEX(الموقف!$B$2:$B$1000,MATCH(D12,الموقف!$D$2:$D$1000,0),MATCH(F12,الموقف!$A$2:$A$1000,0)),\"\")","v":""}]
[12,null,null,"2018-07-18",null,13518,"سفيان شاكر محمود",null,null,null,null,null,"بنزين","غير موجود",{"$f":"IFERROR(INDEX(الموقف!$B$2:$B$1000,MATCH(D13,الموقف!$D$2:$D$1000,0),MATCH(F13,الموقف!$A$2:$A$1000,0)),\"\")","v":""}]
[13,null,null,"2018-07-19",null,1048,"حارث سليمان مصلح",null,null,null,null,null,"بنزين","غير موجود",{"$f":"IFERROR(INDEX(الموقف!$B$2:$B$1000,MATCH(D14,الموقف!$D$2:$D$1000,0),MATCH(F14,الموقف!$A$2:$A$1000,0)),\"\")","v":""}]
[14,null,null,"2018-07-19",null,571,"أنور مجيد احميد",null,null,null,null,null,"بنزين","غير موجود",{"$f":"IFERROR(INDEX(الموقف!$B$2:$B$1000,MATCH(D15,الموقف!$D$2:$D$1000,0),MATCH(F15,الموقف!$A$2:$A$1000,0)),\"\")","v":""}]
[15,null,null,"2018-07-19",null,13082,"فاكر احميد غايب",null,null,null,null,null,"بنزين","غير موجود",{"$f":"IFERROR(INDEX(الموقف!$B$2:$B$1000,MATCH(D16,الموقف!$D$2:$D$1000,0),MATCH(F16,الموقف!$A$2:$A$1000,0)),\"\")","v":""}]
[16,null,null,"2018-07-19",null,52726,"مخلف عويد فرحان",null,null,null,null,null,"بنزين","غير موجود",{"$f":"IFERROR(INDEX(الموقف!$B$2:$B$1000,MATCH(D17,الموقف!$D$2:$D$1000,0),MATCH(F17,الموقف!$A$2:$A$1000,0)),\"\")","v":""}]
[17,null,null,"2018-07-19",null,65239,"عودة مطر خلف",null,null,null,null,null,"بنزين","غير موجود",{"$f":"IFERROR(INDEX(الموقف!$B$2:$B$1000,MATCH(D18,الموقف!$D$2:$D$1000,0),MATCH(F18,الموقف!$A$2:$A$1000,0)),\"\")","v":""}]
[18,null,null,"2018-07-20",null,2078,"رعد رجاء عبد",null,null,null,null,null,"بنزين","غير موجود",{"$f":"IFERROR(INDEX(الموقف!$B$2:$B$1000,MATCH(D19,الموقف!$D$2:$D$1000,0),MATCH(F19,الموقف!$A$2:$A$1000,0)),\"\")","v":""}]
[19,null,null,"2018-07-20",null,44270,"باسم رياح صبار",null,null,null,null,null,"بنزين","غير موجود",{"$f":"IFERROR(INDEX(الموقف!$B$2:$B$1000,MATCH(D20,الموقف!$D$2:$D$1000,0),MATCH(F20,الموقف!$A$2:$A$1000,0)),\"\")","v":""}]
[20,null,null,"2018-07-20",null,31115,"حسين علي شهاب",null,null,null,null,null,"بنزين","غير موجود",{"$f":"IFERROR(INDEX(الموقف!$B$2:$B$1000,MATCH(D21,الموقف!$D$2:$D$1000,0),MATCH(F21,الموقف!$A$2:$A$1000,0)),\"\")","v":""}]
[]
["ت",null,null,"تاريخ التحميل",null,"رقم السيارة","اسم السائق",null,null,null,null,null,"نوع المنتوج","موجود/غير موجود"]

{"sheet":"كاز","index":2,"n_rows":0,"n_cols":0,"rows_kept":0,"cut":false,"hidden":false,"merged":[]}

{"sheet":"نفط","index":3,"n_rows":0,"n_cols":0,"rows_kept":0,"cut":false,"hidden":false,"merged":[]}

{"sheet":"الموقف","index":4,"n_rows":931,"n_cols":4,"rows_kept":931,"cut":false,"hidden":false,"merged":[]}
["رقم السيارة/شهر السابع","اسم السائق","ت","تاريخ التحميل"]
[6414,"ماهر جمعة حمد",1,"2018-07-02"]
[44270,"باسم رياح صبار",2,"2018-07-02"]
[5412,"أنور جمعة خالد",3,"2018-07-02"]
[9187,"محمد صالح حمود",4,"2018-07-02"]
[555312,"علي سامي حميد",5,"2018-07-02"]
[579,"ماهر صعب حسين",6,"2018-07-02"]
[56991,"علي حميد سمير",7,"2018-07-02"]
[39060,"عمر احمد زيدان",8,"2018-07-03"]
[86890,"طه غركان بزل",9,"2018-07-03"]
[1048,"رشيد يوسف رشيد",10,"2018-07-03"]
[24831,"عبد محمود ناصر",11,"2018-07-03"]
[76503,"محمد عبيد عبدالله",12,"2018-07-03"]
[37330,"سعدون حمد كسار",13,"2018-07-03"]
[36875,"شاكر محمود عبدالله",14,"2018-07-03"]
[50195,"محمود محمد فريح",15,"2018-07-03"]
[80325,"باسم حسن كصاد",16,"2018-07-03"]
[86814,"شاكر محمود عبيد",17,"2018-07-03"]
[557720,"اياد عبد خلف",18,"2018-07-03"]
[31331,"ابراهيم محمد زيدان",19,"2018-07-03"]
[5181,"احمد محمد إبراهيم",20,"2018-07-03"]
[36945,"احمد عبيد عبدالله",21,"2018-07-03"]
[46023,"ستار مصلح ذياب",22,"2018-07-03"]
[104055,"أسامة نوري زيدان",23,"2018-07-03"]
[55008,"فؤاد إسماعيل غزاي",24,"2018-07-03"]
[12724,"طارق جبل عبود",25,"2018-07-04"]
[44964,"محمود جسام عبيد",26,"2018-07-04"]
[52550,"حسين علي بوال",27,"2018-07-04"]
[34761,"طالب غزاي عفتان",28,"2018-07-04"]
[127237,"قاسم محمد عوينه",29,"2018-07-04"]
[31115,"حسين علي شهاب",30,"2018-07-04"]
[33457,"علي صبري حردان",31,"2018-07-04"]
[5593,"عمر اكرم زبن",32,"2018-07-04"]
[131386,"محمد مصلح ذياب",33,"2018-07-04"]
[35353,"كريم حمد حماد",34,"2018-07-04"]
[101746,"هاني علي بوال",35,"2018-07-04"]
[10321,"حاتم محمود ناصر",36,"2018-07-04"]
[13061,"احمد ابراهيم سعيد",37,"2018-07-04"]
[30642,"اركان كريم خلف",38,"2018-07-04"]
[558402,"منيف صعب حسين",39,"2018-07-04"]
[38681,"محمد عويد فرحان",40,"2018-07-04"]
[52726,"مخلف عويد فرحان",41,"2018-07-04"]
[45674,"مرشد فيحان عويد",42,"2018-07-04"]
[29686,"مصطفى خميس محمد",43,"2018-07-04"]
[24902,"علي عجيمي احميد",44,"2018-07-04"]
[55031,"صابر جمعة حمد",45,"2018-07-04"]
[105471,"مهند ستار شهاب",46,"2018-07-04"]
[31099,"مجيد فليح فرحان",47,"2018-07-04"]
[19186,"خميس احميد غايب",48,"2018-07-04"]
[24568,"فراس خلف محمد",49,"2018-07-04"]
[29552,"مجيد مشرف افتيخان",50,"2018-07-04"]
[54449,"عمر عبد رشيد",51,"2018-07-04"]
[15362,"ياس مبروك محمد",52,"2018-07-04"]
[15582,"عبدالله عبد محمد",53,"2018-07-04"]
[11724,"فؤاد حسين حمد",54,"2018-07-04"]
[58115,"صفاء محمد فرحان",55,"2018-07-04"]
[13082,"فاكر احميد غايب",56,"2018-07-04"]
[38515,"عدنان علي هاشم",57,"2018-07-04"]
[50522,"شاكر جبر لاحج",58,"2018-07-04"]
[31300,"حسان حسين محمد",59,"2018-07-04"]
[508,"زهير ضاري زيدان",60,"2018-07-04"]
[21304,"محمد ضاري زيدان",61,"2018-07-04"]
[15946,"أنور صعب حسين",62,"2018-07-04"]
[52491,"علاوي صالح حماد",63,"2018-07-04"]
[15419,"صلاح نوري زيدان",64,"2018-07-04"]
[6631,"محمود محمد حمد",65,"2018-07-04"]
[5412,"أنور جمعة خالد",66,"2018-07-04"]
[7469,"تحسين محمد زغير",67,"2018-07-04"]
[828,"ليث شاكر احميد",68,"2018-07-04"]
[11404,"أسامة شاكر صالح",69,"2018-07-04"]
[258,"مازن هادي صالح",70,"2018-07-04"]
[555691,"عبدالحافظ خليل إبراهيم",71,"2018-07-04"]
[16659,"طاهر خلف ضايع",72,"2018-07-04"]
[103342,"مجبل عويد فرحان",73,"2018-07-04"]
[52811,"اركان اسماعيل زيدان",74,"2018-07-04"]
[557881,"خلدون محمد نائل",75,"2018-07-04"]
[29911,"مهدي صالح حماد",76,"2018-07-04"]
[571,"أنور مجيد احميد",77,"2018-07-04"]
[71819,"وائل عارف مشرف",78,"2018-07-05"]
[89581,"جبار عباس خلف",79,"2018-07-05"]
[7259,"بدران محمد حماد",80,"2018-07-05"]
[76512,"خضر طه محمد",81,"2018-07-05"]
[555298,"ليث شاكر احميد",82,"2018-07-05"]
[24480,"عبد إبراهيم حسان",83,"2018-07-05"]
[1054,"محمد فرحان سليمان",84,"2018-07-05"]
[15436,"ناجي محمد سلمان",85,"2018-07-05"]
[35873,"عمر احمد عبدالله",86,"2018-07-05"]
[50647,"علي عويد فرحان",87,"2018-07-05"]
[172905,"وليد سامي حميد",88,"2018-07-05"]
[555196,"مثنى مبارك بردان",89,"2018-07-05"]
[136833,"أسامة جمعة طراد",90,"2018-07-05"]
[35184,"خلف عويد فرحان",91,"2018-07-05"]
[38515,"عدنان علي هاشم",92,"2018-07-05"]
[36946,"محمود عبيد عبدالله",93,"2018-07-05"]
[2748,"جبير محمد زغير",94,"2018-07-05"]
[18294,"مشتاق طالب فريح",95,"2018-07-05"]
[39418,"عماد كامل محمد",96,"2018-07-05"]
[558193,"سليمان هادي صالح",97,"2018-07-05"]
[13614,"علي محمد زيدان",98,"2018-07-05"]
[32880,"ايسر فواز زيدان",99,"2018-07-05"]
[48662,"قحطان عدنان عويد",100,"2018-07-05"]
[3329,"جبير شهاب حمد",101,"2018-07-05"]
[37575,"علاء حاتم محمد",102,"2018-07-05"]
[8252,"قصي عبود عواد",103,"2018-07-05"]
[24568,"فراس خلف محمد",104,"2018-07-05"]
[3698,"سلام حسين عبد",105,"2018-07-06"]
[555691,"عبدالحافظ خليل إبراهيم",106,"2018-07-06"]
[16659,"طاهر خلف ضايع",107,"2018-07-06"]
[6970,"ياسر طاهر خلف",108,"2018-07-06"]
[29839,"احمد إبراهيم علي",109,"2018-07-06"]
[51135,"ميسم جبار دلف",110,"2018-07-06"]
[2078,"رعد رجاء عبد",111,"2018-07-06"]
[36754,"ماجد حميد حماد",112,"2018-07-06"]
[74530,"رزاق فليح حسن",113,"2018-07-06"]
[9028,"لؤي احمد عبدالله",114,"2018-07-06"]
[43424,"محمد محمود عيد",115,"2018-07-06"]
[24859,"رامي علي بوال",116,"2018-07-06"]
[6414,"ماهر جمعة حمد",117,"2018-07-06"]
[44270,"باسم رياح صبار",118,"2018-07-06"]
[9187,"محمد صالح حمود",119,"2018-07-06"]
[555312,"علي سامي حميد",120,"2018-07-06"]
[56991,"علي حميد سمير",121,"2018-07-06"]
[32880,"ايسر فواز زيدان",122,"2018-07-06"]
[104055,"أسامة نوري زيدان",123,"2018-07-06"]
[45674,"مرشد فيحان عويد",124,"2018-07-06"]
[5412,"أنور جمعة خالد",125,"2018-07-06"]
[571,"أنور مجيد احميد",126,"2018-07-06"]
[558402,"منيف صعب حسين",127,"2018-07-06"]
[579,"ماهر صعب حسين",128,"2018-07-06"]
[15946,"أنور صعب حسين",129,"2018-07-06"]
[555196,"مثنى مبارك بردان",130,"2018-07-06"]
[136833,"أسامة جمعة طراد",131,"2018-07-06"]
[35941,"منير رياح صبار",132,"2018-07-06"]
[11404,"أسامة شاكر صالح",133,"2018-07-06"]
[54449,"عمر عبد رشيد",134,"2018-07-06"]
[89581,"جبار عباس خلف",135,"2018-07-07"]
[3698,"سلام حسين عبد",136,"2018-07-07"]
[7259,"بدران محمد حماد",137,"2018-07-07"]
[34761,"طالب غزاي عفتان",138,"2018-07-07"]
[75394,"عمار عبدالستار محمود",139,"2018-07-07"]
[51319,"علاء محمود حسن",140,"2018-07-07"]
[24831,"عبد محمود ناصر",141,"2018-07-07"]
[557790,"عبد الأمير حمد",142,"2018-07-07"]
[15051,"احمد ابراهيم حسان",143,"2018-07-07"]
[38546,"باسم محمد عودة",144,"2018-07-07"]
[14090,"محمد سمير كردي",145,"2018-07-07"]
[97478,"مثنى لطيف محمد",146,"2018-07-07"]
[50195,"محمود محمد فريح",147,"2018-07-07"]
[127237,"قاسم محمد عوينه",148,"2018-07-07"]
[83787,"طالب عارف حمد",149,"2018-07-07"]
[44270,"باسم رياح صبار",150,"2018-07-07"]
[38515,"عدنان علي هاشم",151,"2018-07-07"]
[80325,"باسم حسن كصاد",152,"2018-07-07"]
[8252,"قصي عبود عواد",153,"2018-07-07"]
[14216,"سعد حمد حسن",154,"2018-07-07"]
[20859,"مثنى عدنان حمد",155,"2018-07-07"]
[15419,"صلاح نوري زيدان",156,"2018-07-07"]
[508,"زهير ضاري زيدان",157,"2018-07-07"]
[21304,"محمد ضاري زيدان",158,"2018-07-07"]
[31300,"حسان حسين محمد",159,"2018-07-07"]
[172905,"وليد سامي حميد",160,"2018-07-07"]
[24568,"فراس خلف محمد",161,"2018-07-07"]
[7469,"تحسين محمد زغير",162,"2018-07-07"]
[557881,"خلدون محمد نائل",163,"2018-07-07"]
[55031,"صابر جمعة حمد",164,"2018-07-07"]
[39418,"عماد كامل محمد",165,"2018-07-07"]
[82173,"احمد عويد فرحان",166,"2018-07-07"]
[19186,"خميس احميد غايب",167,"2018-07-07"]
[24902,"علي عجيمي احميد",168,"2018-07-07"]
[555129,"قحطان عجيمي احميد",169,"2018-07-07"]
[29552,"مجيد مشرف افتيخان",170,"2018-07-07"]
[14880,"باسم محمد خلف",171,"2018-07-07"]
[37555,"يوسف مصلح عبد",172,"2018-07-07"]
[11404,"أسامة شاكر صالح",173,"2018-07-07"]
[258,"مازن هادي صالح",174,"2018-07-07"]
[29165,"صبار دحام عبدالله",175,"2018-07-07"]
[38591,"رواد محمد خليفة",176,"2018-07-07"]
[12536,"حسين علي ناصر",177,"2018-07-07"]
[60294,"بسام خليل إبراهيم",178,"2018-07-07"]
[33465,"حيدر علي عبد",179,"2018-07-07"]
[156040,"مهند مشعان حمد",180,"2018-07-07"]
[35941,"منير رياح صبار",181,"2018-07-07"]
[44494,"علي محمد زيدان",182,"2018-07-07"]
[13614,"علي محمد زيدان",183,"2018-07-07"]
[150214,"عامر كاظم محمد",184,"2018-07-07"]
[828,"ليث شاكر احميد",185,"2018-07-07"]
[558193,"سليمان هادي صالح",186,"2018-07-07"]
[30642,"اركان كريم خلف",187,"2018-07-07"]
[13061,"احمد ابراهيم سعيد",188,"2018-07-07"]
[40555,"سمير جميل نايف",189,"2018-07-07"]
[65239,"عودة مطر خلف",190,"2018-07-07"]
[556069,"ماجد طلاب صالح",191,"2018-07-07"]
[508,"زهير ضاري زيدان",192,"2018-07-07"]
[103342,"مجبل عويد فرحان",193,"2018-07-07"]
[35184,"خلف عويد فرحان",194,"2018-07-07"]
[14598,"زياد خليوي عواد",195,"2018-07-07"]
[50647,"علي عويد فرحان",196,"2018-07-07"]
[71819,"وائل عارف مشرف",197,"2018-07-08"]
[92876,"عمر علي فياض",198,"2018-07-08"]
[40191,"عمر علي مسير",199,"2018-07-08"]
[3698,"سلام حسين عبد",200,"2018-07-08"]
[76503,"محمد عبيد عبدالله",201,"2018-07-08"]
[86814,"شاكر محمود عبيد",202,"2018-07-08"]
[557720,"اياد عبد خلف",203,"2018-07-08"]
[31331,"ابراهيم محمد زيدان",204,"2018-07-08"]
[5181,"احمد محمد إبراهيم",205,"2018-07-08"]
[36945,"احمد عبيد عبدالله",206,"2018-07-08"]
[46023,"ستار مصلح ذياب",207,"2018-07-08"]
[44964,"محمود جسام عبيد",208,"2018-07-08"]
[31115,"حسين علي شهاب",209,"2018-07-08"]
[52550,"حسين علي بوال",210,"2018-07-08"]
[33457,"علي صبري حردان",211,"2018-07-08"]
[35353,"كريم حمد حماد",212,"2018-07-08"]
[555298,"ليث شاكر احميد",213,"2018-07-08"]
[38524,"دلف ابراهيم مهنا",214,"2018-07-08"]
[48662,"قحطان عدنان عويد",215,"2018-07-08"]
[101746,"هاني علي بوال",216,"2018-07-08"]
[104055,"أسامة نوري زيدان",217,"2018-07-08"]
[131386,"محمد مصلح ذياب",218,"2018-07-08"]
[11007,"زبن احميد غايب",219,"2018-07-08"]
[19186,"خميس احميد غايب",220,"2018-07-08"]
[15605,"عمار رعد عبدالمنعم",221,"2018-07-08"]
[14523,"علي حسين حمد",222,"2018-07-08"]
[32880,"ايسر فواز زيدان",223,"2018-07-08"]
[36946,"محمود عبيد عبدالله",224,"2018-07-08"]
[1048,"رشيد يوسف رشيد",225,"2018-07-08"]
[258,"مازن هادي صالح",226,"2018-07-08"]
[5412,"أنور جمعة خالد",227,"2018-07-08"]
[38681,"محمد عويد فرحان",228,"2018-07-08"]
[18294,"مشتاق طالب فريح",229,"2018-07-08"]
[10321,"حاتم محمود ناصر",230,"2018-07-08"]
[7259,"بدران محمد حماد",231,"2018-07-09"]
[89581,"جبار عباس خلف",232,"2018-07-09"]
[3698,"سلام حسين عبد",233,"2018-07-09"]
[39060,"عمر احمد زيدان",234,"2018-07-09"]
[42431,"شهاب حمد حماد",235,"2018-07-09"]
[6053,"عمر حربي محمود",236,"2018-07-09"]
[39606,"مروان جمعة محسن",237,"2018-07-09"]
[33691,"باسم عبد خليفه",238,"2018-07-09"]
[55008,"فؤاد إسماعيل غزاي",239,"2018-07-09"]
[76512,"خضر طه محمد",240,"2018-07-09"]
[555196,"مثنى مبارك بردان",241,"2018-07-09"]
[136833,"أسامة جمعة طراد",242,"2018-07-09"]
[13061,"احمد ابراهيم سعيد",243,"2018-07-09"]
[9028,"لؤي احمد عبدالله",244,"2018-07-09"]
[24859,"رامي علي بوال",245,"2018-07-09"]
[44270,"باسم رياح صبار",246,"2018-07-09"]
[555312,"علي سامي حميد",247,"2018-07-09"]
[56991,"علي حميد سمير",248,"2018-07-09"]
[104055,"أسامة نوري زيدان",249,"2018-07-09"]
[105471,"مهند ستار شهاب",250,"2018-07-09"]
[2748,"جبير محمد زغير",251,"2018-07-09"]
[29552,"مجيد مشرف افتيخان",252,"2018-07-09"]
[51319,"علاء محمود حسن",253,"2018-07-09"]
[37555,"يوسف مصلح عبد",254,"2018-07-09"]
[32880,"ايسر فواز زيدان",255,"2018-07-09"]
[557881,"خلدون محمد نائل",256,"2018-07-09"]
[21304,"محمد ضاري زيدان",257,"2018-07-09"]
[52811,"اركان اسماعيل زيدان",258,"2018-07-09"]
[558193,"سليمان هادي صالح",259,"2018-07-09"]
[156816,"ناصر حمد حسين",260,"2018-07-09"]
[6013,"محمد خميس حمد",261,"2018-07-09"]
[15946,"أنور صعب حسين",262,"2018-07-09"]
[45674,"مرشد فيحان عويد",263,"2018-07-09"]
[29686,"مصطفى خميس محمد",264,"2018-07-09"]
[8252,"قصي عبود عواد",265,"2018-07-09"]
[21988,"تحرير يوسف حمود",266,"2018-07-10"]
[41123,"كريم فرج محمد",267,"2018-07-10"]
[24831,"عبد محمود ناصر",268,"2018-07-10"]
[1054,"محمد فرحان سليمان",269,"2018-07-10"]
[15436,"ناجي محمد سلمان",270,"2018-07-10"]
[16659,"طاهر خلف ضايع",271,"2018-07-10"]
[101746,"هاني علي بوال",272,"2018-07-10"]
[104055,"أسامة نوري زيدان",273,"2018-07-10"]
[51135,"ميسم جبار دلف",274,"2018-07-10"]
[2078,"رعد رجاء عبد",275,"2018-07-10"]
[74530,"رزاق فليح حسن",276,"2018-07-10"]
[43424,"محمد محمود عيد",277,"2018-07-10"]
[6414,"ماهر جمعة حمد",278,"2018-07-10"]
[9187,"محمد صالح حمود",279,"2018-07-10"]
[558402,"منيف صعب حسين",280,"2018-07-10"]
[579,"ماهر صعب حسين",281,"2018-07-10"]
[97478,"مثنى لطيف محمد",282,"2018-07-10"]
[127237,"قاسم محمد عوينه",283,"2018-07-10"]
[38515,"عدنان علي هاشم",284,"2018-07-10"]
[80325,"باسم حسن كصاد",285,"2018-07-10"]
[48662,"قحطان عدنان عويد",286,"2018-07-10"]
[131386,"محمد مصلح ذياب",287,"2018-07-10"]
[7469,"تحسين محمد زغير",288,"2018-07-10"]
[571,"أنور مجيد احميد",289,"2018-07-10"]
[828,"ليث شاكر احميد",290,"2018-07-10"]
[36946,"محمود عبيد عبدالله",291,"2018-07-10"]
[31300,"حسان حسين محمد",292,"2018-07-10"]
[13082,"فاكر احميد غايب",293,"2018-07-10"]
[555129,"قحطان عجيمي احميد",294,"2018-07-10"]
[39418,"عماد كامل محمد",295,"2018-07-10"]
[52491,"علاوي صالح حماد",296,"2018-07-10"]
[11724,"فؤاد حسين حمد",297,"2018-07-10"]
[156040,"مهند مشعان حمد",298,"2018-07-10"]
[52213,"محمد علي جدوع",299,"2018-07-10"]
[71819,"وائل عارف مشرف",300,"2018-07-11"]
[85033,"مثنى مبارك بردان",301,"2018-07-11"]
[36875,"شاكر محمود عبدالله",302,"2018-07-11"]
[5593,"عمر اكرم زبن",303,"2018-07-11"]
[35873,"عمر احمد عبدالله",304,"2018-07-11"]
[38546,"باسم محمد عودة",305,"2018-07-11"]
[50195,"محمود محمد فريح",306,"2018-07-11"]
[12536,"حسين علي ناصر",307,"2018-07-11"]
[103342,"مجبل عويد فرحان",308,"2018-07-11"]
[35184,"خلف عويد فرحان",309,"2018-07-11"]
[50647,"علي عويد فرحان",310,"2018-07-11"]
[35353,"كريم حمد حماد",311,"2018-07-11"]
[1048,"رشيد يوسف رشيد",312,"2018-07-11"]
[44270,"باسم رياح صبار",313,"2018-07-11"]
[56991,"علي حميد سمير",314,"2018-07-11"]
[14090,"محمد سمير كردي",315,"2018-07-11"]
[127237,"قاسم محمد عوينه",316,"2018-07-11"]
[555298,"ليث شاكر احميد",317,"2018-07-11"]
[5412,"أنور جمعة خالد",318,"2018-07-11"]
[8252,"قصي عبود عواد",319,"2018-07-11"]
[38515,"عدنان علي هاشم",320,"2018-07-11"]
[131386,"محمد مصلح ذياب",321,"2018-07-11"]
[105471,"مهند ستار شهاب",322,"2018-07-11"]
[29552,"مجيد مشرف افتيخان",323,"2018-07-11"]
[65239,"عودة مطر خلف",324,"2018-07-11"]
[40555,"سمير جميل نايف",325,"2018-07-11"]
[55031,"صابر جمعة حمد",326,"2018-07-11"]
[557881,"خلدون محمد نائل",327,"2018-07-11"]
[571,"أنور مجيد احميد",328,"2018-07-11"]
[24568,"فراس خلف محمد",329,"2018-07-11"]
[15419,"صلاح نوري زيدان",330,"2018-07-11"]
[76503,"محمد عبيد عبدالله",331,"2018-07-11"]
[14679,"جميل عواد احمد",332,"2018-07-11"]
[31099,"مجيد فليح فرحان",333,"2018-07-11"]
[54449,"عمر عبد رشيد",334,"2018-07-11"]
[15946,"أنور صعب حسين",335,"2018-07-11"]
[3698,"سلام حسين عبد",336,"2018-07-12"]
[78675,"إيهاب محمد حسن",337,"2018-07-12"]
[7259,"بدران محمد حماد",338,"2018-07-12"]
[6970,"ياسر طاهر خلف",339,"2018-07-12"]
[29839,"احمد إبراهيم علي",340,"2018-07-12"]
[172905,"وليد سامي حميد",341,"2018-07-12"]
[30642,"اركان كريم خلف",342,"2018-07-12"]
[86814,"شاكر محمود عبيد",343,"2018-07-12"]
[557720,"اياد عبد خلف",344,"2018-07-12"]
[5181,"احمد محمد إبراهيم",345,"2018-07-12"]
[36945,"احمد عبيد عبدالله",346,"2018-07-12"]
[46023,"ستار مصلح ذياب",347,"2018-07-12"]
[44964,"محمود جسام عبيد",348,"2018-07-12"]
[31115,"حسين علي شهاب",349,"2018-07-12"]
[52550,"حسين علي بوال",350,"2018-07-12"]
[33457,"علي صبري حردان",351,"2018-07-12"]
[555298,"ليث شاكر احميد",352,"2018-07-12"]
[51319,"علاء محمود حسن",353,"2018-07-12"]
[15582,"عبدالله عبد محمد",354,"2018-07-12"]
[37555,"يوسف مصلح عبد",355,"2018-07-12"]
[7469,"تحسين محمد زغير",356,"2018-07-12"]
[508,"زهير ضاري زيدان",357,"2018-07-12"]
[21304,"محمد ضاري زيدان",358,"2018-07-12"]
[20859,"مثنى عدنان حمد",359,"2018-07-12"]
[32880,"ايسر فواز زيدان",360,"2018-07-12"]
[71793,"انس مشعان حمد",361,"2018-07-12"]
[13082,"فاكر احميد غايب",362,"2018-07-12"]
[14216,"سعد حمد حسن",363,"2018-07-12"]
[557881,"خلدون محمد نائل",364,"2018-07-12"]
[37575,"علاء حاتم محمد",365,"2018-07-12"]
[6414,"ماهر جمعة حمد",366,"2018-07-12"]
[15605,"عمار رعد عبدالمنعم",367,"2018-07-12"]
[38681,"محمد عويد فرحان",368,"2018-07-12"]
[555691,"عبدالحافظ خليل إبراهيم",369,"2018-07-13"]
[40494,"ثائر عباس محمد",370,"2018-07-13"]
[78675,"إيهاب محمد حسن",371,"2018-07-13"]
[12536,"حسين علي ناصر",372,"2018-07-13"]
[13518,"سفيان شاكر محمود",373,"2018-07-13"]
[24480,"عبد إبراهيم حسان",374,"2018-07-13"]
[75394,"عمار عبدالستار محمود",375,"2018-07-13"]
[83787,"طالب عارف حمد",376,"2018-07-13"]
[40191,"عمر علي مسير",377,"2018-07-13"]
[1048,"رشيد يوسف رشيد",378,"2018-07-13"]
[10321,"حاتم محمود ناصر",379,"2018-07-13"]
[31300,"حسان حسين محمد",380,"2018-07-13"]
[42431,"شهاب حمد حماد",381,"2018-07-13"]
[55008,"فؤاد إسماعيل غزاي",382,"2018-07-13"]
[136833,"أسامة جمعة طراد",383,"2018-07-13"]
[9028,"لؤي احمد عبدالله",384,"2018-07-13"]
[24859,"رامي علي بوال",385,"2018-07-13"]
[555312,"علي سامي حميد",386,"2018-07-13"]
[45674,"مرشد فيحان عويد",387,"2018-07-13"]
[21988,"تحرير يوسف حمود",388,"2018-07-13"]
[24831,"عبد محمود ناصر",389,"2018-07-13"]
[89581,"جبار عباس خلف",390,"2018-07-14"]
[71819,"وائل عارف مشرف",391,"2018-07-14"]
[3698,"سلام حسين عبد",392,"2018-07-14"]
[37330,"سعدون حمد كسار",393,"2018-07-14"]
[76512,"خضر طه محمد",394,"2018-07-14"]
[29686,"مصطفى خميس محمد",395,"2018-07-14"]
[41123,"كريم فرج محمد",396,"2018-07-14"]
[1054,"محمد فرحان سليمان",397,"2018-07-14"]
[15436,"ناجي محمد سلمان",398,"2018-07-14"]
[16659,"طاهر خلف ضايع",399,"2018-07-14"]
{"$rows_left_out":531}