{"text_format":"1","workbook":"xlsx","n_sheets":5,"sheets":["Price","Data","Excurcion","Sheet2","Sources"],"not_rendered":{"charts":0,"images":0,"macros":0,"external_links":3,"defined_names":25,"comments":1,"pivot_tables":0},"unopened":[],"bounds":{"document_bytes":16777216,"sheet_cells":100000,"rows_first":2000,"rows_last":500,"rows_between":2000,"halvings":0,"cell_chars":16384,"cell_head_chars":4096},"cells_cut":0,"cells_raw":0,"read":"whole","date_system":"1900"}

{"sheet":"Price","index":0,"n_rows":272,"n_cols":3,"rows_kept":272,"cut":false,"hidden":true,"merged":[]}
[]
[null,null,"30 pax"]
["tripe","price","price child"]
[]
[]
[]
["Alex Cairo",220,110]
["Cairo",110,55]
["Cairo Package 1",95,50]
["Luxor",114,57]
["LUXOR 2",90,45]
["LUXOR 2  Package 5",79,40]
["LUXOR 2  Package 7",80,40]
["LUXOR 2  Package 12",80,40]
["VIP Luxor",158,79]
{"$rows_left_out":258}
{"sheet":"Data","index":1,"n_rows":444,"n_cols":10,"rows_kept":444,"cut":false,"hidden":false,"merged":[]}
["Excursion",null,"Excursion date","ADL (group)","CHD (group)","Hotel town","Total sum","Note","Transfer","Real Price  $"]
["MOTO2",{"$f":"IFERROR(VLOOKUP(A2,Sheet2!$B$2:$C$18,2,0),\"\")","v":"Moto 2"},"2018-08-01",2,0,"HURGADA",80,null,{"$f":"IFERROR(VALUE(IF(ISERROR(MATCH(A2,Sources!$B:$B,0)),IF(ISERROR(MATCH(F2,Sources!$C:$C,0)),\"\",5*D2+3*E2),IF(AND(NOT(ISERROR(MATCH(A2,Sources!$D:$D,0))),NOT(ISERROR(MATCH(F2,Sources!$E:$E,0)))),5*D2+3*E2,\"\"))&IF(AND(ISERROR(MATCH(A2,Sources!$F:$F,0)),NOT(ISERROR(MATCH(F2,Sources!$G:$G,0)))),5*D2+3*E2,\"\")),\"\")","v":""},{"$f":"IF(I2=\"\",G2,(G2-I2))","v":80}]
["MOTO2",{"$f":"IFERROR(VLOOKUP(A3,Sheet2!$B$2:$C$18,2,0),\"\")","v":"Moto 2"},"2018-08-01",2,0,"HURGADA",80,null,{"$f":"IFERROR(VALUE(IF(ISERROR(MATCH(A3,Sources!$B:$B,0)),IF(ISERROR(MATCH(F3,Sources!$C:$C,0)),\"\",5*D3+3*E3),IF(AND(NOT(ISERROR(MATCH(A3,Sources!$D:$D,0))),NOT(ISERROR(MATCH(F3,Sources!$E:$E,0)))),5*D3+3*E3,\"\"))&IF(AND(ISERROR(MATCH(A3,Sources!$F:$F,0)),NOT(ISERROR(MATCH(F3,Sources!$G:$G,0)))),5*D3+3*E3,\"\")),\"\")","v":""},{"$f":"IF(I3=\"\",G3,(G3-I3))","v":80}]
["MOTO 1 HOUR",{"$f":"IFERROR(VLOOKUP(A4,Sheet2!$B$2:$C$18,2,0),\"\")","v":"Moto 1 Hour"},"2018-08-01",1,1,"HURGADA",80,null,{"$f":"IFERROR(VALUE(IF(ISERROR(MATCH(A4,Sources!$B:$B,0)),IF(ISERROR(MATCH(F4,Sources!$C:$C,0)),\"\",5*D4+3*E4),IF(AND(NOT(ISERROR(MATCH(A4,Sources!$D:$D,0))),NOT(ISERROR(MATCH(F4,Sources!$E:$E,0)))),5*D4+3*E4,\"\"))&IF(AND(ISERROR(MATCH(A4,Sources!$F:$F,0)),NOT(ISERROR(MATCH(F4,Sources!$G:$G,0)))),5*D4+3*E4,\"\")),\"\")","v":""},80]
["OVER DAY LUXORQUEEN VALLY",{"$f":"IFERROR(VLOOKUP(A5,Sheet2!$B$2:$C$18,2,0),\"\")","v":"LUXOR 2"},"2018-08-01",1,0,"HURGADA",88,null,{"$f":"IFERROR(VALUE(IF(ISERROR(MATCH(A5,Sources!$B:$B,0)),IF(ISERROR(MATCH(F5,Sources!$C:$C,0)),\"\",5*D5+3*E5),IF(AND(NOT(ISERROR(MATCH(A5,Sources!$D:$D,0))),NOT(ISERROR(MATCH(F5,Sources!$E:$E,0)))),5*D5+3*E5,\"\"))&IF(AND(ISERROR(MATCH(A5,Sources!$F:$F,0)),NOT(ISERROR(MATCH(F5,Sources!$G:$G,0)))),5*D5+3*E5,\"\")),\"\")","v":""},88]
["OVER DAY LUXORQUEEN VALLY",{"$f":"IFERROR(VLOOKUP(A6,Sheet2!$B$2:$C$18,2,0),\"\")","v":"LUXOR 2"},"2018-08-01",3,0,"HURGADA",264,"belarus",{"$f":"IFERROR(VALUE(IF(ISERROR(MATCH(A6,Sources!$B:$B,0)),IF(ISERROR(MATCH(F6,Sources!$C:$C,0)),\"\",5*D6+3*E6),IF(AND(NOT(ISERROR(MATCH(A6,Sources!$D:$D,0))),NOT(ISERROR(MATCH(F6,Sources!$E:$E,0)))),5*D6+3*E6,\"\"))&IF(AND(ISERROR(MATCH(A6,Sources!$F:$F,0)),NOT(ISERROR(MATCH(F6,Sources!$G:$G,0)))),5*D6+3*E6,\"\")),\"\")","v":""},264]
["OVER DAY LUXORQUEEN VALLY",{"$f":"IFERROR(VLOOKUP(A7,Sheet2!$B$2:$C$18,2,0),\"\")","v":"LUXOR 2"},"2018-08-01",2,1,"HURGADA",220,"ukraine",{"$f":"IFERROR(VALUE(IF(ISERROR(MATCH(A7,Sources!$B:$B,0)),IF(ISERROR(MATCH(F7,Sources!$C:$C,0)),\"\",5*D7+3*E7),IF(AND(NOT(ISERROR(MATCH(A7,Sources!$D:$D,0))),NOT(ISERROR(MATCH(F7,Sources!$E:$E,0)))),5*D7+3*E7,\"\"))&IF(AND(ISERROR(MATCH(A7,Sources!$F:$F,0)),NOT(ISERROR(MATCH(F7,Sources!$G:$G,0)))),5*D7+3*E7,\"\")),\"\")","v":""},220]
["OVER DAY LUXORQUEEN VALLY",{"$f":"IFERROR(VLOOKUP(A8,Sheet2!$B$2:$C$18,2,0),\"\")","v":"LUXOR 2"},"2018-08-01",2,0,"HURGADA",176,"UKRAINE",{"$f":"IFERROR(VALUE(IF(ISERROR(MATCH(A8,Sources!$B:$B,0)),IF(ISERROR(MATCH(F8,Sources!$C:$C,0)),\"\",5*D8+3*E8),IF(AND(NOT(ISERROR(MATCH(A8,Sources!$D:$D,0))),NOT(ISERROR(MATCH(F8,Sources!$E:$E,0)))),5*D8+3*E8,\"\"))&IF(AND(ISERROR(MATCH(A8,Sources!$F:$F,0)),NOT(ISERROR(MATCH(F8,Sources!$G:$G,0)))),5*D8+3*E8,\"\")),\"\")","v":""},176]
["OVER DAY LUXORQUEEN VALLY",{"$f":"IFERROR(VLOOKUP(A9,Sheet2!$B$2:$C$18,2,0),\"\")","v":"LUXOR 2"},"2018-08-01",2,0,"HURGADA",176,"BELARUS",{"$f":"IFERROR(VALUE(IF(ISERROR(MATCH(A9,Sources!$B:$B,0)),IF(ISERROR(MATCH(F9,Sources!$C:$C,0)),\"\",5*D9+3*E9),IF(AND(NOT(ISERROR(MATCH(A9,Sources!$D:$D,0))),NOT(ISERROR(MATCH(F9,Sources!$E:$E,0)))),5*D9+3*E9,\"\"))&IF(AND(ISERROR(MATCH(A9,Sources!$F:$F,0)),NOT(ISERROR(MATCH(F9,Sources!$G:$G,0)))),5*D9+3*E9,\"\")),\"\")","v":""},176]
["OVER DAY LUXORQUEEN VALLY",{"$f":"IFERROR(VLOOKUP(A10,Sheet2!$B$2:$C$18,2,0),\"\")","v":"LUXOR 2"},"2018-08-01",1,1,"MAKADI BAY",132,null,{"$f":"IFERROR(VALUE(IF(ISERROR(MATCH(A10,Sources!$B:$B,0)),IF(ISERROR(MATCH(F10,Sources!$C:$C,0)),\"\",5*D10+3*E10),IF(AND(NOT(ISERROR(MATCH(A10,Sources!$D:$D,0))),NOT(ISERROR(MATCH(F10,Sources!$E:$E,0)))),5*D10+3*E10,\"\"))&IF(AND(ISERROR(MATCH(A10,Sources!$F:$F,0)),NOT(ISERROR(MATCH(F10,Sources!$G:$G,0)))),5*D10+3*E10,\"\")),\"\")","v":""},132]
["RUSALKA  ( MERMAID )",{"$f":"IFERROR(VLOOKUP(A11,Sheet2!$B$2:$C$18,2,0),\"\")","v":"Rusalka (Mermaid)"},"2018-08-02",1,0,"HURGADA",35,null,{"$f":"IFERROR(VALUE(IF(ISERROR(MATCH(A11,Sources!$B:$B,0)),IF(ISERROR(MATCH(F11,Sources!$C:$C,0)),\"\",5*D11+3*E11),IF(AND(NOT(ISERROR(MATCH(A11,Sources!$D:$D,0))),NOT(ISERROR(MATCH(F11,Sources!$E:$E,0)))),5*D11+3*E11,\"\"))&IF(AND(ISERROR(MATCH(A11,Sources!$F:$F,0)),NOT(ISERROR(MATCH(F11,Sources!$G:$G,0)))),5*D11+3*E11,\"\")),\"\")","v":""},35]
["UTOPIA ISLAND",{"$f":"IFERROR(VLOOKUP(A12,Sheet2!$B$2:$C$18,2,0),\"\")","v":"Utopia"},"2018-08-02",1,2,"HURGADA",96,null,{"$f":"IFERROR(VALUE(IF(ISERROR(MATCH(A12,Sources!$B:$B,0)),IF(ISERROR(MATCH(F12,Sources!$C:$C,0)),\"\",5*D12+3*E12),IF(AND(NOT(ISERROR(MATCH(A12,Sources!$D:$D,0))),NOT(ISERROR(MATCH(F12,Sources!$E:$E,0)))),5*D12+3*E12,\"\"))&IF(AND(ISERROR(MATCH(A12,Sources!$F:$F,0)),NOT(ISERROR(MATCH(F12,Sources!$G:$G,0)))),5*D12+3*E12,\"\")),\"\")","v":""},96]
["UTOPIA ISLAND",{"$f":"IFERROR(VLOOKUP(A13,Sheet2!$B$2:$C$18,2,0),\"\")","v":"Utopia"},"2018-08-02",2,1,"HURGADA",120,null,{"$f":"IFERROR(VALUE(IF(ISERROR(MATCH(A13,Sources!$B:$B,0)),IF(ISERROR(MATCH(F13,Sources!$C:$C,0)),\"\",5*D13+3*E13),IF(AND(NOT(ISERROR(MATCH(A13,Sources!$D:$D,0))),NOT(ISERROR(MATCH(F13,Sources!$E:$E,0)))),5*D13+3*E13,\"\"))&IF(AND(ISERROR(MATCH(A13,Sources!$F:$F,0)),NOT(ISERROR(MATCH(F13,Sources!$G:$G,0)))),5*D13+3*E13,\"\")),\"\")","v":""},120]
["UTOPIA ISLAND",{"$f":"IFERROR(VLOOKUP(A14,Sheet2!$B$2:$C$18,2,0),\"\")","v":"Utopia"},"2018-08-02",7,2,"SAFAGA",384,null,{"$f":"IFERROR(VALUE(IF(ISERROR(MATCH(A14,Sources!$B:$B,0)),IF(ISERROR(MATCH(F14,Sources!$C:$C,0)),\"\",5*D14+3*E14),IF(AND(NOT(ISERROR(MATCH(A14,Sources!$D:$D,0))),NOT(ISERROR(MATCH(F14,Sources!$E:$E,0)))),5*D14+3*E14,\"\"))&IF(AND(ISERROR(MATCH(A14,Sources!$F:$F,0)),NOT(ISERROR(MATCH(F14,Sources!$G:$G,0)))),5*D14+3*E14,\"\")),\"\")","v":""},384]
["UTOPIA ISLAND",{"$f":"IFERROR(VLOOKUP(A15,Sheet2!$B$2:$C$18,2,0),\"\")","v":"Utopia"},"2018-08-02",3,0,"MAKADI BAY",144,null,{"$f":"IFERROR(VALUE(IF(ISERROR(MATCH(A15,Sources!$B:$B,0)),IF(ISERROR(MATCH(F15,Sources!$C:$C,0)),\"\",5*D15+3*E15),IF(AND(NOT(ISERROR(MATCH(A15,Sources!$D:$D,0))),NOT(ISERROR(MATCH(F15,Sources!$E:$E,0)))),5*D15+3*E15,\"\"))&IF(AND(ISERROR(MATCH(A15,Sources!$F:$F,0)),NOT(ISERROR(MATCH(F15,Sources!$G:$G,0)))),5*D15+3*E15,\"\")),\"\")","v":""},144]
{"$rows_left_out":430}
{"sheet":"Excurcion","index":2,"n_rows":82,"n_cols":11,"rows_kept":82,"cut":false,"hidden":false,"merged":[[0,11,3,22],[2,9,3,9],[2,4,3,4],[2,0,3,0],[2,1,3,1],[2,2,2,3],[2,5,3,5],[2,7,3,7],[2,8,3,8],[2,6,3,6]]}
[526,"  01/08/2018  till  31/08/2018",{"$f":"SUMPRODUCT((Data!$C:$C=A1)*(Data!$B:$B=B1)*(Data!$D:$D))","v":{"$error":"#VALUE!"}},{"$f":"SUMPRODUCT((Data!$C:$C=A1)*(Data!$B:$B=B1)*(Data!$E:$E))","v":{"$error":"#VALUE!"}}]
[null,{"$f":"INDIRECT(\"Data!B\"&MATCH(A5,Data!$C$2:$C$188,0)&\":B100000\")","v":"Moto 2"},{"$f":"SUBTOTAL(9,C5:C81)","v":363},{"$f":"SUBTOTAL(9,D5:D81)","v":49},null,null,null,{"$f":"SUBTOTAL(9,H5:H81)","v":{"$error":"#N/A"}}]
["Date","Ex",null,null,"Price","ch","Plus","Total","TRANSFER","dis"]
[null,null,"Adl","Chd"]
["2018-08-01",{"$f":"IFERROR(INDEX(INDIRECT(\"Data!B\"&MATCH(A5,Data!$C$2:$C$100000,0)+1&\":B100000\"),SMALL(IF((A5=INDIRECT(\"Data!C\"&MATCH(A5,Data!$C$2:$C$100000,0)+1&\":C100000\"))*(MATCH(INDIRECT(\"Data!B\"&MATCH(A5,Data!$C$2:$C$100000,0)+1&\":B100000\")&\"\",INDIRECT(\"Data!B\"&MATCH(A5,Data!$C$2:$C$100000,0)+1&\":B100000\")&\"\",0)=(ROW(INDIRECT(\"Data!B\"&MATCH(A5,Data!$C$2:$C$100000,0)+1&\":B100000\"))-MATCH(A5,Data!$C$2:$C$100000,0))),ROW(INDIRECT(\"Data!B\"&MATCH(A5,Data!$C$2:$C$100000,0)+1&\":B100000\"))-MATCH(A5,Data!$C$2:$C$100000,0),\"\"),COUNTIF($A$5:A5,A5))),\"\")","v":"Moto 2"},{"$f":"SUMIFS(Data!$D:$D,Data!$C:$C,A5,Data!$B:$B,B5)","v":4},{"$f":"SUMIFS(Data!$E:$E,Data!$C:$C,A5,Data!$B:$B,B5)","v":0},{"$f":"IF(AND(B5=\"Grand Aquarium\",WEEKDAY(A5)=3),40,IF(AND(B5=\"Grand Aquarium\",WEEKDAY(A5)=7),40,VLOOKUP(B5,Price!$A$6:$C$216,2,0)))","v":45},{"$f":"IF(AND(B5=\"Grand Aquarium\",WEEKDAY(A5)=3),20,IF(AND(B5=\"Grand Aquarium\",WEEKDAY(A5)=7),20,VLOOKUP(B5,Price!$A$6:$C$216,3,0)))","v":23},{"$f":"IF(SUMIFS(Data!$J:$J,Data!$C:$C,A5,Data!$B:$B,B5)>H5,SUMIFS(Data!$J:$J,Data!$C:$C,A5,Data!$B:$B,B5)-H5,\"\")","v":0},{"$f":"(C5*E5)+(D5*F5)+G5","v":180},{"$f":"SUMPRODUCT((Data!$C:$C=A5)*(Data!$B:$B=B5),(Data!$I:$I))","v":0},{"$f":"IF(SUMIFS(Data!$J:$J,Data!$C:$C,A5,Data!$B:$B,B5)<H5,H5-SUMIFS(Data!$J:$J,Data!$C:$C,A5,Data!$B:$B,B5),\"\")","v":0}]
["2018-08-01",{"$f":"IFERROR(INDEX(INDIRECT(\"Data!B\"&MATCH(A6,Data!$C$2:$C$100000,0)+1&\":B100000\"),SMALL(IF((A6=INDIRECT(\"Data!C\"&MATCH(A6,Data!$C$2:$C$100000,0)+1&\":C100000\"))*(MATCH(INDIRECT(\"Data!B\"&MATCH(A6,Data!$C$2:$C$100000,0)+1&\":B100000\")&\"\",INDIRECT(\"Data!B\"&MATCH(A6,Data!$C$2:$C$100000,0)+1&\":B100000\")&\"\",0)=(ROW(INDIRECT(\"Data!B\"&MATCH(A6,Data!$C$2:$C$100000,0)+1&\":B100000\"))-MATCH(A6,Data!$C$2:$C$100000,0))),ROW(INDIRECT(\"Data!B\"&MATCH(A6,Data!$C$2:$C$100000,0)+1&\":B100000\"))-MATCH(A6,Data!$C$2:$C$100000,0),\"\"),COUNTIF($A$5:A6,A6))),\"\")","v":"Moto 1 Hour"},{"$f":"SUMIFS(Data!$D:$D,Data!$C:$C,A6,Data!$B:$B,B6)","v":1},{"$f":"SUMIFS(Data!$E:$E,Data!$C:$C,A6,Data!$B:$B,B6)","v":1},{"$f":"IF(AND(B6=\"Grand Aquarium\",WEEKDAY(A6)=3),40,IF(AND(B6=\"Grand Aquarium\",WEEKDAY(A6)=7),40,VLOOKUP(B6,Price!$A$6:$C$216,2,0)))","v":40},{"$f":"IF(AND(B6=\"Grand Aquarium\",WEEKDAY(A6)=3),20,IF(AND(B6=\"Grand Aquarium\",WEEKDAY(A6)=7),20,VLOOKUP(B6,Price!$A$6:$C$216,3,0)))","v":20},{"$f":"IF(SUMIFS(Data!$J:$J,Data!$C:$C,A6,Data!$B:$B,B6)>H6,SUMIFS(Data!$J:$J,Data!$C:$C,A6,Data!$B:$B,B6)-H6,\"\")","v":0},{"$f":"(C6*E6)+(D6*F6)+G6","v":180},{"$f":"SUMPRODUCT((Data!$C:$C=A6)*(Data!$B:$B=B6),(Data!$I:$I))","v":0},{"$f":"IF(SUMIFS(Data!$J:$J,Data!$C:$C,A6,Data!$B:$B,B6)<H6,H6-SUMIFS(Data!$J:$J,Data!$C:$C,A6,Data!$B:$B,B6),\"\")","v":0}]
["2018-08-01",{"$f":"IFERROR(INDEX(INDIRECT(\"Data!B\"&MATCH(A7,Data!$C$2:$C$100000,0)+1&\":B100000\"),SMALL(IF((A7=INDIRECT(\"Data!C\"&MATCH(A7,Data!$C$2:$C$100000,0)+1&\":C100000\"))*(MATCH(INDIRECT(\"Data!B\"&MATCH(A7,Data!$C$2:$C$100000,0)+1&\":B100000\")&\"\",INDIRECT(\"Data!B\"&MATCH(A7,Data!$C$2:$C$100000,0)+1&\":B100000\")&\"\",0)=(ROW(INDIRECT(\"Data!B\"&MATCH(A7,Data!$C$2:$C$100000,0)+1&\":B100000\"))-MATCH(A7,Data!$C$2:$C$100000,0))),ROW(INDIRECT(\"Data!B\"&MATCH(A7,Data!$C$2:$C$100000,0)+1&\":B100000\"))-MATCH(A7,Data!$C$2:$C$100000,0),\"\"),COUNTIF($A$5:A7,A7))),\"\")","v":"LUXOR 2"},{"$f":"SUMIFS(Data!$D:$D,Data!$C:$C,A7,Data!$B:$B,B7)","v":11},{"$f":"SUMIFS(Data!$E:$E,Data!$C:$C,A7,Data!$B:$B,B7)","v":2},{"$f":"IF(AND(B7=\"Grand Aquarium\",WEEKDAY(A7)=3),40,IF(AND(B7=\"Grand Aquarium\",WEEKDAY(A7)=7),40,VLOOKUP(B7,Price!$A$6:$C$216,2,0)))","v":90},{"$f":"IF(AND(B7=\"Grand Aquarium\",WEEKDAY(A7)=3),20,IF(AND(B7=\"Grand Aquarium\",WEEKDAY(A7)=7),20,VLOOKUP(B7,Price!$A$6:$C$216,3,0)))","v":45},{"$f":"IF(SUMIFS(Data!$J:$J,Data!$C:$C,A7,Data!$B:$B,B7)>H7,SUMIFS(Data!$J:$J,Data!$C:$C,A7,Data!$B:$B,B7)-H7,\"\")","v":0},180,{"$f":"SUMPRODUCT((Data!$C:$C=A7)*(Data!$B:$B=B7),(Data!$I:$I))","v":0},{"$f":"IF(SUMIFS(Data!$J:$J,Data!$C:$C,A7,Data!$B:$B,B7)<H7,H7-SUMIFS(Data!$J:$J,Data!$C:$C,A7,Data!$B:$B,B7),\"\")","v":0}]
[null,{"$f":"IFERROR(INDEX(INDIRECT(\"Data!B\"&MATCH(A8,Data!$C$2:$C$100000,0)+1&\":B100000\"),SMALL(IF((A8=INDIRECT(\"Data!C\"&MATCH(A8,Data!$C$2:$C$100000,0)+1&\":C100000\"))*(MATCH(INDIRECT(\"Data!B\"&MATCH(A8,Data!$C$2:$C$100000,0)+1&\":B100000\")&\"\",INDIRECT(\"Data!B\"&MATCH(A8,Data!$C$2:$C$100000,0)+1&\":B100000\")&\"\",0)=(ROW(INDIRECT(\"Data!B\"&MATCH(A8,Data!$C$2:$C$100000,0)+1&\":B100000\"))-MATCH(A8,Data!$C$2:$C$100000,0))),ROW(INDIRECT(\"Data!B\"&MATCH(A8,Data!$C$2:$C$100000,0)+1&\":B100000\"))-MATCH(A8,Data!$C$2:$C$100000,0),\"\"),COUNTIF($A$5:A8,A8))),\"\")","v":""},{"$f":"SUMIFS(Data!$D:$D,Data!$C:$C,A8,Data!$B:$B,B8)","v":0},{"$f":"SUMIFS(Data!$E:$E,Data!$C:$C,A8,Data!$B:$B,B8)","v":0},null,null,{"$f":"IF(SUMIFS(Data!$J:$J,Data!$C:$C,A8,Data!$B:$B,B8)>H8,SUMIFS(Data!$J:$J,Data!$C:$C,A8,Data!$B:$B,B8)-H8,\"\")","v":0},180,{"$f":"SUMPRODUCT((Data!$C:$C=A8)*(Data!$B:$B=B8),(Data!$I:$I))","v":0},{"$f":"IF(SUMIFS(Data!$J:$J,Data!$C:$C,A8,Data!$B:$B,B8)<H8,H8-SUMIFS(Data!$J:$J,Data!$C:$C,A8,Data!$B:$B,B8),\"\")","v":0},{"$f":"SUM(H5:H7)","v":0}]
["2018-08-02",{"$f":"IFERROR(INDEX(INDIRECT(\"Data!B\"&MATCH(A9,Data!$C$2:$C$100000,0)+1&\":B100000\"),SMALL(IF((A9=INDIRECT(\"Data!C\"&MATCH(A9,Data!$C$2:$C$100000,0)+1&\":C100000\"))*(MATCH(INDIRECT(\"Data!B\"&MATCH(A9,Data!$C$2:$C$100000,0)+1&\":B100000\")&\"\",INDIRECT(\"Data!B\"&MATCH(A9,Data!$C$2:$C$100000,0)+1&\":B100000\")&\"\",0)=(ROW(INDIRECT(\"Data!B\"&MATCH(A9,Data!$C$2:$C$100000,0)+1&\":B100000\"))-MATCH(A9,Data!$C$2:$C$100000,0))),ROW(INDIRECT(\"Data!B\"&MATCH(A9,Data!$C$2:$C$100000,0)+1&\":B100000\"))-MATCH(A9,Data!$C$2:$C$100000,0),\"\"),COUNTIF($A$5:A9,A9))),\"\")","v":"Rusalka (Mermaid)"},{"$f":"SUMIFS(Data!$D:$D,Data!$C:$C,A9,Data!$B:$B,B9)","v":1},{"$f":"SUMIFS(Data!$E:$E,Data!$C:$C,A9,Data!$B:$B,B9)","v":0},{"$f":"IF(AND(B9=\"Grand Aquarium\",WEEKDAY(A9)=3),40,IF(AND(B9=\"Grand Aquarium\",WEEKDAY(A9)=7),40,VLOOKUP(B9,Price!$A$6:$C$216,2,0)))","v":40},{"$f":"IF(AND(B9=\"Grand Aquarium\",WEEKDAY(A9)=3),20,IF(AND(B9=\"Grand Aquarium\",WEEKDAY(A9)=7),20,VLOOKUP(B9,Price!$A$6:$C$216,3,0)))","v":20},{"$f":"IF(SUMIFS(Data!$J:$J,Data!$C:$C,A9,Data!$B:$B,B9)>H9,SUMIFS(Data!$J:$J,Data!$C:$C,A9,Data!$B:$B,B9)-H9,\"\")","v":0},180,{"$f":"SUMPRODUCT((Data!$C:$C=A9)*(Data!$B:$B=B9),(Data!$I:$I))","v":0},{"$f":"IF(SUMIFS(Data!$J:$J,Data!$C:$C,A9,Data!$B:$B,B9)<H9,H9-SUMIFS(Data!$J:$J,Data!$C:$C,A9,Data!$B:$B,B9),\"\")","v":0}]
["2018-08-02",{"$f":"IFERROR(INDEX(INDIRECT(\"Data!B\"&MATCH(A10,Data!$C$2:$C$100000,0)+1&\":B100000\"),SMALL(IF((A10=INDIRECT(\"Data!C\"&MATCH(A10,Data!$C$2:$C$100000,0)+1&\":C100000\"))*(MATCH(INDIRECT(\"Data!B\"&MATCH(A10,Data!$C$2:$C$100000,0)+1&\":B100000\")&\"\",INDIRECT(\"Data!B\"&MATCH(A10,Data!$C$2:$C$100000,0)+1&\":B100000\")&\"\",0)=(ROW(INDIRECT(\"Data!B\"&MATCH(A10,Data!$C$2:$C$100000,0)+1&\":B100000\"))-MATCH(A10,Data!$C$2:$C$100000,0))),ROW(INDIRECT(\"Data!B\"&MATCH(A10,Data!$C$2:$C$100000,0)+1&\":B100000\"))-MATCH(A10,Data!$C$2:$C$100000,0),\"\"),COUNTIF($A$5:A10,A10))),\"\")","v":"Utopia"},{"$f":"SUMIFS(Data!$D:$D,Data!$C:$C,A10,Data!$B:$B,B10)","v":38},{"$f":"SUMIFS(Data!$E:$E,Data!$C:$C,A10,Data!$B:$B,B10)","v":9},{"$f":"IF(AND(B10=\"Grand Aquarium\",WEEKDAY(A10)=3),40,IF(AND(B10=\"Grand Aquarium\",WEEKDAY(A10)=7),40,VLOOKUP(B10,Price!$A$6:$C$216,2,0)))","v":55},{"$f":"IF(AND(B10=\"Grand Aquarium\",WEEKDAY(A10)=3),20,IF(AND(B10=\"Grand Aquarium\",WEEKDAY(A10)=7),20,VLOOKUP(B10,Price!$A$6:$C$216,3,0)))","v":28},{"$f":"IF(SUMIFS(Data!$J:$J,Data!$C:$C,A10,Data!$B:$B,B10)>H10,SUMIFS(Data!$J:$J,Data!$C:$C,A10,Data!$B:$B,B10)-H10,\"\")","v":0},180,{"$f":"SUMPRODUCT((Data!$C:$C=A10)*(Data!$B:$B=B10),(Data!$I:$I))","v":0},{"$f":"IF(SUMIFS(Data!$J:$J,Data!$C:$C,A10,Data!$B:$B,B10)<H10,H10-SUMIFS(Data!$J:$J,Data!$C:$C,A10,Data!$B:$B,B10),\"\")","v":0}]
["2018-08-02",{"$f":"IFERROR(INDEX(INDIRECT(\"Data!B\"&MATCH(A11,Data!$C$2:$C$100000,0)+1&\":B100000\"),SMALL(IF((A11=INDIRECT(\"Data!C\"&MATCH(A11,Data!$C$2:$C$100000,0)+1&\":C100000\"))*(MATCH(INDIRECT(\"Data!B\"&MATCH(A11,Data!$C$2:$C$100000,0)+1&\":B100000\")&\"\",INDIRECT(\"Data!B\"&MATCH(A11,Data!$C$2:$C$100000,0)+1&\":B100000\")&\"\",0)=(ROW(INDIRECT(\"Data!B\"&MATCH(A11,Data!$C$2:$C$100000,0)+1&\":B100000\"))-MATCH(A11,Data!$C$2:$C$100000,0))),ROW(INDIRECT(\"Data!B\"&MATCH(A11,Data!$C$2:$C$100000,0)+1&\":B100000\"))-MATCH(A11,Data!$C$2:$C$100000,0),\"\"),COUNTIF($A$5:A11,A11))),\"\")","v":"Sea Trip"},{"$f":"SUMIFS(Data!$D:$D,Data!$C:$C,A11,Data!$B:$B,B11)","v":2},{"$f":"SUMIFS(Data!$E:$E,Data!$C:$C,A11,Data!$B:$B,B11)","v":0},{"$f":"IF(AND(B11=\"Grand Aquarium\",WEEKDAY(A11)=3),40,IF(AND(B11=\"Grand Aquarium\",WEEKDAY(A11)=7),40,VLOOKUP(B11,Price!$A$6:$C$216,2,0)))","v":40},{"$f":"IF(AND(B11=\"Grand Aquarium\",WEEKDAY(A11)=3),20,IF(AND(B11=\"Grand Aquarium\",WEEKDAY(A11)=7),20,VLOOKUP(B11,Price!$A$6:$C$216,3,0)))","v":20},{"$f":"IF(SUMIFS(Data!$J:$J,Data!$C:$C,A11,Data!$B:$B,B11)>H11,SUMIFS(Data!$J:$J,Data!$C:$C,A11,Data!$B:$B,B11)-H11,\"\")","v":0},180,{"$f":"SUMPRODUCT((Data!$C:$C=A11)*(Data!$B:$B=B11),(Data!$I:$I))","v":0},{"$f":"IF(SUMIFS(Data!$J:$J,Data!$C:$C,A11,Data!$B:$B,B11)<H11,H11-SUMIFS(Data!$J:$J,Data!$C:$C,A11,Data!$B:$B,B11),\"\")","v":0}]
[null,{"$f":"IFERROR(INDEX(INDIRECT(\"Data!B\"&MATCH(A12,Data!$C$2:$C$100000,0)+1&\":B100000\"),SMALL(IF((A12=INDIRECT(\"Data!C\"&MATCH(A12,Data!$C$2:$C$100000,0)+1&\":C100000\"))*(MATCH(INDIRECT(\"Data!B\"&MATCH(A12,Data!$C$2:$C$100000,0)+1&\":B100000\")&\"\",INDIRECT(\"Data!B\"&MATCH(A12,Data!$C$2:$C$100000,0)+1&\":B100000\")&\"\",0)=(ROW(INDIRECT(\"Data!B\"&MATCH(A12,Data!$C$2:$C$100000,0)+1&\":B100000\"))-MATCH(A12,Data!$C$2:$C$100000,0))),ROW(INDIRECT(\"Data!B\"&MATCH(A12,Data!$C$2:$C$100000,0)+1&\":B100000\"))-MATCH(A12,Data!$C$2:$C$100000,0),\"\"),COUNTIF($A$5:A12,A12))),\"\")","v":""},{"$f":"SUMIFS(Data!$D:$D,Data!$C:$C,A12,Data!$B:$B,B12)","v":0},{"$f":"SUMIFS(Data!$E:$E,Data!$C:$C,A12,Data!$B:$B,B12)","v":0},null,null,{"$f":"IF(SUMIFS(Data!$J:$J,Data!$C:$C,A12,Data!$B:$B,B12)>H12,SUMIFS(Data!$J:$J,Data!$C:$C,A12,Data!$B:$B,B12)-H12,\"\")","v":0},180,{"$f":"SUMPRODUCT((Data!$C:$C=A12)*(Data!$B:$B=B12),(Data!$I:$I))","v":0},{"$f":"IF(SUMIFS(Data!$J:$J,Data!$C:$C,A12,Data!$B:$B,B12)<H12,H12-SUMIFS(Data!$J:$J,Data!$C:$C,A12,Data!$B:$B,B12),\"\")","v":0},{"$f":"SUM(H9:H11)","v":2462}]
["2018-08-03",{"$f":"IFERROR(INDEX(INDIRECT(\"Data!B\"&MATCH(A13,Data!$C$2:$C$100000,0)+1&\":B100000\"),SMALL(IF((A13=INDIRECT(\"Data!C\"&MATCH(A13,Data!$C$2:$C$100000,0)+1&\":C100000\"))*(MATCH(INDIRECT(\"Data!B\"&MATCH(A13,Data!$C$2:$C$100000,0)+1&\":B100000\")&\"\",INDIRECT(\"Data!B\"&MATCH(A13,Data!$C$2:$C$100000,0)+1&\":B100000\")&\"\",0)=(ROW(INDIRECT(\"Data!B\"&MATCH(A13,Data!$C$2:$C$100000,0)+1&\":B100000\"))-MATCH(A13,Data!$C$2:$C$100000,0))),ROW(INDIRECT(\"Data!B\"&MATCH(A13,Data!$C$2:$C$100000,0)+1&\":B100000\"))-MATCH(A13,Data!$C$2:$C$100000,0),\"\"),COUNTIF($A$5:A13,A13))),\"\")","v":"Moto 2"},{"$f":"SUMIFS(Data!$D:$D,Data!$C:$C,A13,Data!$B:$B,B13)","v":6},{"$f":"SUMIFS(Data!$E:$E,Data!$C:$C,A13,Data!$B:$B,B13)","v":3},{"$f":"IF(AND(B13=\"Grand Aquarium\",WEEKDAY(A13)=3),40,IF(AND(B13=\"Grand Aquarium\",WEEKDAY(A13)=7),40,VLOOKUP(B13,Price!$A$6:$C$216,2,0)))","v":45},{"$f":"IF(AND(B13=\"Grand Aquarium\",WEEKDAY(A13)=3),20,IF(AND(B13=\"Grand Aquarium\",WEEKDAY(A13)=7),20,VLOOKUP(B13,Price!$A$6:$C$216,3,0)))","v":23},{"$f":"IF(SUMIFS(Data!$J:$J,Data!$C:$C,A13,Data!$B:$B,B13)>H13,SUMIFS(Data!$J:$J,Data!$C:$C,A13,Data!$B:$B,B13)-H13,\"\")","v":0},180,{"$f":"SUMPRODUCT((Data!$C:$C=A13)*(Data!$B:$B=B13),(Data!$I:$I))","v":0},{"$f":"IF(SUMIFS(Data!$J:$J,Data!$C:$C,A13,Data!$B:$B,B13)<H13,H13-SUMIFS(Data!$J:$J,Data!$C:$C,A13,Data!$B:$B,B13),\"\")","v":0}]
[null,{"$f":"IFERROR(INDEX(INDIRECT(\"Data!B\"&MATCH(A14,Data!$C$2:$C$100000,0)+1&\":B100000\"),SMALL(IF((A14=INDIRECT(\"Data!C\"&MATCH(A14,Data!$C$2:$C$100000,0)+1&\":C100000\"))*(MATCH(INDIRECT(\"Data!B\"&MATCH(A14,Data!$C$2:$C$100000,0)+1&\":B100000\")&\"\",INDIRECT(\"Data!B\"&MATCH(A14,Data!$C$2:$C$100000,0)+1&\":B100000\")&\"\",0)=(ROW(INDIRECT(\"Data!B\"&MATCH(A14,Data!$C$2:$C$100000,0)+1&\":B100000\"))-MATCH(A14,Data!$C$2:$C$100000,0))),ROW(INDIRECT(\"Data!B\"&MATCH(A14,Data!$C$2:$C$100000,0)+1&\":B100000\"))-MATCH(A14,Data!$C$2:$C$100000,0),\"\"),COUNTIF($A$5:A14,A14))),\"\")","v":""},{"$f":"SUMIFS(Data!$D:$D,Data!$C:$C,A14,Data!$B:$B,B14)","v":0},{"$f":"SUMIFS(Data!$E:$E,Data!$C:$C,A14,Data!$B:$B,B14)","v":0},null,null,{"$f":"IF(SUMIFS(Data!$J:$J,Data!$C:$C,A14,Data!$B:$B,B14)>H14,SUMIFS(Data!$J:$J,Data!$C:$C,A14,Data!$B:$B,B14)-H14,\"\")","v":0},180,{"$f":"SUMPRODUCT((Data!$C:$C=A14)*(Data!$B:$B=B14),(Data!$I:$I))","v":0},{"$f":"IF(SUMIFS(Data!$J:$J,Data!$C:$C,A14,Data!$B:$B,B14)<H14,H14-SUMIFS(Data!$J:$J,Data!$C:$C,A14,Data!$B:$B,B14),\"\")","v":0},{"$f":"SUM(H13:H13)","v":339}]
["2018-08-04",{"$f":"IFERROR(INDEX(INDIRECT(\"Data!B\"&MATCH(A15,Data!$C$2:$C$100000,0)+1&\":B100000\"),SMALL(IF((A15=INDIRECT(\"Data!C\"&MATCH(A15,Data!$C$2:$C$100000,0)+1&\":C100000\"))*(MATCH(INDIRECT(\"Data!B\"&MATCH(A15,Data!$C$2:$C$100000,0)+1&\":B100000\")&\"\",INDIRECT(\"Data!B\"&MATCH(A15,Data!$C$2:$C$100000,0)+1&\":B100000\")&\"\",0)=(ROW(INDIRECT(\"Data!B\"&MATCH(A15,Data!$C$2:$C$100000,0)+1&\":B100000\"))-MATCH(A15,Data!$C$2:$C$100000,0))),ROW(INDIRECT(\"Data!B\"&MATCH(A15,Data!$C$2:$C$100000,0)+1&\":B100000\"))-MATCH(A15,Data!$C$2:$C$100000,0),\"\"),COUNTIF($A$5:A15,A15))),\"\")","v":"Moto 2"},{"$f":"SUMIFS(Data!$D:$D,Data!$C:$C,A15,Data!$B:$B,B15)","v":13},{"$f":"SUMIFS(Data!$E:$E,Data!$C:$C,A15,Data!$B:$B,B15)","v":0},{"$f":"IF(AND(B15=\"Grand Aquarium\",WEEKDAY(A15)=3),40,IF(AND(B15=\"Grand Aquarium\",WEEKDAY(A15)=7),40,VLOOKUP(B15,Price!$A$6:$C$216,2,0)))","v":45},{"$f":"IF(AND(B15=\"Grand Aquarium\",WEEKDAY(A15)=3),20,IF(AND(B15=\"Grand Aquarium\",WEEKDAY(A15)=7),20,VLOOKUP(B15,Price!$A$6:$C$216,3,0)))","v":23},{"$f":"IF(SUMIFS(Data!$J:$J,Data!$C:$C,A15,Data!$B:$B,B15)>H15,SUMIFS(Data!$J:$J,Data!$C:$C,A15,Data!$B:$B,B15)-H15,\"\")","v":0},180,{"$f":"SUMPRODUCT((Data!$C:$C=A15)*(Data!$B:$B=B15),(Data!$I:$I))","v":25},{"$f":"IF(SUMIFS(Data!$J:$J,Data!$C:$C,A15,Data!$B:$B,B15)<H15,H15-SUMIFS(Data!$J:$J,Data!$C:$C,A15,Data!$B:$B,B15),\"\")","v":0}]
{"$rows_left_out":68}
{"sheet":"Sheet2","index":3,"n_rows":18,"n_cols":3,"rows_kept":18,"cut":false,"hidden":true,"merged":[]}
[null,"Excursion"]
[null,"ASPENDOS TURKISH BATH"]
[null,"CAIRO BY PLANE"]
[null,"CAIRO OVERDAY","Cairo"]
[null,"DOLPHIN WORLD SHOW","Dolphin world show"]
[null,"GRAND AQUARIUM","Grand Aquarium"]
[null,"INTRO DIVING","Diving"]
[null,"JUNGLE AQUAPARK","Jungle Aqua Park"]
[null,"MOTO 1 HOUR","Moto 1 Hour"]
[null,"MOTO2","Moto 2"]
[null,"OVER DAY LUXORQUEEN VALLY","LUXOR 2"]
[null,"PARASAILING TRIP"]
[null,"PRIVATE BOAT FISHING","Private Boat Fishing"]
[null,"RUSALKA  ( MERMAID )","Rusalka (Mermaid)"]
[null,"SEA TRIP","Sea Trip"]
{"$rows_left_out":4}
{"sheet":"Sources","index":4,"n_rows":168,"n_cols":9,"rows_kept":168,"cut":false,"hidden":true,"merged":[]}
[]
[null,"OVER DAY LUXOR","MAKADI BAY","RUSALKA -PACKAGE 13","SAFAGA","CAIRO- PACKAGE 1","EL GOUNA","MOTO2","CAIRO- PACKAGE 1"]
[null," LUXORQUEEN VALLY - PACKAGE 23","SAFAGA","RUSALKA -PACKAGE 16","SOMA BAY","CAIRO- PACKAGE 20",null,"OVER DAY LUXOR","CAIRO- PACKAGE 20"]
[null," LUXORQUEEN VALLY - PACKAGE 24","SOMA BAY","RUSALKA -PACKAGE 6",null,"CAIRO- PACKAGE 21",null," LUXORQUEEN VALLY - PACKAGE 23","CAIRO- PACKAGE 21"]
[null," LUXORQUEEN VALLY - PACKAGE 25",null,"RUSALKA -PACKAGE 9",null,"CAIRO- PACKAGE 22",null," LUXORQUEEN VALLY - PACKAGE 24","CAIRO- PACKAGE 22"]
[null," LUXORQUEEN VALLY - PACKAGE 30",null,"RUSALKA  ( MERMAID )",null,"CAIRO- PACKAGE 24",null," LUXORQUEEN VALLY - PACKAGE 25","CAIRO- PACKAGE 24"]
[null," LUXORQUEEN VALLY - PACKAGE 31",null,"RUSALKA -PACKAGE 3",null,"CAIRO- PACKAGE 26",null," LUXORQUEEN VALLY - PACKAGE 30","CAIRO- PACKAGE 26"]
[null," LUXORQUEEN VALLY - PACKAGE 32",null,null,null,"CAIRO - PACKAGE 33",null," LUXORQUEEN VALLY - PACKAGE 31","CAIRO - PACKAGE 33"]
[null," LUXORQUEEN VALLY - PACKAGE 33",null,null,null,"CAIRO - PACKAGE 34",null," LUXORQUEEN VALLY - PACKAGE 32","CAIRO - PACKAGE 34"]
[null," LUXORQUEEN VALLY - PACKAGE 36",null,null,null,"CAIRO - PACKAGE 35",null," LUXORQUEEN VALLY - PACKAGE 33","CAIRO - PACKAGE 35"]
[null," LUXORQUEEN VALLY - PACKAGE 5",null,null,null,"El GOUNA TRIP- PACKAGE 28",null," LUXORQUEEN VALLY - PACKAGE 36","El GOUNA TRIP- PACKAGE 28"]
[null,"BIO SHOP (OIL PARFUM)",null,null,null,"CAIRO OVERDAY",null," LUXORQUEEN VALLY - PACKAGE 5","CAIRO OVERDAY"]
[null,"COMBINE SHOP GROUP- SOUTH",null,null,null,"CAIRO/ALEX 2 Night",null,"1001 SHOW","CAIRO/ALEX 2 Night"]
[null,"COMBINE SHOP GROUP - NORTH",null,null,null,"EL GOUNA TRIP",null,"ASWAN OVER DAY -PACKAGE 1","EL GOUNA TRIP"]
[null,"COMBINE, MODA SHOW& COTTON FLOWER SHOP",null,null,null,"INDIVIDUAL CAIRO ALEX",null,"CITY TOUR+SAND CITY","INDIVIDUAL CAIRO ALEX"]
{"$rows_left_out":153}