{"text_format":"1","workbook":"xlsx","n_sheets":5,"sheets":["Price","Data","Excurcion","Sheet2","Sources"],"not_rendered":{"charts":0,"images":0,"macros":0,"external_links":3,"defined_names":25,"comments":1,"pivot_tables":0},"unopened":[],"bounds":{"document_bytes":16777216,"sheet_cells":100000,"rows_first":2000,"rows_last":500,"rows_between":2000,"halvings":0,"cell_chars":16384,"cell_head_chars":4096},"cells_cut":0,"cells_raw":0,"read":"whole","date_system":"1900"}

{"sheet":"Price","index":0,"n_rows":272,"n_cols":3,"rows_kept":272,"cut":false,"hidden":true,"merged":[]}
[]
[null,null,"30 pax"]
["tripe","price","price child"]
[]
[]
[]
["Alex Cairo",220,110]
["Cairo",110,55]
["Cairo Package 1",95,50]
["Luxor",114,57]
["LUXOR 2",90,45]
["LUXOR 2  Package 5",79,40]
["LUXOR 2  Package 7",80,40]
["LUXOR 2  Package 12",80,40]
["VIP Luxor",158,79]
["DANDARA LUXOR",117,59]
["DANDARA LUXOR  Package 2",100,50]
["DANDARA LUXOR  Package 6",95,50]
["DANDARA LUXOR  Package 10",95,50]
["DANDARA LUXOR  Package 15",95,50]
["Dandara abydos",99,50]
["Dandara Deluxe",125,65]
[" Aswan Abu simple 3 stars",275,138]
["Aswan bu simple 4 stars",285,143]
["St.Poula&antony",55,33]
["St.Poula&antony package 8",50,25]
["St.Poula&antony package 9",50,25]
["Diving",65,65]
["El gouna",55,28]
["el gouna bus",50,25]
["paradies el gana",50,30]
["Russian Fishing",47,30]
["Sea Trip",40,20]
["Sea Trip Package 1",30,15]
["Sea Trip Package 2",30,15]
["Sea Trip Package 4",30,15]
["Sea Trip Package 5",30,15]
["Sindbad aqua park",45,30]
["Snorkling",{"$f":"30+10","v":40},{"$f":"20","v":20}]
["Submarine",58,29]
["submarine + Titank aqua park",90,45]
["TitanK Aqua Park",45,25]
["TitanK Aqua Park package 16",40,20]
["Jungle Aqua Park",50,25]
["Aquarium+Jungle Aqus Park",35,17]
["Aquarium Package 17",10,5]
["Utopia",55,28]
["Tr Utopia",0,0]
["SGl parasaling",50,25]
["Trl parasaling",90,25]
["Royal utopia",62,31]
["Tr Royal utopia",0,0]
["Blue Aquarim",33,20]
["Dbl parasaling",75,25]
["ROMANCE UTOPIA",45,23]
["Tr ROMANCE UTOPIA",0,0]
["Sunny Orange Bay",60,30]
["Companion parasaling",25,0]
["CRYSTAL ISLAND",45,23]
["CRYSTAL ISLAND HRG&mak",50,25]
["CRYSTAL ISLAND SA&Elg",55,30]
["VIP SEA TRIPE",75,35]
["Super Scuba",58,35]
["Rusalka (Mermaid)",40,20]
["Rusalka (Mermaid)  Package 3",30,15]
["Rusalka (Mermaid)  Package 6",30,15]
["Rusalka (Mermaid)  Package 9",30,15]
["Rusalka (Mermaid)  Package 13",30,15]
["Rusalka (Mermaid)  Package 16",30,15]
["RUSALKA+SAND MUSEUM+JUNGLE AQUAPARK",70,35]
["Rusalka (Mermaid) + titank aqua park",70,35]
["TR Rusalka (Mermaid) SA",0,0]
["TR Rusalka (Mermaid) Ma",0,0]
["ROYAL DOLPHIN SEA TRIPE",78,39]
["Natulius",100,50]
["aowc ( Advanc open water cours)",320,320]
["owc (open water cours)",320,320]
["p-submarine and sindbad",90,50]
["Sea Scope",50,25]
["TR Sea Scope",0,0]
["ELITE VIP SEA TRIP",95,48]
["Romantic sunset sea TRIPE",52,26]
["Dream Island",45,25]
["Dolphin House",50,25]
["Grand Aquarium",45,23]
["G.Aquarium +Jungle Aqua parak+ city tour",65,20]
["G.Aquarium + s.city + Jungle Aqua parak",70,25]
["G.Aquarium +s.city + Dolphin show",68,20]
["G.Aquarium + Dolphin show",63,18]
[]
["Venus Spa Turkish Hamam",35,35]
["Vip1 Venus Spa",50,50]
["Vip2 Venus Spa",60,60]
["Moto 1 Hour",40,20]
[]
["Luxor 2-Package 30",90,42]
["Utopia-Package 30",43,24]
[]
["Luxor 2-Package 31",90,45]
["Moto 2-Package 31",36,18]
[]
["Luxor 2-Package 32",90,45]
["Sea Trip-Package 32",30,15]
[]
["Luxor 2-Package 33",90,45]
["Cairo-Package 33",102,51]
[]
["Cairo-Package 34",105,53]
["Moto 2-Package 34",38,19]
[]
["Cairo-Package 35",105,51]
["Utopia-Package 35",44,24]
[]
["Luxor 2-Package 36",90,45]
["Moto 1 Hour-Package 36",28,14]
[]
[]
[]
[]
[]
[]
[]
[]
[]
["Dolphina Accompanying",35,20]
["Dolphina sw 5 min",60,60]
["Dolphina sw 10 min",85,85]
["Dolphin therapy",275,275]
["Dolphin therapy",165,165]
["Dolphin sw 10 show",100,100]
["Dolphin sw 15 show",140,140]
["Dolphin sw 5 show",70,70]
["Dolphin accompanying person",35,20]
["Dolphin world show",40,20]
["Dolphin world show  Package 3",35,18]
["Dolphin world show(El Gouna)",45,25]
["Sand city",21,10]
["Sand City + city tour",10,5]
["Sand City + Moto 2",55,22]
["Sand City + Moto 5",70,30]
["UTPOIA ISLAND + SAND MUSEUM",60,30]
["MYSTERY ROYAL OASIS   + SAND MUSEUM",75,35]
["SEA trip + SAND MUSEUM",45,25]
["Dolphin world show + SAND MUSEUM",55,27]
["Natulius + Sand city",110,55]
["Moto 2",45,23]
["Moto 2 package 7",35,20]
["Moto 2 package 8",35,15]
["Moto 2 package 10",35,15]
["Moto 2 package 11",35,18]
["Moto 2 package 13",35,15]
["Moto 2 package 15",35,15]
["Quad Safari",30,15]
["Badawia",60,30]
["Sun Rise M2",40,20]
["Super badawia - spieder",0,0]
["Super badawia",60,35]
["Super badawia  Package 1",55,30]
["Super badawia  Package 2",55,30]
["Super badawia  Package 4",55,30]
["M2.sun set",40,20]
["Mystery Royal Oasis PENDING",60,30]
["city tour with aquarium",10,5]
["lool show",25,15]
["lool show package 6",20,10]
["lool show package 8",25,15]
["lool show package 12",18,10]
["lool show package 14",20,10]
["City tour with lunch",20,10]
["City tour with dinner",30,15]
["fast trak",55,55]
["cairo by plane",285,250]
["Jorusalim",0,0]
["Aspendos Turkish Bath",35,35]
["Vip1 Aspendos",50,50]
["Vip2 Aspendos",65,65]
["Sultan Turkhish Bath&P1",35,17]
["Sultan p1 package 7",30,0]
["Sultan p1 package 9",30,0]
["Sultan p1 package 10",30,0]
["Sultan p1 package 11",30,0]
["Sultan p1 package 14",35,0]
["Sultan Turkhish Bath&P2",50,25]
["Sultan Turkhish Bath&P3",60,30]
["Sultan Vip Program",400,80]
["CITY TOUR",10,5]
[]
["private Boat Diving",725]
["private cairo by plane",730]
["Private Boat Fishing",500]
["Private utopia",730]
["private el gouna",780]
["Profissinal fishing",580]
["private alex cairo",1150]
["private Super badwaya",310]
["Private Aswen o.n",1400]
["private moto 2",205]
["private badawaya",295]
["private paradise",690]
["Private Luxor",630]
["Private Cairo",665]
["private Dandara",650]
["private City Tour",165]
["Private St.paul@Antony",370]
["priavte super scouba",770]
["LITTLE BUDDAH DISCO",0,0]
["Party Pyramisa Sahl Hashesh",0,0]
[]
[]
[]
[]
[]
[]
[]
[]
[]
[]
["Marsa alam"]
["Intro Diving",115,115]
["Intro Diving package"]
["Diving Beach",90,90]
["M2.sun set dbl ",75,75]
["M2.sun set sgl  ",65,65]
["Moto 2 Sgl",65,65]
["Moto 2 Dbl",75,75]
["CORAL GARDEN",70,35]
["CORAL GARDEN Package"]
["DANDARA LUXOR",120,60]
["Satayh Daily Snorkling Trip",100,50]
["Satayh Daily Snorkling Trip package"]
["SNORKELING ON DIVING BOAT",65,30]
["SUPER SAFARI",80,40]
["SEA SCOPE 1",60,35]
["Abu Dbbab 1/2 day",40,25]
["Abu Dbbab 1/2 day Package"]
["Hamata sea trip",80,45]
["Hamata sea trip package"]
["Abu Dbbab Full Day",55,30]
["LUXOR",120,60]
["Open water course",510,510]
["Advance open water course",410,410]
["CAIRO",125,65]
["ASWAN O.N",270,135]
["ASWAN O.D",135,70]
["ASWAN O.D Package 1"]
["Luxor 2",105,55]
["Super moto Dbl",85,0]
["Super moto Dbl package"]
["Super moto sgl",80,0]
["Super moto sgl package"]
["Private CORAL GARDEN",950,0]
["FULL DAY WITH FISHING",75,35]
["HALF DAY SNORKELINg",50,25]
["AQUA PARK",55,35]
["privat hamata",950,0]
["city tour",35,18]
["city tour with aquarium",60,30]
["private Aswan O.D",830]
["private Luxor O.D ",835]
["private Cairo O.D",1000]
["city tour",200]
["private Moto 2 sgl",250]
["private Moto 2 dbl",225]
["private Super Safri",450]
["private Aswan O.D",830]
["private Luxor O.D ",835]
["private Cairo O.D",1000]
["city tour",200]
["private Moto 2 sgl",250]
["private Moto 2 dbl",225]
["private Super Safri",450]
["Private Dandara",650]

{"sheet":"Data","index":1,"n_rows":444,"n_cols":10,"rows_kept":444,"cut":false,"hidden":false,"merged":[]}
["Excursion",null,"Excursion date","ADL (group)","CHD (group)","Hotel town","Total sum","Note","Transfer","Real Price  $"]
["MOTO2",{"$f":"IFERROR(VLOOKUP(A2,Sheet2!$B$2:$C$18,2,0),\"\")","v":"Moto 2"},"2018-08-01",2,0,"HURGADA",80,null,{"$f":"IFERROR(VALUE(IF(ISERROR(MATCH(A2,Sources!$B:$B,0)),IF(ISERROR(MATCH(F2,Sources!$C:$C,0)),\"\",5*D2+3*E2),IF(AND(NOT(ISERROR(MATCH(A2,Sources!$D:$D,0))),NOT(ISERROR(MATCH(F2,Sources!$E:$E,0)))),5*D2+3*E2,\"\"))&IF(AND(ISERROR(MATCH(A2,Sources!$F:$F,0)),NOT(ISERROR(MATCH(F2,Sources!$G:$G,0)))),5*D2+3*E2,\"\")),\"\")","v":""},{"$f":"IF(I2=\"\",G2,(G2-I2))","v":80}]
["MOTO2",{"$f":"IFERROR(VLOOKUP(A3,Sheet2!$B$2:$C$18,2,0),\"\")","v":"Moto 2"},"2018-08-01",2,0,"HURGADA",80,null,{"$f":"IFERROR(VALUE(IF(ISERROR(MATCH(A3,Sources!$B:$B,0)),IF(ISERROR(MATCH(F3,Sources!$C:$C,0)),\"\",5*D3+3*E3),IF(AND(NOT(ISERROR(MATCH(A3,Sources!$D:$D,0))),NOT(ISERROR(MATCH(F3,Sources!$E:$E,0)))),5*D3+3*E3,\"\"))&IF(AND(ISERROR(MATCH(A3,Sources!$F:$F,0)),NOT(ISERROR(MATCH(F3,Sources!$G:$G,0)))),5*D3+3*E3,\"\")),\"\")","v":""},{"$f":"IF(I3=\"\",G3,(G3-I3))","v":80}]
["MOTO 1 HOUR",{"$f":"IFERROR(VLOOKUP(A4,Sheet2!$B$2:$C$18,2,0),\"\")","v":"Moto 1 Hour"},"2018-08-01",1,1,"HURGADA",80,null,{"$f":"IFERROR(VALUE(IF(ISERROR(MATCH(A4,Sources!$B:$B,0)),IF(ISERROR(MATCH(F4,Sources!$C:$C,0)),\"\",5*D4+3*E4),IF(AND(NOT(ISERROR(MATCH(A4,Sources!$D:$D,0))),NOT(ISERROR(MATCH(F4,Sources!$E:$E,0)))),5*D4+3*E4,\"\"))&IF(AND(ISERROR(MATCH(A4,Sources!$F:$F,0)),NOT(ISERROR(MATCH(F4,Sources!$G:$G,0)))),5*D4+3*E4,\"\")),\"\")","v":""},80]
["OVER DAY LUXORQUEEN VALLY",{"$f":"IFERROR(VLOOKUP(A5,Sheet2!$B$2:$C$18,2,0),\"\")","v":"LUXOR 2"},"2018-08-01",1,0,"HURGADA",88,null,{"$f":"IFERROR(VALUE(IF(ISERROR(MATCH(A5,Sources!$B:$B,0)),IF(ISERROR(MATCH(F5,Sources!$C:$C,0)),\"\",5*D5+3*E5),IF(AND(NOT(ISERROR(MATCH(A5,Sources!$D:$D,0))),NOT(ISERROR(MATCH(F5,Sources!$E:$E,0)))),5*D5+3*E5,\"\"))&IF(AND(ISERROR(MATCH(A5,Sources!$F:$F,0)),NOT(ISERROR(MATCH(F5,Sources!$G:$G,0)))),5*D5+3*E5,\"\")),\"\")","v":""},88]
["OVER DAY LUXORQUEEN VALLY",{"$f":"IFERROR(VLOOKUP(A6,Sheet2!$B$2:$C$18,2,0),\"\")","v":"LUXOR 2"},"2018-08-01",3,0,"HURGADA",264,"belarus",{"$f":"IFERROR(VALUE(IF(ISERROR(MATCH(A6,Sources!$B:$B,0)),IF(ISERROR(MATCH(F6,Sources!$C:$C,0)),\"\",5*D6+3*E6),IF(AND(NOT(ISERROR(MATCH(A6,Sources!$D:$D,0))),NOT(ISERROR(MATCH(F6,Sources!$E:$E,0)))),5*D6+3*E6,\"\"))&IF(AND(ISERROR(MATCH(A6,Sources!$F:$F,0)),NOT(ISERROR(MATCH(F6,Sources!$G:$G,0)))),5*D6+3*E6,\"\")),\"\")","v":""},264]
["OVER DAY LUXORQUEEN VALLY",{"$f":"IFERROR(VLOOKUP(A7,Sheet2!$B$2:$C$18,2,0),\"\")","v":"LUXOR 2"},"2018-08-01",2,1,"HURGADA",220,"ukraine",{"$f":"IFERROR(VALUE(IF(ISERROR(MATCH(A7,Sources!$B:$B,0)),IF(ISERROR(MATCH(F7,Sources!$C:$C,0)),\"\",5*D7+3*E7),IF(AND(NOT(ISERROR(MATCH(A7,Sources!$D:$D,0))),NOT(ISERROR(MATCH(F7,Sources!$E:$E,0)))),5*D7+3*E7,\"\"))&IF(AND(ISERROR(MATCH(A7,Sources!$F:$F,0)),NOT(ISERROR(MATCH(F7,Sources!$G:$G,0)))),5*D7+3*E7,\"\")),\"\")","v":""},220]
["OVER DAY LUXORQUEEN VALLY",{"$f":"IFERROR(VLOOKUP(A8,Sheet2!$B$2:$C$18,2,0),\"\")","v":"LUXOR 2"},"2018-08-01",2,0,"HURGADA",176,"UKRAINE",{"$f":"IFERROR(VALUE(IF(ISERROR(MATCH(A8,Sources!$B:$B,0)),IF(ISERROR(MATCH(F8,Sources!$C:$C,0)),\"\",5*D8+3*E8),IF(AND(NOT(ISERROR(MATCH(A8,Sources!$D:$D,0))),NOT(ISERROR(MATCH(F8,Sources!$E:$E,0)))),5*D8+3*E8,\"\"))&IF(AND(ISERROR(MATCH(A8,Sources!$F:$F,0)),NOT(ISERROR(MATCH(F8,Sources!$G:$G,0)))),5*D8+3*E8,\"\")),\"\")","v":""},176]
["OVER DAY LUXORQUEEN VALLY",{"$f":"IFERROR(VLOOKUP(A9,Sheet2!$B$2:$C$18,2,0),\"\")","v":"LUXOR 2"},"2018-08-01",2,0,"HURGADA",176,"BELARUS",{"$f":"IFERROR(VALUE(IF(ISERROR(MATCH(A9,Sources!$B:$B,0)),IF(ISERROR(MATCH(F9,Sources!$C:$C,0)),\"\",5*D9+3*E9),IF(AND(NOT(ISERROR(MATCH(A9,Sources!$D:$D,0))),NOT(ISERROR(MATCH(F9,Sources!$E:$E,0)))),5*D9+3*E9,\"\"))&IF(AND(ISERROR(MATCH(A9,Sources!$F:$F,0)),NOT(ISERROR(MATCH(F9,Sources!$G:$G,0)))),5*D9+3*E9,\"\")),\"\")","v":""},176]
["OVER DAY LUXORQUEEN VALLY",{"$f":"IFERROR(VLOOKUP(A10,Sheet2!$B$2:$C$18,2,0),\"\")","v":"LUXOR 2"},"2018-08-01",1,1,"MAKADI BAY",132,null,{"$f":"IFERROR(VALUE(IF(ISERROR(MATCH(A10,Sources!$B:$B,0)),IF(ISERROR(MATCH(F10,Sources!$C:$C,0)),\"\",5*D10+3*E10),IF(AND(NOT(ISERROR(MATCH(A10,Sources!$D:$D,0))),NOT(ISERROR(MATCH(F10,Sources!$E:$E,0)))),5*D10+3*E10,\"\"))&IF(AND(ISERROR(MATCH(A10,Sources!$F:$F,0)),NOT(ISERROR(MATCH(F10,Sources!$G:$G,0)))),5*D10+3*E10,\"\")),\"\")","v":""},132]
["RUSALKA  ( MERMAID )",{"$f":"IFERROR(VLOOKUP(A11,Sheet2!$B$2:$C$18,2,0),\"\")","v":"Rusalka (Mermaid)"},"2018-08-02",1,0,"HURGADA",35,null,{"$f":"IFERROR(VALUE(IF(ISERROR(MATCH(A11,Sources!$B:$B,0)),IF(ISERROR(MATCH(F11,Sources!$C:$C,0)),\"\",5*D11+3*E11),IF(AND(NOT(ISERROR(MATCH(A11,Sources!$D:$D,0))),NOT(ISERROR(MATCH(F11,Sources!$E:$E,0)))),5*D11+3*E11,\"\"))&IF(AND(ISERROR(MATCH(A11,Sources!$F:$F,0)),NOT(ISERROR(MATCH(F11,Sources!$G:$G,0)))),5*D11+3*E11,\"\")),\"\")","v":""},35]
["UTOPIA ISLAND",{"$f":"IFERROR(VLOOKUP(A12,Sheet2!$B$2:$C$18,2,0),\"\")","v":"Utopia"},"2018-08-02",1,2,"HURGADA",96,null,{"$f":"IFERROR(VALUE(IF(ISERROR(MATCH(A12,Sources!$B:$B,0)),IF(ISERROR(MATCH(F12,Sources!$C:$C,0)),\"\",5*D12+3*E12),IF(AND(NOT(ISERROR(MATCH(A12,Sources!$D:$D,0))),NOT(ISERROR(MATCH(F12,Sources!$E:$E,0)))),5*D12+3*E12,\"\"))&IF(AND(ISERROR(MATCH(A12,Sources!$F:$F,0)),NOT(ISERROR(MATCH(F12,Sources!$G:$G,0)))),5*D12+3*E12,\"\")),\"\")","v":""},96]
["UTOPIA ISLAND",{"$f":"IFERROR(VLOOKUP(A13,Sheet2!$B$2:$C$18,2,0),\"\")","v":"Utopia"},"2018-08-02",2,1,"HURGADA",120,null,{"$f":"IFERROR(VALUE(IF(ISERROR(MATCH(A13,Sources!$B:$B,0)),IF(ISERROR(MATCH(F13,Sources!$C:$C,0)),\"\",5*D13+3*E13),IF(AND(NOT(ISERROR(MATCH(A13,Sources!$D:$D,0))),NOT(ISERROR(MATCH(F13,Sources!$E:$E,0)))),5*D13+3*E13,\"\"))&IF(AND(ISERROR(MATCH(A13,Sources!$F:$F,0)),NOT(ISERROR(MATCH(F13,Sources!$G:$G,0)))),5*D13+3*E13,\"\")),\"\")","v":""},120]
["UTOPIA ISLAND",{"$f":"IFERROR(VLOOKUP(A14,Sheet2!$B$2:$C$18,2,0),\"\")","v":"Utopia"},"2018-08-02",7,2,"SAFAGA",384,null,{"$f":"IFERROR(VALUE(IF(ISERROR(MATCH(A14,Sources!$B:$B,0)),IF(ISERROR(MATCH(F14,Sources!$C:$C,0)),\"\",5*D14+3*E14),IF(AND(NOT(ISERROR(MATCH(A14,Sources!$D:$D,0))),NOT(ISERROR(MATCH(F14,Sources!$E:$E,0)))),5*D14+3*E14,\"\"))&IF(AND(ISERROR(MATCH(A14,Sources!$F:$F,0)),NOT(ISERROR(MATCH(F14,Sources!$G:$G,0)))),5*D14+3*E14,\"\")),\"\")","v":""},384]
["UTOPIA ISLAND",{"$f":"IFERROR(VLOOKUP(A15,Sheet2!$B$2:$C$18,2,0),\"\")","v":"Utopia"},"2018-08-02",3,0,"MAKADI BAY",144,null,{"$f":"IFERROR(VALUE(IF(ISERROR(MATCH(A15,Sources!$B:$B,0)),IF(ISERROR(MATCH(F15,Sources!$C:$C,0)),\"\",5*D15+3*E15),IF(AND(NOT(ISERROR(MATCH(A15,Sources!$D:$D,0))),NOT(ISERROR(MATCH(F15,Sources!$E:$E,0)))),5*D15+3*E15,\"\"))&IF(AND(ISERROR(MATCH(A15,Sources!$F:$F,0)),NOT(ISERROR(MATCH(F15,Sources!$G:$G,0)))),5*D15+3*E15,\"\")),\"\")","v":""},144]
["UTOPIA ISLAND",{"$f":"IFERROR(VLOOKUP(A16,Sheet2!$B$2:$C$18,2,0),\"\")","v":"Utopia"},"2018-08-02",2,0,"MAKADI BAY",96,null,{"$f":"IFERROR(VALUE(IF(ISERROR(MATCH(A16,Sources!$B:$B,0)),IF(ISERROR(MATCH(F16,Sources!$C:$C,0)),\"\",5*D16+3*E16),IF(AND(NOT(ISERROR(MATCH(A16,Sources!$D:$D,0))),NOT(ISERROR(MATCH(F16,Sources!$E:$E,0)))),5*D16+3*E16,\"\"))&IF(AND(ISERROR(MATCH(A16,Sources!$F:$F,0)),NOT(ISERROR(MATCH(F16,Sources!$G:$G,0)))),5*D16+3*E16,\"\")),\"\")","v":""},96]
["UTOPIA ISLAND",{"$f":"IFERROR(VLOOKUP(A17,Sheet2!$B$2:$C$18,2,0),\"\")","v":"Utopia"},"2018-08-02",1,1,"MAKADI BAY",72,null,{"$f":"IFERROR(VALUE(IF(ISERROR(MATCH(A17,Sources!$B:$B,0)),IF(ISERROR(MATCH(F17,Sources!$C:$C,0)),\"\",5*D17+3*E17),IF(AND(NOT(ISERROR(MATCH(A17,Sources!$D:$D,0))),NOT(ISERROR(MATCH(F17,Sources!$E:$E,0)))),5*D17+3*E17,\"\"))&IF(AND(ISERROR(MATCH(A17,Sources!$F:$F,0)),NOT(ISERROR(MATCH(F17,Sources!$G:$G,0)))),5*D17+3*E17,\"\")),\"\")","v":""},72]
["UTOPIA ISLAND",{"$f":"IFERROR(VLOOKUP(A18,Sheet2!$B$2:$C$18,2,0),\"\")","v":"Utopia"},"2018-08-02",3,0,"MAKADI BAY",144,null,{"$f":"IFERROR(VALUE(IF(ISERROR(MATCH(A18,Sources!$B:$B,0)),IF(ISERROR(MATCH(F18,Sources!$C:$C,0)),\"\",5*D18+3*E18),IF(AND(NOT(ISERROR(MATCH(A18,Sources!$D:$D,0))),NOT(ISERROR(MATCH(F18,Sources!$E:$E,0)))),5*D18+3*E18,\"\"))&IF(AND(ISERROR(MATCH(A18,Sources!$F:$F,0)),NOT(ISERROR(MATCH(F18,Sources!$G:$G,0)))),5*D18+3*E18,\"\")),\"\")","v":""},144]
["UTOPIA ISLAND",{"$f":"IFERROR(VLOOKUP(A19,Sheet2!$B$2:$C$18,2,0),\"\")","v":"Utopia"},"2018-08-02",2,1,"HURGADA",120,null,{"$f":"IFERROR(VALUE(IF(ISERROR(MATCH(A19,Sources!$B:$B,0)),IF(ISERROR(MATCH(F19,Sources!$C:$C,0)),\"\",5*D19+3*E19),IF(AND(NOT(ISERROR(MATCH(A19,Sources!$D:$D,0))),NOT(ISERROR(MATCH(F19,Sources!$E:$E,0)))),5*D19+3*E19,\"\"))&IF(AND(ISERROR(MATCH(A19,Sources!$F:$F,0)),NOT(ISERROR(MATCH(F19,Sources!$G:$G,0)))),5*D19+3*E19,\"\")),\"\")","v":""},120]
["UTOPIA ISLAND",{"$f":"IFERROR(VLOOKUP(A20,Sheet2!$B$2:$C$18,2,0),\"\")","v":"Utopia"},"2018-08-02",2,0,"HURGADA",96,null,{"$f":"IFERROR(VALUE(IF(ISERROR(MATCH(A20,Sources!$B:$B,0)),IF(ISERROR(MATCH(F20,Sources!$C:$C,0)),\"\",5*D20+3*E20),IF(AND(NOT(ISERROR(MATCH(A20,Sources!$D:$D,0))),NOT(ISERROR(MATCH(F20,Sources!$E:$E,0)))),5*D20+3*E20,\"\"))&IF(AND(ISERROR(MATCH(A20,Sources!$F:$F,0)),NOT(ISERROR(MATCH(F20,Sources!$G:$G,0)))),5*D20+3*E20,\"\")),\"\")","v":""},96]
["UTOPIA ISLAND",{"$f":"IFERROR(VLOOKUP(A21,Sheet2!$B$2:$C$18,2,0),\"\")","v":"Utopia"},"2018-08-02",2,0,"HURGADA",96,null,{"$f":"IFERROR(VALUE(IF(ISERROR(MATCH(A21,Sources!$B:$B,0)),IF(ISERROR(MATCH(F21,Sources!$C:$C,0)),\"\",5*D21+3*E21),IF(AND(NOT(ISERROR(MATCH(A21,Sources!$D:$D,0))),NOT(ISERROR(MATCH(F21,Sources!$E:$E,0)))),5*D21+3*E21,\"\"))&IF(AND(ISERROR(MATCH(A21,Sources!$F:$F,0)),NOT(ISERROR(MATCH(F21,Sources!$G:$G,0)))),5*D21+3*E21,\"\")),\"\")","v":""},96]
["UTOPIA ISLAND",{"$f":"IFERROR(VLOOKUP(A22,Sheet2!$B$2:$C$18,2,0),\"\")","v":"Utopia"},"2018-08-02",2,0,"HURGADA",96,null,{"$f":"IFERROR(VALUE(IF(ISERROR(MATCH(A22,Sources!$B:$B,0)),IF(ISERROR(MATCH(F22,Sources!$C:$C,0)),\"\",5*D22+3*E22),IF(AND(NOT(ISERROR(MATCH(A22,Sources!$D:$D,0))),NOT(ISERROR(MATCH(F22,Sources!$E:$E,0)))),5*D22+3*E22,\"\"))&IF(AND(ISERROR(MATCH(A22,Sources!$F:$F,0)),NOT(ISERROR(MATCH(F22,Sources!$G:$G,0)))),5*D22+3*E22,\"\")),\"\")","v":""},96]
["UTOPIA ISLAND",{"$f":"IFERROR(VLOOKUP(A23,Sheet2!$B$2:$C$18,2,0),\"\")","v":"Utopia"},"2018-08-02",2,0,"HURGADA",96,null,{"$f":"IFERROR(VALUE(IF(ISERROR(MATCH(A23,Sources!$B:$B,0)),IF(ISERROR(MATCH(F23,Sources!$C:$C,0)),\"\",5*D23+3*E23),IF(AND(NOT(ISERROR(MATCH(A23,Sources!$D:$D,0))),NOT(ISERROR(MATCH(F23,Sources!$E:$E,0)))),5*D23+3*E23,\"\"))&IF(AND(ISERROR(MATCH(A23,Sources!$F:$F,0)),NOT(ISERROR(MATCH(F23,Sources!$G:$G,0)))),5*D23+3*E23,\"\")),\"\")","v":""},96]
["UTOPIA ISLAND",{"$f":"IFERROR(VLOOKUP(A24,Sheet2!$B$2:$C$18,2,0),\"\")","v":"Utopia"},"2018-08-02",1,0,"HURGADA",48,null,{"$f":"IFERROR(VALUE(IF(ISERROR(MATCH(A24,Sources!$B:$B,0)),IF(ISERROR(MATCH(F24,Sources!$C:$C,0)),\"\",5*D24+3*E24),IF(AND(NOT(ISERROR(MATCH(A24,Sources!$D:$D,0))),NOT(ISERROR(MATCH(F24,Sources!$E:$E,0)))),5*D24+3*E24,\"\"))&IF(AND(ISERROR(MATCH(A24,Sources!$F:$F,0)),NOT(ISERROR(MATCH(F24,Sources!$G:$G,0)))),5*D24+3*E24,\"\")),\"\")","v":""},48]
["UTOPIA ISLAND",{"$f":"IFERROR(VLOOKUP(A25,Sheet2!$B$2:$C$18,2,0),\"\")","v":"Utopia"},"2018-08-02",2,0,"HURGADA",96,null,{"$f":"IFERROR(VALUE(IF(ISERROR(MATCH(A25,Sources!$B:$B,0)),IF(ISERROR(MATCH(F25,Sources!$C:$C,0)),\"\",5*D25+3*E25),IF(AND(NOT(ISERROR(MATCH(A25,Sources!$D:$D,0))),NOT(ISERROR(MATCH(F25,Sources!$E:$E,0)))),5*D25+3*E25,\"\"))&IF(AND(ISERROR(MATCH(A25,Sources!$F:$F,0)),NOT(ISERROR(MATCH(F25,Sources!$G:$G,0)))),5*D25+3*E25,\"\")),\"\")","v":""},96]
["UTOPIA ISLAND",{"$f":"IFERROR(VLOOKUP(A26,Sheet2!$B$2:$C$18,2,0),\"\")","v":"Utopia"},"2018-08-02",2,1,"HURGADA",120,null,{"$f":"IFERROR(VALUE(IF(ISERROR(MATCH(A26,Sources!$B:$B,0)),IF(ISERROR(MATCH(F26,Sources!$C:$C,0)),\"\",5*D26+3*E26),IF(AND(NOT(ISERROR(MATCH(A26,Sources!$D:$D,0))),NOT(ISERROR(MATCH(F26,Sources!$E:$E,0)))),5*D26+3*E26,\"\"))&IF(AND(ISERROR(MATCH(A26,Sources!$F:$F,0)),NOT(ISERROR(MATCH(F26,Sources!$G:$G,0)))),5*D26+3*E26,\"\")),\"\")","v":""},120]
["SEA TRIP",{"$f":"IFERROR(VLOOKUP(A27,Sheet2!$B$2:$C$18,2,0),\"\")","v":"Sea Trip"},"2018-08-02",2,0,"HURGADA",80,null,{"$f":"IFERROR(VALUE(IF(ISERROR(MATCH(A27,Sources!$B:$B,0)),IF(ISERROR(MATCH(F27,Sources!$C:$C,0)),\"\",5*D27+3*E27),IF(AND(NOT(ISERROR(MATCH(A27,Sources!$D:$D,0))),NOT(ISERROR(MATCH(F27,Sources!$E:$E,0)))),5*D27+3*E27,\"\"))&IF(AND(ISERROR(MATCH(A27,Sources!$F:$F,0)),NOT(ISERROR(MATCH(F27,Sources!$G:$G,0)))),5*D27+3*E27,\"\")),\"\")","v":""},80]
["UTOPIA ISLAND",{"$f":"IFERROR(VLOOKUP(A28,Sheet2!$B$2:$C$18,2,0),\"\")","v":"Utopia"},"2018-08-02",1,1,"HURGADA",72,null,{"$f":"IFERROR(VALUE(IF(ISERROR(MATCH(A28,Sources!$B:$B,0)),IF(ISERROR(MATCH(F28,Sources!$C:$C,0)),\"\",5*D28+3*E28),IF(AND(NOT(ISERROR(MATCH(A28,Sources!$D:$D,0))),NOT(ISERROR(MATCH(F28,Sources!$E:$E,0)))),5*D28+3*E28,\"\"))&IF(AND(ISERROR(MATCH(A28,Sources!$F:$F,0)),NOT(ISERROR(MATCH(F28,Sources!$G:$G,0)))),5*D28+3*E28,\"\")),\"\")","v":""},72]
["UTOPIA ISLAND",{"$f":"IFERROR(VLOOKUP(A29,Sheet2!$B$2:$C$18,2,0),\"\")","v":"Utopia"},"2018-08-02",2,0,"HURGADA",96,null,{"$f":"IFERROR(VALUE(IF(ISERROR(MATCH(A29,Sources!$B:$B,0)),IF(ISERROR(MATCH(F29,Sources!$C:$C,0)),\"\",5*D29+3*E29),IF(AND(NOT(ISERROR(MATCH(A29,Sources!$D:$D,0))),NOT(ISERROR(MATCH(F29,Sources!$E:$E,0)))),5*D29+3*E29,\"\"))&IF(AND(ISERROR(MATCH(A29,Sources!$F:$F,0)),NOT(ISERROR(MATCH(F29,Sources!$G:$G,0)))),5*D29+3*E29,\"\")),\"\")","v":""},96]
["UTOPIA ISLAND",{"$f":"IFERROR(VLOOKUP(A30,Sheet2!$B$2:$C$18,2,0),\"\")","v":"Utopia"},"2018-08-02",1,0,"HURGADA",48,null,{"$f":"IFERROR(VALUE(IF(ISERROR(MATCH(A30,Sources!$B:$B,0)),IF(ISERROR(MATCH(F30,Sources!$C:$C,0)),\"\",5*D30+3*E30),IF(AND(NOT(ISERROR(MATCH(A30,Sources!$D:$D,0))),NOT(ISERROR(MATCH(F30,Sources!$E:$E,0)))),5*D30+3*E30,\"\"))&IF(AND(ISERROR(MATCH(A30,Sources!$F:$F,0)),NOT(ISERROR(MATCH(F30,Sources!$G:$G,0)))),5*D30+3*E30,\"\")),\"\")","v":""},48]
["MOTO2",{"$f":"IFERROR(VLOOKUP(A31,Sheet2!$B$2:$C$18,2,0),\"\")","v":"Moto 2"},"2018-08-03",2,1,"HURGADA",100,null,{"$f":"IFERROR(VALUE(IF(ISERROR(MATCH(A31,Sources!$B:$B,0)),IF(ISERROR(MATCH(F31,Sources!$C:$C,0)),\"\",5*D31+3*E31),IF(AND(NOT(ISERROR(MATCH(A31,Sources!$D:$D,0))),NOT(ISERROR(MATCH(F31,Sources!$E:$E,0)))),5*D31+3*E31,\"\"))&IF(AND(ISERROR(MATCH(A31,Sources!$F:$F,0)),NOT(ISERROR(MATCH(F31,Sources!$G:$G,0)))),5*D31+3*E31,\"\")),\"\")","v":""},100]
["MOTO2",{"$f":"IFERROR(VLOOKUP(A32,Sheet2!$B$2:$C$18,2,0),\"\")","v":"Moto 2"},"2018-08-03",2,0,"HURGADA",80,null,{"$f":"IFERROR(VALUE(IF(ISERROR(MATCH(A32,Sources!$B:$B,0)),IF(ISERROR(MATCH(F32,Sources!$C:$C,0)),\"\",5*D32+3*E32),IF(AND(NOT(ISERROR(MATCH(A32,Sources!$D:$D,0))),NOT(ISERROR(MATCH(F32,Sources!$E:$E,0)))),5*D32+3*E32,\"\"))&IF(AND(ISERROR(MATCH(A32,Sources!$F:$F,0)),NOT(ISERROR(MATCH(F32,Sources!$G:$G,0)))),5*D32+3*E32,\"\")),\"\")","v":""},80]
["MOTO2",{"$f":"IFERROR(VLOOKUP(A33,Sheet2!$B$2:$C$18,2,0),\"\")","v":"Moto 2"},"2018-08-03",1,1,"HURGADA",60,null,{"$f":"IFERROR(VALUE(IF(ISERROR(MATCH(A33,Sources!$B:$B,0)),IF(ISERROR(MATCH(F33,Sources!$C:$C,0)),\"\",5*D33+3*E33),IF(AND(NOT(ISERROR(MATCH(A33,Sources!$D:$D,0))),NOT(ISERROR(MATCH(F33,Sources!$E:$E,0)))),5*D33+3*E33,\"\"))&IF(AND(ISERROR(MATCH(A33,Sources!$F:$F,0)),NOT(ISERROR(MATCH(F33,Sources!$G:$G,0)))),5*D33+3*E33,\"\")),\"\")","v":""},60]
["MOTO2",{"$f":"IFERROR(VLOOKUP(A34,Sheet2!$B$2:$C$18,2,0),\"\")","v":"Moto 2"},"2018-08-03",1,1,"HURGADA",60,null,{"$f":"IFERROR(VALUE(IF(ISERROR(MATCH(A34,Sources!$B:$B,0)),IF(ISERROR(MATCH(F34,Sources!$C:$C,0)),\"\",5*D34+3*E34),IF(AND(NOT(ISERROR(MATCH(A34,Sources!$D:$D,0))),NOT(ISERROR(MATCH(F34,Sources!$E:$E,0)))),5*D34+3*E34,\"\"))&IF(AND(ISERROR(MATCH(A34,Sources!$F:$F,0)),NOT(ISERROR(MATCH(F34,Sources!$G:$G,0)))),5*D34+3*E34,\"\")),\"\")","v":""},60]
["MOTO2",{"$f":"IFERROR(VLOOKUP(A35,Sheet2!$B$2:$C$18,2,0),\"\")","v":"Moto 2"},"2018-08-04",2,0,"MAKADI BAY",100,null,{"$f":"IFERROR(VALUE(IF(ISERROR(MATCH(A35,Sources!$B:$B,0)),IF(ISERROR(MATCH(F35,Sources!$C:$C,0)),\"\",5*D35+3*E35),IF(AND(NOT(ISERROR(MATCH(A35,Sources!$D:$D,0))),NOT(ISERROR(MATCH(F35,Sources!$E:$E,0)))),5*D35+3*E35,\"\"))&IF(AND(ISERROR(MATCH(A35,Sources!$F:$F,0)),NOT(ISERROR(MATCH(F35,Sources!$G:$G,0)))),5*D35+3*E35,\"\")),\"\")","v":10},90]
["GRAND AQUARIUM",{"$f":"IFERROR(VLOOKUP(A36,Sheet2!$B$2:$C$18,2,0),\"\")","v":"Grand Aquarium"},"2018-08-04",2,1,"MAKADI BAY",133,null,{"$f":"IFERROR(VALUE(IF(ISERROR(MATCH(A36,Sources!$B:$B,0)),IF(ISERROR(MATCH(F36,Sources!$C:$C,0)),\"\",5*D36+3*E36),IF(AND(NOT(ISERROR(MATCH(A36,Sources!$D:$D,0))),NOT(ISERROR(MATCH(F36,Sources!$E:$E,0)))),5*D36+3*E36,\"\"))&IF(AND(ISERROR(MATCH(A36,Sources!$F:$F,0)),NOT(ISERROR(MATCH(F36,Sources!$G:$G,0)))),5*D36+3*E36,\"\")),\"\")","v":13},120]
["GRAND AQUARIUM",{"$f":"IFERROR(VLOOKUP(A37,Sheet2!$B$2:$C$18,2,0),\"\")","v":"Grand Aquarium"},"2018-08-04",1,1,"HURGADA",53,null,{"$f":"IFERROR(VALUE(IF(ISERROR(MATCH(A37,Sources!$B:$B,0)),IF(ISERROR(MATCH(F37,Sources!$C:$C,0)),\"\",5*D37+3*E37),IF(AND(NOT(ISERROR(MATCH(A37,Sources!$D:$D,0))),NOT(ISERROR(MATCH(F37,Sources!$E:$E,0)))),5*D37+3*E37,\"\"))&IF(AND(ISERROR(MATCH(A37,Sources!$F:$F,0)),NOT(ISERROR(MATCH(F37,Sources!$G:$G,0)))),5*D37+3*E37,\"\")),\"\")","v":""},53]
["MOTO2",{"$f":"IFERROR(VLOOKUP(A38,Sheet2!$B$2:$C$18,2,0),\"\")","v":"Moto 2"},"2018-08-04",2,0,"HURGADA",90,null,{"$f":"IFERROR(VALUE(IF(ISERROR(MATCH(A38,Sources!$B:$B,0)),IF(ISERROR(MATCH(F38,Sources!$C:$C,0)),\"\",5*D38+3*E38),IF(AND(NOT(ISERROR(MATCH(A38,Sources!$D:$D,0))),NOT(ISERROR(MATCH(F38,Sources!$E:$E,0)))),5*D38+3*E38,\"\"))&IF(AND(ISERROR(MATCH(A38,Sources!$F:$F,0)),NOT(ISERROR(MATCH(F38,Sources!$G:$G,0)))),5*D38+3*E38,\"\")),\"\")","v":""},90]
["MOTO2",{"$f":"IFERROR(VLOOKUP(A39,Sheet2!$B$2:$C$18,2,0),\"\")","v":"Moto 2"},"2018-08-04",2,0,"HURGADA",90,null,{"$f":"IFERROR(VALUE(IF(ISERROR(MATCH(A39,Sources!$B:$B,0)),IF(ISERROR(MATCH(F39,Sources!$C:$C,0)),\"\",5*D39+3*E39),IF(AND(NOT(ISERROR(MATCH(A39,Sources!$D:$D,0))),NOT(ISERROR(MATCH(F39,Sources!$E:$E,0)))),5*D39+3*E39,\"\"))&IF(AND(ISERROR(MATCH(A39,Sources!$F:$F,0)),NOT(ISERROR(MATCH(F39,Sources!$G:$G,0)))),5*D39+3*E39,\"\")),\"\")","v":""},90]
["GRAND AQUARIUM",{"$f":"IFERROR(VLOOKUP(A40,Sheet2!$B$2:$C$18,2,0),\"\")","v":"Grand Aquarium"},"2018-08-04",2,0,"HURGADA",80,null,{"$f":"IFERROR(VALUE(IF(ISERROR(MATCH(A40,Sources!$B:$B,0)),IF(ISERROR(MATCH(F40,Sources!$C:$C,0)),\"\",5*D40+3*E40),IF(AND(NOT(ISERROR(MATCH(A40,Sources!$D:$D,0))),NOT(ISERROR(MATCH(F40,Sources!$E:$E,0)))),5*D40+3*E40,\"\"))&IF(AND(ISERROR(MATCH(A40,Sources!$F:$F,0)),NOT(ISERROR(MATCH(F40,Sources!$G:$G,0)))),5*D40+3*E40,\"\")),\"\")","v":""},80]
["MOTO2",{"$f":"IFERROR(VLOOKUP(A41,Sheet2!$B$2:$C$18,2,0),\"\")","v":"Moto 2"},"2018-08-04",3,0,"MAKADI BAY",135,null,{"$f":"IFERROR(VALUE(IF(ISERROR(MATCH(A41,Sources!$B:$B,0)),IF(ISERROR(MATCH(F41,Sources!$C:$C,0)),\"\",5*D41+3*E41),IF(AND(NOT(ISERROR(MATCH(A41,Sources!$D:$D,0))),NOT(ISERROR(MATCH(F41,Sources!$E:$E,0)))),5*D41+3*E41,\"\"))&IF(AND(ISERROR(MATCH(A41,Sources!$F:$F,0)),NOT(ISERROR(MATCH(F41,Sources!$G:$G,0)))),5*D41+3*E41,\"\")),\"\")","v":15},120]
["GRAND AQUARIUM",{"$f":"IFERROR(VLOOKUP(A42,Sheet2!$B$2:$C$18,2,0),\"\")","v":"Grand Aquarium"},"2018-08-04",2,1,"HURGADA",87,null,{"$f":"IFERROR(VALUE(IF(ISERROR(MATCH(A42,Sources!$B:$B,0)),IF(ISERROR(MATCH(F42,Sources!$C:$C,0)),\"\",5*D42+3*E42),IF(AND(NOT(ISERROR(MATCH(A42,Sources!$D:$D,0))),NOT(ISERROR(MATCH(F42,Sources!$E:$E,0)))),5*D42+3*E42,\"\"))&IF(AND(ISERROR(MATCH(A42,Sources!$F:$F,0)),NOT(ISERROR(MATCH(F42,Sources!$G:$G,0)))),5*D42+3*E42,\"\")),\"\")","v":""},87]
["GRAND AQUARIUM",{"$f":"IFERROR(VLOOKUP(A43,Sheet2!$B$2:$C$18,2,0),\"\")","v":"Grand Aquarium"},"2018-08-04",2,0,"HURGADA",70,null,{"$f":"IFERROR(VALUE(IF(ISERROR(MATCH(A43,Sources!$B:$B,0)),IF(ISERROR(MATCH(F43,Sources!$C:$C,0)),\"\",5*D43+3*E43),IF(AND(NOT(ISERROR(MATCH(A43,Sources!$D:$D,0))),NOT(ISERROR(MATCH(F43,Sources!$E:$E,0)))),5*D43+3*E43,\"\"))&IF(AND(ISERROR(MATCH(A43,Sources!$F:$F,0)),NOT(ISERROR(MATCH(F43,Sources!$G:$G,0)))),5*D43+3*E43,\"\")),\"\")","v":""},70]
["MOTO2",{"$f":"IFERROR(VLOOKUP(A44,Sheet2!$B$2:$C$18,2,0),\"\")","v":"Moto 2"},"2018-08-04",2,0,"HURGADA",80,null,{"$f":"IFERROR(VALUE(IF(ISERROR(MATCH(A44,Sources!$B:$B,0)),IF(ISERROR(MATCH(F44,Sources!$C:$C,0)),\"\",5*D44+3*E44),IF(AND(NOT(ISERROR(MATCH(A44,Sources!$D:$D,0))),NOT(ISERROR(MATCH(F44,Sources!$E:$E,0)))),5*D44+3*E44,\"\"))&IF(AND(ISERROR(MATCH(A44,Sources!$F:$F,0)),NOT(ISERROR(MATCH(F44,Sources!$G:$G,0)))),5*D44+3*E44,\"\")),\"\")","v":""},80]
["MOTO2",{"$f":"IFERROR(VLOOKUP(A45,Sheet2!$B$2:$C$18,2,0),\"\")","v":"Moto 2"},"2018-08-04",2,0,"HURGADA",80,null,{"$f":"IFERROR(VALUE(IF(ISERROR(MATCH(A45,Sources!$B:$B,0)),IF(ISERROR(MATCH(F45,Sources!$C:$C,0)),\"\",5*D45+3*E45),IF(AND(NOT(ISERROR(MATCH(A45,Sources!$D:$D,0))),NOT(ISERROR(MATCH(F45,Sources!$E:$E,0)))),5*D45+3*E45,\"\"))&IF(AND(ISERROR(MATCH(A45,Sources!$F:$F,0)),NOT(ISERROR(MATCH(F45,Sources!$G:$G,0)))),5*D45+3*E45,\"\")),\"\")","v":""},80]
["GRAND AQUARIUM",{"$f":"IFERROR(VLOOKUP(A46,Sheet2!$B$2:$C$18,2,0),\"\")","v":"Grand Aquarium"},"2018-08-04",2,1,"HURGADA",87,null,{"$f":"IFERROR(VALUE(IF(ISERROR(MATCH(A46,Sources!$B:$B,0)),IF(ISERROR(MATCH(F46,Sources!$C:$C,0)),\"\",5*D46+3*E46),IF(AND(NOT(ISERROR(MATCH(A46,Sources!$D:$D,0))),NOT(ISERROR(MATCH(F46,Sources!$E:$E,0)))),5*D46+3*E46,\"\"))&IF(AND(ISERROR(MATCH(A46,Sources!$F:$F,0)),NOT(ISERROR(MATCH(F46,Sources!$G:$G,0)))),5*D46+3*E46,\"\")),\"\")","v":""},87]
["GRAND AQUARIUM",{"$f":"IFERROR(VLOOKUP(A47,Sheet2!$B$2:$C$18,2,0),\"\")","v":"Grand Aquarium"},"2018-08-04",1,1,"HURGADA",52,null,{"$f":"IFERROR(VALUE(IF(ISERROR(MATCH(A47,Sources!$B:$B,0)),IF(ISERROR(MATCH(F47,Sources!$C:$C,0)),\"\",5*D47+3*E47),IF(AND(NOT(ISERROR(MATCH(A47,Sources!$D:$D,0))),NOT(ISERROR(MATCH(F47,Sources!$E:$E,0)))),5*D47+3*E47,\"\"))&IF(AND(ISERROR(MATCH(A47,Sources!$F:$F,0)),NOT(ISERROR(MATCH(F47,Sources!$G:$G,0)))),5*D47+3*E47,\"\")),\"\")","v":""},52]
["GRAND AQUARIUM",{"$f":"IFERROR(VLOOKUP(A48,Sheet2!$B$2:$C$18,2,0),\"\")","v":"Grand Aquarium"},"2018-08-04",2,0,"HURGADA",80,null,{"$f":"IFERROR(VALUE(IF(ISERROR(MATCH(A48,Sources!$B:$B,0)),IF(ISERROR(MATCH(F48,Sources!$C:$C,0)),\"\",5*D48+3*E48),IF(AND(NOT(ISERROR(MATCH(A48,Sources!$D:$D,0))),NOT(ISERROR(MATCH(F48,Sources!$E:$E,0)))),5*D48+3*E48,\"\"))&IF(AND(ISERROR(MATCH(A48,Sources!$F:$F,0)),NOT(ISERROR(MATCH(F48,Sources!$G:$G,0)))),5*D48+3*E48,\"\")),\"\")","v":""},80]
["MOTO 1 HOUR",{"$f":"IFERROR(VLOOKUP(A49,Sheet2!$B$2:$C$18,2,0),\"\")","v":"Moto 1 Hour"},"2018-08-04",1,0,"HURGADA",40,null,{"$f":"IFERROR(VALUE(IF(ISERROR(MATCH(A49,Sources!$B:$B,0)),IF(ISERROR(MATCH(F49,Sources!$C:$C,0)),\"\",5*D49+3*E49),IF(AND(NOT(ISERROR(MATCH(A49,Sources!$D:$D,0))),NOT(ISERROR(MATCH(F49,Sources!$E:$E,0)))),5*D49+3*E49,\"\"))&IF(AND(ISERROR(MATCH(A49,Sources!$F:$F,0)),NOT(ISERROR(MATCH(F49,Sources!$G:$G,0)))),5*D49+3*E49,\"\")),\"\")","v":""},40]
["GRAND AQUARIUM",{"$f":"IFERROR(VLOOKUP(A50,Sheet2!$B$2:$C$18,2,0),\"\")","v":"Grand Aquarium"},"2018-08-04",2,0,"HURGADA",80,null,{"$f":"IFERROR(VALUE(IF(ISERROR(MATCH(A50,Sources!$B:$B,0)),IF(ISERROR(MATCH(F50,Sources!$C:$C,0)),\"\",5*D50+3*E50),IF(AND(NOT(ISERROR(MATCH(A50,Sources!$D:$D,0))),NOT(ISERROR(MATCH(F50,Sources!$E:$E,0)))),5*D50+3*E50,\"\"))&IF(AND(ISERROR(MATCH(A50,Sources!$F:$F,0)),NOT(ISERROR(MATCH(F50,Sources!$G:$G,0)))),5*D50+3*E50,\"\")),\"\")","v":""},80]
["UTOPIA ISLAND",{"$f":"IFERROR(VLOOKUP(A51,Sheet2!$B$2:$C$18,2,0),\"\")","v":"Utopia"},"2018-08-05",1,0,"HURGADA",55,null,{"$f":"IFERROR(VALUE(IF(ISERROR(MATCH(A51,Sources!$B:$B,0)),IF(ISERROR(MATCH(F51,Sources!$C:$C,0)),\"\",5*D51+3*E51),IF(AND(NOT(ISERROR(MATCH(A51,Sources!$D:$D,0))),NOT(ISERROR(MATCH(F51,Sources!$E:$E,0)))),5*D51+3*E51,\"\"))&IF(AND(ISERROR(MATCH(A51,Sources!$F:$F,0)),NOT(ISERROR(MATCH(F51,Sources!$G:$G,0)))),5*D51+3*E51,\"\")),\"\")","v":""},55]
["UTOPIA ISLAND",{"$f":"IFERROR(VLOOKUP(A52,Sheet2!$B$2:$C$18,2,0),\"\")","v":"Utopia"},"2018-08-05",2,1,"HURGADA",138,null,{"$f":"IFERROR(VALUE(IF(ISERROR(MATCH(A52,Sources!$B:$B,0)),IF(ISERROR(MATCH(F52,Sources!$C:$C,0)),\"\",5*D52+3*E52),IF(AND(NOT(ISERROR(MATCH(A52,Sources!$D:$D,0))),NOT(ISERROR(MATCH(F52,Sources!$E:$E,0)))),5*D52+3*E52,\"\"))&IF(AND(ISERROR(MATCH(A52,Sources!$F:$F,0)),NOT(ISERROR(MATCH(F52,Sources!$G:$G,0)))),5*D52+3*E52,\"\")),\"\")","v":""},138]
["UTOPIA ISLAND",{"$f":"IFERROR(VLOOKUP(A53,Sheet2!$B$2:$C$18,2,0),\"\")","v":"Utopia"},"2018-08-05",2,0,"HURGADA",110,null,{"$f":"IFERROR(VALUE(IF(ISERROR(MATCH(A53,Sources!$B:$B,0)),IF(ISERROR(MATCH(F53,Sources!$C:$C,0)),\"\",5*D53+3*E53),IF(AND(NOT(ISERROR(MATCH(A53,Sources!$D:$D,0))),NOT(ISERROR(MATCH(F53,Sources!$E:$E,0)))),5*D53+3*E53,\"\"))&IF(AND(ISERROR(MATCH(A53,Sources!$F:$F,0)),NOT(ISERROR(MATCH(F53,Sources!$G:$G,0)))),5*D53+3*E53,\"\")),\"\")","v":""},110]
["UTOPIA ISLAND",{"$f":"IFERROR(VLOOKUP(A54,Sheet2!$B$2:$C$18,2,0),\"\")","v":"Utopia"},"2018-08-05",2,0,"HURGADA",110,null,{"$f":"IFERROR(VALUE(IF(ISERROR(MATCH(A54,Sources!$B:$B,0)),IF(ISERROR(MATCH(F54,Sources!$C:$C,0)),\"\",5*D54+3*E54),IF(AND(NOT(ISERROR(MATCH(A54,Sources!$D:$D,0))),NOT(ISERROR(MATCH(F54,Sources!$E:$E,0)))),5*D54+3*E54,\"\"))&IF(AND(ISERROR(MATCH(A54,Sources!$F:$F,0)),NOT(ISERROR(MATCH(F54,Sources!$G:$G,0)))),5*D54+3*E54,\"\")),\"\")","v":""},110]
["UTOPIA ISLAND",{"$f":"IFERROR(VLOOKUP(A55,Sheet2!$B$2:$C$18,2,0),\"\")","v":"Utopia"},"2018-08-05",2,0,"HURGADA",110,null,{"$f":"IFERROR(VALUE(IF(ISERROR(MATCH(A55,Sources!$B:$B,0)),IF(ISERROR(MATCH(F55,Sources!$C:$C,0)),\"\",5*D55+3*E55),IF(AND(NOT(ISERROR(MATCH(A55,Sources!$D:$D,0))),NOT(ISERROR(MATCH(F55,Sources!$E:$E,0)))),5*D55+3*E55,\"\"))&IF(AND(ISERROR(MATCH(A55,Sources!$F:$F,0)),NOT(ISERROR(MATCH(F55,Sources!$G:$G,0)))),5*D55+3*E55,\"\")),\"\")","v":""},110]
["UTOPIA ISLAND",{"$f":"IFERROR(VLOOKUP(A56,Sheet2!$B$2:$C$18,2,0),\"\")","v":"Utopia"},"2018-08-05",2,0,"HURGADA",110,null,{"$f":"IFERROR(VALUE(IF(ISERROR(MATCH(A56,Sources!$B:$B,0)),IF(ISERROR(MATCH(F56,Sources!$C:$C,0)),\"\",5*D56+3*E56),IF(AND(NOT(ISERROR(MATCH(A56,Sources!$D:$D,0))),NOT(ISERROR(MATCH(F56,Sources!$E:$E,0)))),5*D56+3*E56,\"\"))&IF(AND(ISERROR(MATCH(A56,Sources!$F:$F,0)),NOT(ISERROR(MATCH(F56,Sources!$G:$G,0)))),5*D56+3*E56,\"\")),\"\")","v":""},110]
["UTOPIA ISLAND",{"$f":"IFERROR(VLOOKUP(A57,Sheet2!$B$2:$C$18,2,0),\"\")","v":"Utopia"},"2018-08-05",2,1,"MAKADI BAY",138,null,{"$f":"IFERROR(VALUE(IF(ISERROR(MATCH(A57,Sources!$B:$B,0)),IF(ISERROR(MATCH(F57,Sources!$C:$C,0)),\"\",5*D57+3*E57),IF(AND(NOT(ISERROR(MATCH(A57,Sources!$D:$D,0))),NOT(ISERROR(MATCH(F57,Sources!$E:$E,0)))),5*D57+3*E57,\"\"))&IF(AND(ISERROR(MATCH(A57,Sources!$F:$F,0)),NOT(ISERROR(MATCH(F57,Sources!$G:$G,0)))),5*D57+3*E57,\"\")),\"\")","v":""},138]
["UTOPIA ISLAND",{"$f":"IFERROR(VLOOKUP(A58,Sheet2!$B$2:$C$18,2,0),\"\")","v":"Utopia"},"2018-08-05",2,1,"MAKADI BAY",138,null,{"$f":"IFERROR(VALUE(IF(ISERROR(MATCH(A58,Sources!$B:$B,0)),IF(ISERROR(MATCH(F58,Sources!$C:$C,0)),\"\",5*D58+3*E58),IF(AND(NOT(ISERROR(MATCH(A58,Sources!$D:$D,0))),NOT(ISERROR(MATCH(F58,Sources!$E:$E,0)))),5*D58+3*E58,\"\"))&IF(AND(ISERROR(MATCH(A58,Sources!$F:$F,0)),NOT(ISERROR(MATCH(F58,Sources!$G:$G,0)))),5*D58+3*E58,\"\")),\"\")","v":""},138]
["UTOPIA ISLAND",{"$f":"IFERROR(VLOOKUP(A59,Sheet2!$B$2:$C$18,2,0),\"\")","v":"Utopia"},"2018-08-05",2,1,"MAKADI BAY",138,null,{"$f":"IFERROR(VALUE(IF(ISERROR(MATCH(A59,Sources!$B:$B,0)),IF(ISERROR(MATCH(F59,Sources!$C:$C,0)),\"\",5*D59+3*E59),IF(AND(NOT(ISERROR(MATCH(A59,Sources!$D:$D,0))),NOT(ISERROR(MATCH(F59,Sources!$E:$E,0)))),5*D59+3*E59,\"\"))&IF(AND(ISERROR(MATCH(A59,Sources!$F:$F,0)),NOT(ISERROR(MATCH(F59,Sources!$G:$G,0)))),5*D59+3*E59,\"\")),\"\")","v":""},138]
["UTOPIA ISLAND",{"$f":"IFERROR(VLOOKUP(A60,Sheet2!$B$2:$C$18,2,0),\"\")","v":"Utopia"},"2018-08-05",2,0,"MAKADI BAY",110,null,{"$f":"IFERROR(VALUE(IF(ISERROR(MATCH(A60,Sources!$B:$B,0)),IF(ISERROR(MATCH(F60,Sources!$C:$C,0)),\"\",5*D60+3*E60),IF(AND(NOT(ISERROR(MATCH(A60,Sources!$D:$D,0))),NOT(ISERROR(MATCH(F60,Sources!$E:$E,0)))),5*D60+3*E60,\"\"))&IF(AND(ISERROR(MATCH(A60,Sources!$F:$F,0)),NOT(ISERROR(MATCH(F60,Sources!$G:$G,0)))),5*D60+3*E60,\"\")),\"\")","v":""},110]
["UTOPIA ISLAND",{"$f":"IFERROR(VLOOKUP(A61,Sheet2!$B$2:$C$18,2,0),\"\")","v":"Utopia"},"2018-08-05",2,0,"MAKADI BAY",110,null,{"$f":"IFERROR(VALUE(IF(ISERROR(MATCH(A61,Sources!$B:$B,0)),IF(ISERROR(MATCH(F61,Sources!$C:$C,0)),\"\",5*D61+3*E61),IF(AND(NOT(ISERROR(MATCH(A61,Sources!$D:$D,0))),NOT(ISERROR(MATCH(F61,Sources!$E:$E,0)))),5*D61+3*E61,\"\"))&IF(AND(ISERROR(MATCH(A61,Sources!$F:$F,0)),NOT(ISERROR(MATCH(F61,Sources!$G:$G,0)))),5*D61+3*E61,\"\")),\"\")","v":""},110]
["UTOPIA ISLAND",{"$f":"IFERROR(VLOOKUP(A62,Sheet2!$B$2:$C$18,2,0),\"\")","v":"Utopia"},"2018-08-05",2,2,"MAKADI BAY",166,null,{"$f":"IFERROR(VALUE(IF(ISERROR(MATCH(A62,Sources!$B:$B,0)),IF(ISERROR(MATCH(F62,Sources!$C:$C,0)),\"\",5*D62+3*E62),IF(AND(NOT(ISERROR(MATCH(A62,Sources!$D:$D,0))),NOT(ISERROR(MATCH(F62,Sources!$E:$E,0)))),5*D62+3*E62,\"\"))&IF(AND(ISERROR(MATCH(A62,Sources!$F:$F,0)),NOT(ISERROR(MATCH(F62,Sources!$G:$G,0)))),5*D62+3*E62,\"\")),\"\")","v":""},166]
["UTOPIA ISLAND",{"$f":"IFERROR(VLOOKUP(A63,Sheet2!$B$2:$C$18,2,0),\"\")","v":"Utopia"},"2018-08-05",2,0,"MAKADI BAY",110,null,{"$f":"IFERROR(VALUE(IF(ISERROR(MATCH(A63,Sources!$B:$B,0)),IF(ISERROR(MATCH(F63,Sources!$C:$C,0)),\"\",5*D63+3*E63),IF(AND(NOT(ISERROR(MATCH(A63,Sources!$D:$D,0))),NOT(ISERROR(MATCH(F63,Sources!$E:$E,0)))),5*D63+3*E63,\"\"))&IF(AND(ISERROR(MATCH(A63,Sources!$F:$F,0)),NOT(ISERROR(MATCH(F63,Sources!$G:$G,0)))),5*D63+3*E63,\"\")),\"\")","v":""},110]
["UTOPIA ISLAND",{"$f":"IFERROR(VLOOKUP(A64,Sheet2!$B$2:$C$18,2,0),\"\")","v":"Utopia"},"2018-08-05",2,1,"MAKADI BAY",138,null,{"$f":"IFERROR(VALUE(IF(ISERROR(MATCH(A64,Sources!$B:$B,0)),IF(ISERROR(MATCH(F64,Sources!$C:$C,0)),\"\",5*D64+3*E64),IF(AND(NOT(ISERROR(MATCH(A64,Sources!$D:$D,0))),NOT(ISERROR(MATCH(F64,Sources!$E:$E,0)))),5*D64+3*E64,\"\"))&IF(AND(ISERROR(MATCH(A64,Sources!$F:$F,0)),NOT(ISERROR(MATCH(F64,Sources!$G:$G,0)))),5*D64+3*E64,\"\")),\"\")","v":""},138]
["UTOPIA ISLAND",{"$f":"IFERROR(VLOOKUP(A65,Sheet2!$B$2:$C$18,2,0),\"\")","v":"Utopia"},"2018-08-05",2,0,"MAKADI BAY",110,null,{"$f":"IFERROR(VALUE(IF(ISERROR(MATCH(A65,Sources!$B:$B,0)),IF(ISERROR(MATCH(F65,Sources!$C:$C,0)),\"\",5*D65+3*E65),IF(AND(NOT(ISERROR(MATCH(A65,Sources!$D:$D,0))),NOT(ISERROR(MATCH(F65,Sources!$E:$E,0)))),5*D65+3*E65,\"\"))&IF(AND(ISERROR(MATCH(A65,Sources!$F:$F,0)),NOT(ISERROR(MATCH(F65,Sources!$G:$G,0)))),5*D65+3*E65,\"\")),\"\")","v":""},110]
["UTOPIA ISLAND",{"$f":"IFERROR(VLOOKUP(A66,Sheet2!$B$2:$C$18,2,0),\"\")","v":"Utopia"},"2018-08-05",2,0,"MAKADI BAY",110,null,{"$f":"IFERROR(VALUE(IF(ISERROR(MATCH(A66,Sources!$B:$B,0)),IF(ISERROR(MATCH(F66,Sources!$C:$C,0)),\"\",5*D66+3*E66),IF(AND(NOT(ISERROR(MATCH(A66,Sources!$D:$D,0))),NOT(ISERROR(MATCH(F66,Sources!$E:$E,0)))),5*D66+3*E66,\"\"))&IF(AND(ISERROR(MATCH(A66,Sources!$F:$F,0)),NOT(ISERROR(MATCH(F66,Sources!$G:$G,0)))),5*D66+3*E66,\"\")),\"\")","v":""},110]
["UTOPIA ISLAND",{"$f":"IFERROR(VLOOKUP(A67,Sheet2!$B$2:$C$18,2,0),\"\")","v":"Utopia"},"2018-08-05",2,0,"MAKADI BAY",110,null,{"$f":"IFERROR(VALUE(IF(ISERROR(MATCH(A67,Sources!$B:$B,0)),IF(ISERROR(MATCH(F67,Sources!$C:$C,0)),\"\",5*D67+3*E67),IF(AND(NOT(ISERROR(MATCH(A67,Sources!$D:$D,0))),NOT(ISERROR(MATCH(F67,Sources!$E:$E,0)))),5*D67+3*E67,\"\"))&IF(AND(ISERROR(MATCH(A67,Sources!$F:$F,0)),NOT(ISERROR(MATCH(F67,Sources!$G:$G,0)))),5*D67+3*E67,\"\")),\"\")","v":""},{"$f":"IF(I67=\"\",G67,(G67-I67))","v":110}]
["UTOPIA ISLAND",{"$f":"IFERROR(VLOOKUP(A68,Sheet2!$B$2:$C$18,2,0),\"\")","v":"Utopia"},"2018-08-05",2,0,"MAKADI BAY",110,null,{"$f":"IFERROR(VALUE(IF(ISERROR(MATCH(A68,Sources!$B:$B,0)),IF(ISERROR(MATCH(F68,Sources!$C:$C,0)),\"\",5*D68+3*E68),IF(AND(NOT(ISERROR(MATCH(A68,Sources!$D:$D,0))),NOT(ISERROR(MATCH(F68,Sources!$E:$E,0)))),5*D68+3*E68,\"\"))&IF(AND(ISERROR(MATCH(A68,Sources!$F:$F,0)),NOT(ISERROR(MATCH(F68,Sources!$G:$G,0)))),5*D68+3*E68,\"\")),\"\")","v":""},110]
["UTOPIA ISLAND",{"$f":"IFERROR(VLOOKUP(A69,Sheet2!$B$2:$C$18,2,0),\"\")","v":"Utopia"},"2018-08-05",4,3,"MAKADI BAY",304,null,{"$f":"IFERROR(VALUE(IF(ISERROR(MATCH(A69,Sources!$B:$B,0)),IF(ISERROR(MATCH(F69,Sources!$C:$C,0)),\"\",5*D69+3*E69),IF(AND(NOT(ISERROR(MATCH(A69,Sources!$D:$D,0))),NOT(ISERROR(MATCH(F69,Sources!$E:$E,0)))),5*D69+3*E69,\"\"))&IF(AND(ISERROR(MATCH(A69,Sources!$F:$F,0)),NOT(ISERROR(MATCH(F69,Sources!$G:$G,0)))),5*D69+3*E69,\"\")),\"\")","v":""},304]
["DOLPHIN WORLD SHOW",{"$f":"IFERROR(VLOOKUP(A70,Sheet2!$B$2:$C$18,2,0),\"\")","v":"Dolphin world show"},"2018-08-05",2,0,"MAKADI BAY",80,null,{"$f":"IFERROR(VALUE(IF(ISERROR(MATCH(A70,Sources!$B:$B,0)),IF(ISERROR(MATCH(F70,Sources!$C:$C,0)),\"\",5*D70+3*E70),IF(AND(NOT(ISERROR(MATCH(A70,Sources!$D:$D,0))),NOT(ISERROR(MATCH(F70,Sources!$E:$E,0)))),5*D70+3*E70,\"\"))&IF(AND(ISERROR(MATCH(A70,Sources!$F:$F,0)),NOT(ISERROR(MATCH(F70,Sources!$G:$G,0)))),5*D70+3*E70,\"\")),\"\")","v":""},80]
["UTOPIA ISLAND",{"$f":"IFERROR(VLOOKUP(A71,Sheet2!$B$2:$C$18,2,0),\"\")","v":"Utopia"},"2018-08-05",1,0,"HURGADA",55,null,{"$f":"IFERROR(VALUE(IF(ISERROR(MATCH(A71,Sources!$B:$B,0)),IF(ISERROR(MATCH(F71,Sources!$C:$C,0)),\"\",5*D71+3*E71),IF(AND(NOT(ISERROR(MATCH(A71,Sources!$D:$D,0))),NOT(ISERROR(MATCH(F71,Sources!$E:$E,0)))),5*D71+3*E71,\"\"))&IF(AND(ISERROR(MATCH(A71,Sources!$F:$F,0)),NOT(ISERROR(MATCH(F71,Sources!$G:$G,0)))),5*D71+3*E71,\"\")),\"\")","v":""},55]
["UTOPIA ISLAND",{"$f":"IFERROR(VLOOKUP(A72,Sheet2!$B$2:$C$18,2,0),\"\")","v":"Utopia"},"2018-08-05",1,1,"HURGADA",83,null,{"$f":"IFERROR(VALUE(IF(ISERROR(MATCH(A72,Sources!$B:$B,0)),IF(ISERROR(MATCH(F72,Sources!$C:$C,0)),\"\",5*D72+3*E72),IF(AND(NOT(ISERROR(MATCH(A72,Sources!$D:$D,0))),NOT(ISERROR(MATCH(F72,Sources!$E:$E,0)))),5*D72+3*E72,\"\"))&IF(AND(ISERROR(MATCH(A72,Sources!$F:$F,0)),NOT(ISERROR(MATCH(F72,Sources!$G:$G,0)))),5*D72+3*E72,\"\")),\"\")","v":""},83]
["UTOPIA ISLAND",{"$f":"IFERROR(VLOOKUP(A73,Sheet2!$B$2:$C$18,2,0),\"\")","v":"Utopia"},"2018-08-05",2,1,"HURGADA",138,null,{"$f":"IFERROR(VALUE(IF(ISERROR(MATCH(A73,Sources!$B:$B,0)),IF(ISERROR(MATCH(F73,Sources!$C:$C,0)),\"\",5*D73+3*E73),IF(AND(NOT(ISERROR(MATCH(A73,Sources!$D:$D,0))),NOT(ISERROR(MATCH(F73,Sources!$E:$E,0)))),5*D73+3*E73,\"\"))&IF(AND(ISERROR(MATCH(A73,Sources!$F:$F,0)),NOT(ISERROR(MATCH(F73,Sources!$G:$G,0)))),5*D73+3*E73,\"\")),\"\")","v":""},138]
["UTOPIA ISLAND",{"$f":"IFERROR(VLOOKUP(A74,Sheet2!$B$2:$C$18,2,0),\"\")","v":"Utopia"},"2018-08-05",2,0,"HURGADA",110,null,{"$f":"IFERROR(VALUE(IF(ISERROR(MATCH(A74,Sources!$B:$B,0)),IF(ISERROR(MATCH(F74,Sources!$C:$C,0)),\"\",5*D74+3*E74),IF(AND(NOT(ISERROR(MATCH(A74,Sources!$D:$D,0))),NOT(ISERROR(MATCH(F74,Sources!$E:$E,0)))),5*D74+3*E74,\"\"))&IF(AND(ISERROR(MATCH(A74,Sources!$F:$F,0)),NOT(ISERROR(MATCH(F74,Sources!$G:$G,0)))),5*D74+3*E74,\"\")),\"\")","v":""},110]
["UTOPIA ISLAND",{"$f":"IFERROR(VLOOKUP(A75,Sheet2!$B$2:$C$18,2,0),\"\")","v":"Utopia"},"2018-08-05",2,0,"HURGADA",110,null,{"$f":"IFERROR(VALUE(IF(ISERROR(MATCH(A75,Sources!$B:$B,0)),IF(ISERROR(MATCH(F75,Sources!$C:$C,0)),\"\",5*D75+3*E75),IF(AND(NOT(ISERROR(MATCH(A75,Sources!$D:$D,0))),NOT(ISERROR(MATCH(F75,Sources!$E:$E,0)))),5*D75+3*E75,\"\"))&IF(AND(ISERROR(MATCH(A75,Sources!$F:$F,0)),NOT(ISERROR(MATCH(F75,Sources!$G:$G,0)))),5*D75+3*E75,\"\")),\"\")","v":""},110]
["RUSALKA  ( MERMAID )",{"$f":"IFERROR(VLOOKUP(A76,Sheet2!$B$2:$C$18,2,0),\"\")","v":"Rusalka (Mermaid)"},"2018-08-06",2,0,"HURGADA",80,null,{"$f":"IFERROR(VALUE(IF(ISERROR(MATCH(A76,Sources!$B:$B,0)),IF(ISERROR(MATCH(F76,Sources!$C:$C,0)),\"\",5*D76+3*E76),IF(AND(NOT(ISERROR(MATCH(A76,Sources!$D:$D,0))),NOT(ISERROR(MATCH(F76,Sources!$E:$E,0)))),5*D76+3*E76,\"\"))&IF(AND(ISERROR(MATCH(A76,Sources!$F:$F,0)),NOT(ISERROR(MATCH(F76,Sources!$G:$G,0)))),5*D76+3*E76,\"\")),\"\")","v":""},80]
["RUSALKA  ( MERMAID )",{"$f":"IFERROR(VLOOKUP(A77,Sheet2!$B$2:$C$18,2,0),\"\")","v":"Rusalka (Mermaid)"},"2018-08-06",2,0,"HURGADA",80,null,{"$f":"IFERROR(VALUE(IF(ISERROR(MATCH(A77,Sources!$B:$B,0)),IF(ISERROR(MATCH(F77,Sources!$C:$C,0)),\"\",5*D77+3*E77),IF(AND(NOT(ISERROR(MATCH(A77,Sources!$D:$D,0))),NOT(ISERROR(MATCH(F77,Sources!$E:$E,0)))),5*D77+3*E77,\"\"))&IF(AND(ISERROR(MATCH(A77,Sources!$F:$F,0)),NOT(ISERROR(MATCH(F77,Sources!$G:$G,0)))),5*D77+3*E77,\"\")),\"\")","v":""},80]
["MOTO2",{"$f":"IFERROR(VLOOKUP(A78,Sheet2!$B$2:$C$18,2,0),\"\")","v":"Moto 2"},"2018-08-06",2,0,"HURGADA",90,null,{"$f":"IFERROR(VALUE(IF(ISERROR(MATCH(A78,Sources!$B:$B,0)),IF(ISERROR(MATCH(F78,Sources!$C:$C,0)),\"\",5*D78+3*E78),IF(AND(NOT(ISERROR(MATCH(A78,Sources!$D:$D,0))),NOT(ISERROR(MATCH(F78,Sources!$E:$E,0)))),5*D78+3*E78,\"\"))&IF(AND(ISERROR(MATCH(A78,Sources!$F:$F,0)),NOT(ISERROR(MATCH(F78,Sources!$G:$G,0)))),5*D78+3*E78,\"\")),\"\")","v":""},90]
["UTOPIA ISLAND",{"$f":"IFERROR(VLOOKUP(A79,Sheet2!$B$2:$C$18,2,0),\"\")","v":"Utopia"},"2018-08-07",2,1,"HURGADA",138,null,{"$f":"IFERROR(VALUE(IF(ISERROR(MATCH(A79,Sources!$B:$B,0)),IF(ISERROR(MATCH(F79,Sources!$C:$C,0)),\"\",5*D79+3*E79),IF(AND(NOT(ISERROR(MATCH(A79,Sources!$D:$D,0))),NOT(ISERROR(MATCH(F79,Sources!$E:$E,0)))),5*D79+3*E79,\"\"))&IF(AND(ISERROR(MATCH(A79,Sources!$F:$F,0)),NOT(ISERROR(MATCH(F79,Sources!$G:$G,0)))),5*D79+3*E79,\"\")),\"\")","v":""},138]
["OVER DAY LUXORQUEEN VALLY",{"$f":"IFERROR(VLOOKUP(A80,Sheet2!$B$2:$C$18,2,0),\"\")","v":"LUXOR 2"},"2018-08-07",2,0,"HURGADA",180,"ukraine",{"$f":"IFERROR(VALUE(IF(ISERROR(MATCH(A80,Sources!$B:$B,0)),IF(ISERROR(MATCH(F80,Sources!$C:$C,0)),\"\",5*D80+3*E80),IF(AND(NOT(ISERROR(MATCH(A80,Sources!$D:$D,0))),NOT(ISERROR(MATCH(F80,Sources!$E:$E,0)))),5*D80+3*E80,\"\"))&IF(AND(ISERROR(MATCH(A80,Sources!$F:$F,0)),NOT(ISERROR(MATCH(F80,Sources!$G:$G,0)))),5*D80+3*E80,\"\")),\"\")","v":""},180]
["UTOPIA ISLAND",{"$f":"IFERROR(VLOOKUP(A81,Sheet2!$B$2:$C$18,2,0),\"\")","v":"Utopia"},"2018-08-07",1,0,"HURGADA",48,null,{"$f":"IFERROR(VALUE(IF(ISERROR(MATCH(A81,Sources!$B:$B,0)),IF(ISERROR(MATCH(F81,Sources!$C:$C,0)),\"\",5*D81+3*E81),IF(AND(NOT(ISERROR(MATCH(A81,Sources!$D:$D,0))),NOT(ISERROR(MATCH(F81,Sources!$E:$E,0)))),5*D81+3*E81,\"\"))&IF(AND(ISERROR(MATCH(A81,Sources!$F:$F,0)),NOT(ISERROR(MATCH(F81,Sources!$G:$G,0)))),5*D81+3*E81,\"\")),\"\")","v":""},48]
["DOLPHIN WORLD SHOW",{"$f":"IFERROR(VLOOKUP(A82,Sheet2!$B$2:$C$18,2,0),\"\")","v":"Dolphin world show"},"2018-08-07",2,1,"MAKADI BAY",100,null,{"$f":"IFERROR(VALUE(IF(ISERROR(MATCH(A82,Sources!$B:$B,0)),IF(ISERROR(MATCH(F82,Sources!$C:$C,0)),\"\",5*D82+3*E82),IF(AND(NOT(ISERROR(MATCH(A82,Sources!$D:$D,0))),NOT(ISERROR(MATCH(F82,Sources!$E:$E,0)))),5*D82+3*E82,\"\"))&IF(AND(ISERROR(MATCH(A82,Sources!$F:$F,0)),NOT(ISERROR(MATCH(F82,Sources!$G:$G,0)))),5*D82+3*E82,\"\")),\"\")","v":""},100]
["CAIRO OVERDAY",{"$f":"IFERROR(VLOOKUP(A83,Sheet2!$B$2:$C$18,2,0),\"\")","v":"Cairo"},"2018-08-07",2,1,"MAKADI BAY",288,null,{"$f":"IFERROR(VALUE(IF(ISERROR(MATCH(A83,Sources!$B:$B,0)),IF(ISERROR(MATCH(F83,Sources!$C:$C,0)),\"\",5*D83+3*E83),IF(AND(NOT(ISERROR(MATCH(A83,Sources!$D:$D,0))),NOT(ISERROR(MATCH(F83,Sources!$E:$E,0)))),5*D83+3*E83,\"\"))&IF(AND(ISERROR(MATCH(A83,Sources!$F:$F,0)),NOT(ISERROR(MATCH(F83,Sources!$G:$G,0)))),5*D83+3*E83,\"\")),\"\")","v":13},275]
["RUSALKA  ( MERMAID )",{"$f":"IFERROR(VLOOKUP(A84,Sheet2!$B$2:$C$18,2,0),\"\")","v":"Rusalka (Mermaid)"},"2018-08-07",2,0,"MAKADI BAY",80,null,{"$f":"IFERROR(VALUE(IF(ISERROR(MATCH(A84,Sources!$B:$B,0)),IF(ISERROR(MATCH(F84,Sources!$C:$C,0)),\"\",5*D84+3*E84),IF(AND(NOT(ISERROR(MATCH(A84,Sources!$D:$D,0))),NOT(ISERROR(MATCH(F84,Sources!$E:$E,0)))),5*D84+3*E84,\"\"))&IF(AND(ISERROR(MATCH(A84,Sources!$F:$F,0)),NOT(ISERROR(MATCH(F84,Sources!$G:$G,0)))),5*D84+3*E84,\"\")),\"\")","v":""},80]
["UTOPIA ISLAND",{"$f":"IFERROR(VLOOKUP(A85,Sheet2!$B$2:$C$18,2,0),\"\")","v":"Utopia"},"2018-08-07",2,0,"MAKADI BAY",110,null,{"$f":"IFERROR(VALUE(IF(ISERROR(MATCH(A85,Sources!$B:$B,0)),IF(ISERROR(MATCH(F85,Sources!$C:$C,0)),\"\",5*D85+3*E85),IF(AND(NOT(ISERROR(MATCH(A85,Sources!$D:$D,0))),NOT(ISERROR(MATCH(F85,Sources!$E:$E,0)))),5*D85+3*E85,\"\"))&IF(AND(ISERROR(MATCH(A85,Sources!$F:$F,0)),NOT(ISERROR(MATCH(F85,Sources!$G:$G,0)))),5*D85+3*E85,\"\")),\"\")","v":""},110]
["UTOPIA ISLAND",{"$f":"IFERROR(VLOOKUP(A86,Sheet2!$B$2:$C$18,2,0),\"\")","v":"Utopia"},"2018-08-07",3,0,"MAKADI BAY",165,null,{"$f":"IFERROR(VALUE(IF(ISERROR(MATCH(A86,Sources!$B:$B,0)),IF(ISERROR(MATCH(F86,Sources!$C:$C,0)),\"\",5*D86+3*E86),IF(AND(NOT(ISERROR(MATCH(A86,Sources!$D:$D,0))),NOT(ISERROR(MATCH(F86,Sources!$E:$E,0)))),5*D86+3*E86,\"\"))&IF(AND(ISERROR(MATCH(A86,Sources!$F:$F,0)),NOT(ISERROR(MATCH(F86,Sources!$G:$G,0)))),5*D86+3*E86,\"\")),\"\")","v":""},165]
["OVER DAY LUXORQUEEN VALLY",{"$f":"IFERROR(VLOOKUP(A87,Sheet2!$B$2:$C$18,2,0),\"\")","v":"LUXOR 2"},"2018-08-07",2,0,"HURGADA",180,"ukraine",{"$f":"IFERROR(VALUE(IF(ISERROR(MATCH(A87,Sources!$B:$B,0)),IF(ISERROR(MATCH(F87,Sources!$C:$C,0)),\"\",5*D87+3*E87),IF(AND(NOT(ISERROR(MATCH(A87,Sources!$D:$D,0))),NOT(ISERROR(MATCH(F87,Sources!$E:$E,0)))),5*D87+3*E87,\"\"))&IF(AND(ISERROR(MATCH(A87,Sources!$F:$F,0)),NOT(ISERROR(MATCH(F87,Sources!$G:$G,0)))),5*D87+3*E87,\"\")),\"\")","v":""},180]
["UTOPIA ISLAND",{"$f":"IFERROR(VLOOKUP(A88,Sheet2!$B$2:$C$18,2,0),\"\")","v":"Utopia"},"2018-08-07",3,0,"HURGADA",165,null,{"$f":"IFERROR(VALUE(IF(ISERROR(MATCH(A88,Sources!$B:$B,0)),IF(ISERROR(MATCH(F88,Sources!$C:$C,0)),\"\",5*D88+3*E88),IF(AND(NOT(ISERROR(MATCH(A88,Sources!$D:$D,0))),NOT(ISERROR(MATCH(F88,Sources!$E:$E,0)))),5*D88+3*E88,\"\"))&IF(AND(ISERROR(MATCH(A88,Sources!$F:$F,0)),NOT(ISERROR(MATCH(F88,Sources!$G:$G,0)))),5*D88+3*E88,\"\")),\"\")","v":""},165]
["UTOPIA ISLAND",{"$f":"IFERROR(VLOOKUP(A89,Sheet2!$B$2:$C$18,2,0),\"\")","v":"Utopia"},"2018-08-07",2,0,"HURGADA",110,null,{"$f":"IFERROR(VALUE(IF(ISERROR(MATCH(A89,Sources!$B:$B,0)),IF(ISERROR(MATCH(F89,Sources!$C:$C,0)),\"\",5*D89+3*E89),IF(AND(NOT(ISERROR(MATCH(A89,Sources!$D:$D,0))),NOT(ISERROR(MATCH(F89,Sources!$E:$E,0)))),5*D89+3*E89,\"\"))&IF(AND(ISERROR(MATCH(A89,Sources!$F:$F,0)),NOT(ISERROR(MATCH(F89,Sources!$G:$G,0)))),5*D89+3*E89,\"\")),\"\")","v":""},110]
["UTOPIA ISLAND",{"$f":"IFERROR(VLOOKUP(A90,Sheet2!$B$2:$C$18,2,0),\"\")","v":"Utopia"},"2018-08-07",2,0,"HURGADA",110,null,{"$f":"IFERROR(VALUE(IF(ISERROR(MATCH(A90,Sources!$B:$B,0)),IF(ISERROR(MATCH(F90,Sources!$C:$C,0)),\"\",5*D90+3*E90),IF(AND(NOT(ISERROR(MATCH(A90,Sources!$D:$D,0))),NOT(ISERROR(MATCH(F90,Sources!$E:$E,0)))),5*D90+3*E90,\"\"))&IF(AND(ISERROR(MATCH(A90,Sources!$F:$F,0)),NOT(ISERROR(MATCH(F90,Sources!$G:$G,0)))),5*D90+3*E90,\"\")),\"\")","v":""},110]
["UTOPIA ISLAND",{"$f":"IFERROR(VLOOKUP(A91,Sheet2!$B$2:$C$18,2,0),\"\")","v":"Utopia"},"2018-08-07",2,0,"HURGADA",110,null,{"$f":"IFERROR(VALUE(IF(ISERROR(MATCH(A91,Sources!$B:$B,0)),IF(ISERROR(MATCH(F91,Sources!$C:$C,0)),\"\",5*D91+3*E91),IF(AND(NOT(ISERROR(MATCH(A91,Sources!$D:$D,0))),NOT(ISERROR(MATCH(F91,Sources!$E:$E,0)))),5*D91+3*E91,\"\"))&IF(AND(ISERROR(MATCH(A91,Sources!$F:$F,0)),NOT(ISERROR(MATCH(F91,Sources!$G:$G,0)))),5*D91+3*E91,\"\")),\"\")","v":""},110]
["GRAND AQUARIUM",{"$f":"IFERROR(VLOOKUP(A92,Sheet2!$B$2:$C$18,2,0),\"\")","v":"Grand Aquarium"},"2018-08-07",2,0,"MAKADI BAY",90,null,{"$f":"IFERROR(VALUE(IF(ISERROR(MATCH(A92,Sources!$B:$B,0)),IF(ISERROR(MATCH(F92,Sources!$C:$C,0)),\"\",5*D92+3*E92),IF(AND(NOT(ISERROR(MATCH(A92,Sources!$D:$D,0))),NOT(ISERROR(MATCH(F92,Sources!$E:$E,0)))),5*D92+3*E92,\"\"))&IF(AND(ISERROR(MATCH(A92,Sources!$F:$F,0)),NOT(ISERROR(MATCH(F92,Sources!$G:$G,0)))),5*D92+3*E92,\"\")),\"\")","v":10},80]
["OVER DAY LUXORQUEEN VALLY",{"$f":"IFERROR(VLOOKUP(A93,Sheet2!$B$2:$C$18,2,0),\"\")","v":"LUXOR 2"},"2018-08-07",2,0,"MAKADI BAY",180,null,{"$f":"IFERROR(VALUE(IF(ISERROR(MATCH(A93,Sources!$B:$B,0)),IF(ISERROR(MATCH(F93,Sources!$C:$C,0)),\"\",5*D93+3*E93),IF(AND(NOT(ISERROR(MATCH(A93,Sources!$D:$D,0))),NOT(ISERROR(MATCH(F93,Sources!$E:$E,0)))),5*D93+3*E93,\"\"))&IF(AND(ISERROR(MATCH(A93,Sources!$F:$F,0)),NOT(ISERROR(MATCH(F93,Sources!$G:$G,0)))),5*D93+3*E93,\"\")),\"\")","v":""},180]
["GRAND AQUARIUM",{"$f":"IFERROR(VLOOKUP(A94,Sheet2!$B$2:$C$18,2,0),\"\")","v":"Grand Aquarium"},"2018-08-07",2,1,"SAHL HASHEESH",100,null,{"$f":"IFERROR(VALUE(IF(ISERROR(MATCH(A94,Sources!$B:$B,0)),IF(ISERROR(MATCH(F94,Sources!$C:$C,0)),\"\",5*D94+3*E94),IF(AND(NOT(ISERROR(MATCH(A94,Sources!$D:$D,0))),NOT(ISERROR(MATCH(F94,Sources!$E:$E,0)))),5*D94+3*E94,\"\"))&IF(AND(ISERROR(MATCH(A94,Sources!$F:$F,0)),NOT(ISERROR(MATCH(F94,Sources!$G:$G,0)))),5*D94+3*E94,\"\")),\"\")","v":""},100]
["GRAND AQUARIUM",{"$f":"IFERROR(VLOOKUP(A95,Sheet2!$B$2:$C$18,2,0),\"\")","v":"Grand Aquarium"},"2018-08-07",2,0,"HURGADA",80,null,{"$f":"IFERROR(VALUE(IF(ISERROR(MATCH(A95,Sources!$B:$B,0)),IF(ISERROR(MATCH(F95,Sources!$C:$C,0)),\"\",5*D95+3*E95),IF(AND(NOT(ISERROR(MATCH(A95,Sources!$D:$D,0))),NOT(ISERROR(MATCH(F95,Sources!$E:$E,0)))),5*D95+3*E95,\"\"))&IF(AND(ISERROR(MATCH(A95,Sources!$F:$F,0)),NOT(ISERROR(MATCH(F95,Sources!$G:$G,0)))),5*D95+3*E95,\"\")),\"\")","v":""},80]
["UTOPIA ISLAND",{"$f":"IFERROR(VLOOKUP(A96,Sheet2!$B$2:$C$18,2,0),\"\")","v":"Utopia"},"2018-08-07",1,1,"HURGADA",83,null,{"$f":"IFERROR(VALUE(IF(ISERROR(MATCH(A96,Sources!$B:$B,0)),IF(ISERROR(MATCH(F96,Sources!$C:$C,0)),\"\",5*D96+3*E96),IF(AND(NOT(ISERROR(MATCH(A96,Sources!$D:$D,0))),NOT(ISERROR(MATCH(F96,Sources!$E:$E,0)))),5*D96+3*E96,\"\"))&IF(AND(ISERROR(MATCH(A96,Sources!$F:$F,0)),NOT(ISERROR(MATCH(F96,Sources!$G:$G,0)))),5*D96+3*E96,\"\")),\"\")","v":""},83]
["UTOPIA ISLAND",{"$f":"IFERROR(VLOOKUP(A97,Sheet2!$B$2:$C$18,2,0),\"\")","v":"Utopia"},"2018-08-07",2,0,"HURGADA",110,null,{"$f":"IFERROR(VALUE(IF(ISERROR(MATCH(A97,Sources!$B:$B,0)),IF(ISERROR(MATCH(F97,Sources!$C:$C,0)),\"\",5*D97+3*E97),IF(AND(NOT(ISERROR(MATCH(A97,Sources!$D:$D,0))),NOT(ISERROR(MATCH(F97,Sources!$E:$E,0)))),5*D97+3*E97,\"\"))&IF(AND(ISERROR(MATCH(A97,Sources!$F:$F,0)),NOT(ISERROR(MATCH(F97,Sources!$G:$G,0)))),5*D97+3*E97,\"\")),\"\")","v":""},110]
["UTOPIA ISLAND",{"$f":"IFERROR(VLOOKUP(A98,Sheet2!$B$2:$C$18,2,0),\"\")","v":"Utopia"},"2018-08-07",2,0,"HURGADA",110,null,{"$f":"IFERROR(VALUE(IF(ISERROR(MATCH(A98,Sources!$B:$B,0)),IF(ISERROR(MATCH(F98,Sources!$C:$C,0)),\"\",5*D98+3*E98),IF(AND(NOT(ISERROR(MATCH(A98,Sources!$D:$D,0))),NOT(ISERROR(MATCH(F98,Sources!$E:$E,0)))),5*D98+3*E98,\"\"))&IF(AND(ISERROR(MATCH(A98,Sources!$F:$F,0)),NOT(ISERROR(MATCH(F98,Sources!$G:$G,0)))),5*D98+3*E98,\"\")),\"\")","v":""},110]
["UTOPIA ISLAND",{"$f":"IFERROR(VLOOKUP(A99,Sheet2!$B$2:$C$18,2,0),\"\")","v":"Utopia"},"2018-08-07",1,0,"HURGADA",55,null,{"$f":"IFERROR(VALUE(IF(ISERROR(MATCH(A99,Sources!$B:$B,0)),IF(ISERROR(MATCH(F99,Sources!$C:$C,0)),\"\",5*D99+3*E99),IF(AND(NOT(ISERROR(MATCH(A99,Sources!$D:$D,0))),NOT(ISERROR(MATCH(F99,Sources!$E:$E,0)))),5*D99+3*E99,\"\"))&IF(AND(ISERROR(MATCH(A99,Sources!$F:$F,0)),NOT(ISERROR(MATCH(F99,Sources!$G:$G,0)))),5*D99+3*E99,\"\")),\"\")","v":""},55]
["CAIRO OVERDAY",{"$f":"IFERROR(VLOOKUP(A100,Sheet2!$B$2:$C$18,2,0),\"\")","v":"Cairo"},"2018-08-07",2,0,"HURGADA",220,null,{"$f":"IFERROR(VALUE(IF(ISERROR(MATCH(A100,Sources!$B:$B,0)),IF(ISERROR(MATCH(F100,Sources!$C:$C,0)),\"\",5*D100+3*E100),IF(AND(NOT(ISERROR(MATCH(A100,Sources!$D:$D,0))),NOT(ISERROR(MATCH(F100,Sources!$E:$E,0)))),5*D100+3*E100,\"\"))&IF(AND(ISERROR(MATCH(A100,Sources!$F:$F,0)),NOT(ISERROR(MATCH(F100,Sources!$G:$G,0)))),5*D100+3*E100,\"\")),\"\")","v":""},220]
["GRAND AQUARIUM",{"$f":"IFERROR(VLOOKUP(A101,Sheet2!$B$2:$C$18,2,0),\"\")","v":"Grand Aquarium"},"2018-08-07",2,0,"HURGADA",80,null,{"$f":"IFERROR(VALUE(IF(ISERROR(MATCH(A101,Sources!$B:$B,0)),IF(ISERROR(MATCH(F101,Sources!$C:$C,0)),\"\",5*D101+3*E101),IF(AND(NOT(ISERROR(MATCH(A101,Sources!$D:$D,0))),NOT(ISERROR(MATCH(F101,Sources!$E:$E,0)))),5*D101+3*E101,\"\"))&IF(AND(ISERROR(MATCH(A101,Sources!$F:$F,0)),NOT(ISERROR(MATCH(F101,Sources!$G:$G,0)))),5*D101+3*E101,\"\")),\"\")","v":""},80]
["OVER DAY LUXORQUEEN VALLY",{"$f":"IFERROR(VLOOKUP(A102,Sheet2!$B$2:$C$18,2,0),\"\")","v":"LUXOR 2"},"2018-08-07",2,0,"HURGADA",180,null,{"$f":"IFERROR(VALUE(IF(ISERROR(MATCH(A102,Sources!$B:$B,0)),IF(ISERROR(MATCH(F102,Sources!$C:$C,0)),\"\",5*D102+3*E102),IF(AND(NOT(ISERROR(MATCH(A102,Sources!$D:$D,0))),NOT(ISERROR(MATCH(F102,Sources!$E:$E,0)))),5*D102+3*E102,\"\"))&IF(AND(ISERROR(MATCH(A102,Sources!$F:$F,0)),NOT(ISERROR(MATCH(F102,Sources!$G:$G,0)))),5*D102+3*E102,\"\")),\"\")","v":""},180]
["UTOPIA ISLAND",{"$f":"IFERROR(VLOOKUP(A103,Sheet2!$B$2:$C$18,2,0),\"\")","v":"Utopia"},"2018-08-07",1,1,"MAKADI BAY",72,null,{"$f":"IFERROR(VALUE(IF(ISERROR(MATCH(A103,Sources!$B:$B,0)),IF(ISERROR(MATCH(F103,Sources!$C:$C,0)),\"\",5*D103+3*E103),IF(AND(NOT(ISERROR(MATCH(A103,Sources!$D:$D,0))),NOT(ISERROR(MATCH(F103,Sources!$E:$E,0)))),5*D103+3*E103,\"\"))&IF(AND(ISERROR(MATCH(A103,Sources!$F:$F,0)),NOT(ISERROR(MATCH(F103,Sources!$G:$G,0)))),5*D103+3*E103,\"\")),\"\")","v":""},72]
["CAIRO OVERDAY",{"$f":"IFERROR(VLOOKUP(A104,Sheet2!$B$2:$C$18,2,0),\"\")","v":"Cairo"},"2018-08-07",2,0,"MAKADI BAY",230,null,{"$f":"IFERROR(VALUE(IF(ISERROR(MATCH(A104,Sources!$B:$B,0)),IF(ISERROR(MATCH(F104,Sources!$C:$C,0)),\"\",5*D104+3*E104),IF(AND(NOT(ISERROR(MATCH(A104,Sources!$D:$D,0))),NOT(ISERROR(MATCH(F104,Sources!$E:$E,0)))),5*D104+3*E104,\"\"))&IF(AND(ISERROR(MATCH(A104,Sources!$F:$F,0)),NOT(ISERROR(MATCH(F104,Sources!$G:$G,0)))),5*D104+3*E104,\"\")),\"\")","v":10},220]
["OVER DAY LUXORQUEEN VALLY",{"$f":"IFERROR(VLOOKUP(A105,Sheet2!$B$2:$C$18,2,0),\"\")","v":"LUXOR 2"},"2018-08-07",1,0,"HURGADA",90,null,{"$f":"IFERROR(VALUE(IF(ISERROR(MATCH(A105,Sources!$B:$B,0)),IF(ISERROR(MATCH(F105,Sources!$C:$C,0)),\"\",5*D105+3*E105),IF(AND(NOT(ISERROR(MATCH(A105,Sources!$D:$D,0))),NOT(ISERROR(MATCH(F105,Sources!$E:$E,0)))),5*D105+3*E105,\"\"))&IF(AND(ISERROR(MATCH(A105,Sources!$F:$F,0)),NOT(ISERROR(MATCH(F105,Sources!$G:$G,0)))),5*D105+3*E105,\"\")),\"\")","v":""},90]
["UTOPIA ISLAND",{"$f":"IFERROR(VLOOKUP(A106,Sheet2!$B$2:$C$18,2,0),\"\")","v":"Utopia"},"2018-08-07",2,1,"HURGADA",138,null,{"$f":"IFERROR(VALUE(IF(ISERROR(MATCH(A106,Sources!$B:$B,0)),IF(ISERROR(MATCH(F106,Sources!$C:$C,0)),\"\",5*D106+3*E106),IF(AND(NOT(ISERROR(MATCH(A106,Sources!$D:$D,0))),NOT(ISERROR(MATCH(F106,Sources!$E:$E,0)))),5*D106+3*E106,\"\"))&IF(AND(ISERROR(MATCH(A106,Sources!$F:$F,0)),NOT(ISERROR(MATCH(F106,Sources!$G:$G,0)))),5*D106+3*E106,\"\")),\"\")","v":""},138]
["CAIRO OVERDAY",{"$f":"IFERROR(VLOOKUP(A107,Sheet2!$B$2:$C$18,2,0),\"\")","v":"Cairo"},"2018-08-07",1,1,"MAKADI BAY",175,null,{"$f":"IFERROR(VALUE(IF(ISERROR(MATCH(A107,Sources!$B:$B,0)),IF(ISERROR(MATCH(F107,Sources!$C:$C,0)),\"\",5*D107+3*E107),IF(AND(NOT(ISERROR(MATCH(A107,Sources!$D:$D,0))),NOT(ISERROR(MATCH(F107,Sources!$E:$E,0)))),5*D107+3*E107,\"\"))&IF(AND(ISERROR(MATCH(A107,Sources!$F:$F,0)),NOT(ISERROR(MATCH(F107,Sources!$G:$G,0)))),5*D107+3*E107,\"\")),\"\")","v":8},167]
["OVER DAY LUXORQUEEN VALLY",{"$f":"IFERROR(VLOOKUP(A108,Sheet2!$B$2:$C$18,2,0),\"\")","v":"LUXOR 2"},"2018-08-07",2,0,"HURGADA",180,null,{"$f":"IFERROR(VALUE(IF(ISERROR(MATCH(A108,Sources!$B:$B,0)),IF(ISERROR(MATCH(F108,Sources!$C:$C,0)),\"\",5*D108+3*E108),IF(AND(NOT(ISERROR(MATCH(A108,Sources!$D:$D,0))),NOT(ISERROR(MATCH(F108,Sources!$E:$E,0)))),5*D108+3*E108,\"\"))&IF(AND(ISERROR(MATCH(A108,Sources!$F:$F,0)),NOT(ISERROR(MATCH(F108,Sources!$G:$G,0)))),5*D108+3*E108,\"\")),\"\")","v":""},180]
["RUSALKA  ( MERMAID )",{"$f":"IFERROR(VLOOKUP(A109,Sheet2!$B$2:$C$18,2,0),\"\")","v":"Rusalka (Mermaid)"},"2018-08-07",2,0,"MAKADI BAY",80,null,{"$f":"IFERROR(VALUE(IF(ISERROR(MATCH(A109,Sources!$B:$B,0)),IF(ISERROR(MATCH(F109,Sources!$C:$C,0)),\"\",5*D109+3*E109),IF(AND(NOT(ISERROR(MATCH(A109,Sources!$D:$D,0))),NOT(ISERROR(MATCH(F109,Sources!$E:$E,0)))),5*D109+3*E109,\"\"))&IF(AND(ISERROR(MATCH(A109,Sources!$F:$F,0)),NOT(ISERROR(MATCH(F109,Sources!$G:$G,0)))),5*D109+3*E109,\"\")),\"\")","v":""},80]
["MOTO2",{"$f":"IFERROR(VLOOKUP(A110,Sheet2!$B$2:$C$18,2,0),\"\")","v":"Moto 2"},"2018-08-08",2,0,"MAKADI BAY",100,null,{"$f":"IFERROR(VALUE(IF(ISERROR(MATCH(A110,Sources!$B:$B,0)),IF(ISERROR(MATCH(F110,Sources!$C:$C,0)),\"\",5*D110+3*E110),IF(AND(NOT(ISERROR(MATCH(A110,Sources!$D:$D,0))),NOT(ISERROR(MATCH(F110,Sources!$E:$E,0)))),5*D110+3*E110,\"\"))&IF(AND(ISERROR(MATCH(A110,Sources!$F:$F,0)),NOT(ISERROR(MATCH(F110,Sources!$G:$G,0)))),5*D110+3*E110,\"\")),\"\")","v":10},90]
["MOTO2",{"$f":"IFERROR(VLOOKUP(A111,Sheet2!$B$2:$C$18,2,0),\"\")","v":"Moto 2"},"2018-08-08",2,0,"MAKADI BAY",100,null,{"$f":"IFERROR(VALUE(IF(ISERROR(MATCH(A111,Sources!$B:$B,0)),IF(ISERROR(MATCH(F111,Sources!$C:$C,0)),\"\",5*D111+3*E111),IF(AND(NOT(ISERROR(MATCH(A111,Sources!$D:$D,0))),NOT(ISERROR(MATCH(F111,Sources!$E:$E,0)))),5*D111+3*E111,\"\"))&IF(AND(ISERROR(MATCH(A111,Sources!$F:$F,0)),NOT(ISERROR(MATCH(F111,Sources!$G:$G,0)))),5*D111+3*E111,\"\")),\"\")","v":10},90]
["MOTO2",{"$f":"IFERROR(VLOOKUP(A112,Sheet2!$B$2:$C$18,2,0),\"\")","v":"Moto 2"},"2018-08-08",2,0,"MAKADI BAY",100,null,{"$f":"IFERROR(VALUE(IF(ISERROR(MATCH(A112,Sources!$B:$B,0)),IF(ISERROR(MATCH(F112,Sources!$C:$C,0)),\"\",5*D112+3*E112),IF(AND(NOT(ISERROR(MATCH(A112,Sources!$D:$D,0))),NOT(ISERROR(MATCH(F112,Sources!$E:$E,0)))),5*D112+3*E112,\"\"))&IF(AND(ISERROR(MATCH(A112,Sources!$F:$F,0)),NOT(ISERROR(MATCH(F112,Sources!$G:$G,0)))),5*D112+3*E112,\"\")),\"\")","v":10},90]
["INTRO DIVING",{"$f":"IFERROR(VLOOKUP(A113,Sheet2!$B$2:$C$18,2,0),\"\")","v":"Diving"},"2018-08-08",1,0,"MAKADI BAY",70,null,{"$f":"IFERROR(VALUE(IF(ISERROR(MATCH(A113,Sources!$B:$B,0)),IF(ISERROR(MATCH(F113,Sources!$C:$C,0)),\"\",5*D113+3*E113),IF(AND(NOT(ISERROR(MATCH(A113,Sources!$D:$D,0))),NOT(ISERROR(MATCH(F113,Sources!$E:$E,0)))),5*D113+3*E113,\"\"))&IF(AND(ISERROR(MATCH(A113,Sources!$F:$F,0)),NOT(ISERROR(MATCH(F113,Sources!$G:$G,0)))),5*D113+3*E113,\"\")),\"\")","v":5},65]
["MOTO2",{"$f":"IFERROR(VLOOKUP(A114,Sheet2!$B$2:$C$18,2,0),\"\")","v":"Moto 2"},"2018-08-08",2,0,"HURGADA",90,null,{"$f":"IFERROR(VALUE(IF(ISERROR(MATCH(A114,Sources!$B:$B,0)),IF(ISERROR(MATCH(F114,Sources!$C:$C,0)),\"\",5*D114+3*E114),IF(AND(NOT(ISERROR(MATCH(A114,Sources!$D:$D,0))),NOT(ISERROR(MATCH(F114,Sources!$E:$E,0)))),5*D114+3*E114,\"\"))&IF(AND(ISERROR(MATCH(A114,Sources!$F:$F,0)),NOT(ISERROR(MATCH(F114,Sources!$G:$G,0)))),5*D114+3*E114,\"\")),\"\")","v":""},90]
["MOTO2",{"$f":"IFERROR(VLOOKUP(A115,Sheet2!$B$2:$C$18,2,0),\"\")","v":"Moto 2"},"2018-08-08",2,0,"HURGADA",90,null,{"$f":"IFERROR(VALUE(IF(ISERROR(MATCH(A115,Sources!$B:$B,0)),IF(ISERROR(MATCH(F115,Sources!$C:$C,0)),\"\",5*D115+3*E115),IF(AND(NOT(ISERROR(MATCH(A115,Sources!$D:$D,0))),NOT(ISERROR(MATCH(F115,Sources!$E:$E,0)))),5*D115+3*E115,\"\"))&IF(AND(ISERROR(MATCH(A115,Sources!$F:$F,0)),NOT(ISERROR(MATCH(F115,Sources!$G:$G,0)))),5*D115+3*E115,\"\")),\"\")","v":""},90]
["INTRO DIVING",{"$f":"IFERROR(VLOOKUP(A116,Sheet2!$B$2:$C$18,2,0),\"\")","v":"Diving"},"2018-08-08",1,0,"MAKADI BAY",70,null,{"$f":"IFERROR(VALUE(IF(ISERROR(MATCH(A116,Sources!$B:$B,0)),IF(ISERROR(MATCH(F116,Sources!$C:$C,0)),\"\",5*D116+3*E116),IF(AND(NOT(ISERROR(MATCH(A116,Sources!$D:$D,0))),NOT(ISERROR(MATCH(F116,Sources!$E:$E,0)))),5*D116+3*E116,\"\"))&IF(AND(ISERROR(MATCH(A116,Sources!$F:$F,0)),NOT(ISERROR(MATCH(F116,Sources!$G:$G,0)))),5*D116+3*E116,\"\")),\"\")","v":5},65]
["INTRO DIVING",{"$f":"IFERROR(VLOOKUP(A117,Sheet2!$B$2:$C$18,2,0),\"\")","v":"Diving"},"2018-08-08",2,0,"HURGADA",130,null,{"$f":"IFERROR(VALUE(IF(ISERROR(MATCH(A117,Sources!$B:$B,0)),IF(ISERROR(MATCH(F117,Sources!$C:$C,0)),\"\",5*D117+3*E117),IF(AND(NOT(ISERROR(MATCH(A117,Sources!$D:$D,0))),NOT(ISERROR(MATCH(F117,Sources!$E:$E,0)))),5*D117+3*E117,\"\"))&IF(AND(ISERROR(MATCH(A117,Sources!$F:$F,0)),NOT(ISERROR(MATCH(F117,Sources!$G:$G,0)))),5*D117+3*E117,\"\")),\"\")","v":""},130]
["MOTO2",{"$f":"IFERROR(VLOOKUP(A118,Sheet2!$B$2:$C$18,2,0),\"\")","v":"Moto 2"},"2018-08-08",1,0,"HURGADA",45,null,{"$f":"IFERROR(VALUE(IF(ISERROR(MATCH(A118,Sources!$B:$B,0)),IF(ISERROR(MATCH(F118,Sources!$C:$C,0)),\"\",5*D118+3*E118),IF(AND(NOT(ISERROR(MATCH(A118,Sources!$D:$D,0))),NOT(ISERROR(MATCH(F118,Sources!$E:$E,0)))),5*D118+3*E118,\"\"))&IF(AND(ISERROR(MATCH(A118,Sources!$F:$F,0)),NOT(ISERROR(MATCH(F118,Sources!$G:$G,0)))),5*D118+3*E118,\"\")),\"\")","v":""},45]
["MOTO2",{"$f":"IFERROR(VLOOKUP(A119,Sheet2!$B$2:$C$18,2,0),\"\")","v":"Moto 2"},"2018-08-08",2,0,"MAKADI BAY",100,null,{"$f":"IFERROR(VALUE(IF(ISERROR(MATCH(A119,Sources!$B:$B,0)),IF(ISERROR(MATCH(F119,Sources!$C:$C,0)),\"\",5*D119+3*E119),IF(AND(NOT(ISERROR(MATCH(A119,Sources!$D:$D,0))),NOT(ISERROR(MATCH(F119,Sources!$E:$E,0)))),5*D119+3*E119,\"\"))&IF(AND(ISERROR(MATCH(A119,Sources!$F:$F,0)),NOT(ISERROR(MATCH(F119,Sources!$G:$G,0)))),5*D119+3*E119,\"\")),\"\")","v":10},90]
["ASPENDOS TURKISH BATH","Aspendos Turkish Bath","2018-08-08",1,0,"MAKADI BAY",40,null,{"$f":"IFERROR(VALUE(IF(ISERROR(MATCH(A120,Sources!$B:$B,0)),IF(ISERROR(MATCH(F120,Sources!$C:$C,0)),\"\",5*D120+3*E120),IF(AND(NOT(ISERROR(MATCH(A120,Sources!$D:$D,0))),NOT(ISERROR(MATCH(F120,Sources!$E:$E,0)))),5*D120+3*E120,\"\"))&IF(AND(ISERROR(MATCH(A120,Sources!$F:$F,0)),NOT(ISERROR(MATCH(F120,Sources!$G:$G,0)))),5*D120+3*E120,\"\")),\"\")","v":5},35]
["UTOPIA ISLAND",{"$f":"IFERROR(VLOOKUP(A121,Sheet2!$B$2:$C$18,2,0),\"\")","v":"Utopia"},"2018-08-09",2,0,"MAKADI BAY",110,null,{"$f":"IFERROR(VALUE(IF(ISERROR(MATCH(A121,Sources!$B:$B,0)),IF(ISERROR(MATCH(F121,Sources!$C:$C,0)),\"\",5*D121+3*E121),IF(AND(NOT(ISERROR(MATCH(A121,Sources!$D:$D,0))),NOT(ISERROR(MATCH(F121,Sources!$E:$E,0)))),5*D121+3*E121,\"\"))&IF(AND(ISERROR(MATCH(A121,Sources!$F:$F,0)),NOT(ISERROR(MATCH(F121,Sources!$G:$G,0)))),5*D121+3*E121,\"\")),\"\")","v":""},110]
["UTOPIA ISLAND",{"$f":"IFERROR(VLOOKUP(A122,Sheet2!$B$2:$C$18,2,0),\"\")","v":"Utopia"},"2018-08-09",2,0,"MAKADI BAY",110,null,{"$f":"IFERROR(VALUE(IF(ISERROR(MATCH(A122,Sources!$B:$B,0)),IF(ISERROR(MATCH(F122,Sources!$C:$C,0)),\"\",5*D122+3*E122),IF(AND(NOT(ISERROR(MATCH(A122,Sources!$D:$D,0))),NOT(ISERROR(MATCH(F122,Sources!$E:$E,0)))),5*D122+3*E122,\"\"))&IF(AND(ISERROR(MATCH(A122,Sources!$F:$F,0)),NOT(ISERROR(MATCH(F122,Sources!$G:$G,0)))),5*D122+3*E122,\"\")),\"\")","v":""},110]
["UTOPIA ISLAND",{"$f":"IFERROR(VLOOKUP(A123,Sheet2!$B$2:$C$18,2,0),\"\")","v":"Utopia"},"2018-08-09",4,0,"HURGADA",220,null,{"$f":"IFERROR(VALUE(IF(ISERROR(MATCH(A123,Sources!$B:$B,0)),IF(ISERROR(MATCH(F123,Sources!$C:$C,0)),\"\",5*D123+3*E123),IF(AND(NOT(ISERROR(MATCH(A123,Sources!$D:$D,0))),NOT(ISERROR(MATCH(F123,Sources!$E:$E,0)))),5*D123+3*E123,\"\"))&IF(AND(ISERROR(MATCH(A123,Sources!$F:$F,0)),NOT(ISERROR(MATCH(F123,Sources!$G:$G,0)))),5*D123+3*E123,\"\")),\"\")","v":""},220]
["UTOPIA ISLAND",{"$f":"IFERROR(VLOOKUP(A124,Sheet2!$B$2:$C$18,2,0),\"\")","v":"Utopia"},"2018-08-09",2,0,"HURGADA",110,null,{"$f":"IFERROR(VALUE(IF(ISERROR(MATCH(A124,Sources!$B:$B,0)),IF(ISERROR(MATCH(F124,Sources!$C:$C,0)),\"\",5*D124+3*E124),IF(AND(NOT(ISERROR(MATCH(A124,Sources!$D:$D,0))),NOT(ISERROR(MATCH(F124,Sources!$E:$E,0)))),5*D124+3*E124,\"\"))&IF(AND(ISERROR(MATCH(A124,Sources!$F:$F,0)),NOT(ISERROR(MATCH(F124,Sources!$G:$G,0)))),5*D124+3*E124,\"\")),\"\")","v":""},110]
["UTOPIA ISLAND",{"$f":"IFERROR(VLOOKUP(A125,Sheet2!$B$2:$C$18,2,0),\"\")","v":"Utopia"},"2018-08-09",2,0,"HURGADA",110,null,{"$f":"IFERROR(VALUE(IF(ISERROR(MATCH(A125,Sources!$B:$B,0)),IF(ISERROR(MATCH(F125,Sources!$C:$C,0)),\"\",5*D125+3*E125),IF(AND(NOT(ISERROR(MATCH(A125,Sources!$D:$D,0))),NOT(ISERROR(MATCH(F125,Sources!$E:$E,0)))),5*D125+3*E125,\"\"))&IF(AND(ISERROR(MATCH(A125,Sources!$F:$F,0)),NOT(ISERROR(MATCH(F125,Sources!$G:$G,0)))),5*D125+3*E125,\"\")),\"\")","v":""},110]
["UTOPIA ISLAND",{"$f":"IFERROR(VLOOKUP(A126,Sheet2!$B$2:$C$18,2,0),\"\")","v":"Utopia"},"2018-08-09",2,0,"HURGADA",110,null,{"$f":"IFERROR(VALUE(IF(ISERROR(MATCH(A126,Sources!$B:$B,0)),IF(ISERROR(MATCH(F126,Sources!$C:$C,0)),\"\",5*D126+3*E126),IF(AND(NOT(ISERROR(MATCH(A126,Sources!$D:$D,0))),NOT(ISERROR(MATCH(F126,Sources!$E:$E,0)))),5*D126+3*E126,\"\"))&IF(AND(ISERROR(MATCH(A126,Sources!$F:$F,0)),NOT(ISERROR(MATCH(F126,Sources!$G:$G,0)))),5*D126+3*E126,\"\")),\"\")","v":""},110]
["UTOPIA ISLAND",{"$f":"IFERROR(VLOOKUP(A127,Sheet2!$B$2:$C$18,2,0),\"\")","v":"Utopia"},"2018-08-09",2,0,"HURGADA",110,null,{"$f":"IFERROR(VALUE(IF(ISERROR(MATCH(A127,Sources!$B:$B,0)),IF(ISERROR(MATCH(F127,Sources!$C:$C,0)),\"\",5*D127+3*E127),IF(AND(NOT(ISERROR(MATCH(A127,Sources!$D:$D,0))),NOT(ISERROR(MATCH(F127,Sources!$E:$E,0)))),5*D127+3*E127,\"\"))&IF(AND(ISERROR(MATCH(A127,Sources!$F:$F,0)),NOT(ISERROR(MATCH(F127,Sources!$G:$G,0)))),5*D127+3*E127,\"\")),\"\")","v":""},110]
["UTOPIA ISLAND",{"$f":"IFERROR(VLOOKUP(A128,Sheet2!$B$2:$C$18,2,0),\"\")","v":"Utopia"},"2018-08-09",2,0,"HURGADA",110,null,{"$f":"IFERROR(VALUE(IF(ISERROR(MATCH(A128,Sources!$B:$B,0)),IF(ISERROR(MATCH(F128,Sources!$C:$C,0)),\"\",5*D128+3*E128),IF(AND(NOT(ISERROR(MATCH(A128,Sources!$D:$D,0))),NOT(ISERROR(MATCH(F128,Sources!$E:$E,0)))),5*D128+3*E128,\"\"))&IF(AND(ISERROR(MATCH(A128,Sources!$F:$F,0)),NOT(ISERROR(MATCH(F128,Sources!$G:$G,0)))),5*D128+3*E128,\"\")),\"\")","v":""},110]
["UTOPIA ISLAND",{"$f":"IFERROR(VLOOKUP(A129,Sheet2!$B$2:$C$18,2,0),\"\")","v":"Utopia"},"2018-08-09",2,0,"MAKADI BAY",110,null,{"$f":"IFERROR(VALUE(IF(ISERROR(MATCH(A129,Sources!$B:$B,0)),IF(ISERROR(MATCH(F129,Sources!$C:$C,0)),\"\",5*D129+3*E129),IF(AND(NOT(ISERROR(MATCH(A129,Sources!$D:$D,0))),NOT(ISERROR(MATCH(F129,Sources!$E:$E,0)))),5*D129+3*E129,\"\"))&IF(AND(ISERROR(MATCH(A129,Sources!$F:$F,0)),NOT(ISERROR(MATCH(F129,Sources!$G:$G,0)))),5*D129+3*E129,\"\")),\"\")","v":""},110]
["UTOPIA ISLAND",{"$f":"IFERROR(VLOOKUP(A130,Sheet2!$B$2:$C$18,2,0),\"\")","v":"Utopia"},"2018-08-09",2,0,"MAKADI BAY",110,null,{"$f":"IFERROR(VALUE(IF(ISERROR(MATCH(A130,Sources!$B:$B,0)),IF(ISERROR(MATCH(F130,Sources!$C:$C,0)),\"\",5*D130+3*E130),IF(AND(NOT(ISERROR(MATCH(A130,Sources!$D:$D,0))),NOT(ISERROR(MATCH(F130,Sources!$E:$E,0)))),5*D130+3*E130,\"\"))&IF(AND(ISERROR(MATCH(A130,Sources!$F:$F,0)),NOT(ISERROR(MATCH(F130,Sources!$G:$G,0)))),5*D130+3*E130,\"\")),\"\")","v":""},110]
["UTOPIA ISLAND",{"$f":"IFERROR(VLOOKUP(A131,Sheet2!$B$2:$C$18,2,0),\"\")","v":"Utopia"},"2018-08-09",1,0,"MAKADI BAY",55,null,{"$f":"IFERROR(VALUE(IF(ISERROR(MATCH(A131,Sources!$B:$B,0)),IF(ISERROR(MATCH(F131,Sources!$C:$C,0)),\"\",5*D131+3*E131),IF(AND(NOT(ISERROR(MATCH(A131,Sources!$D:$D,0))),NOT(ISERROR(MATCH(F131,Sources!$E:$E,0)))),5*D131+3*E131,\"\"))&IF(AND(ISERROR(MATCH(A131,Sources!$F:$F,0)),NOT(ISERROR(MATCH(F131,Sources!$G:$G,0)))),5*D131+3*E131,\"\")),\"\")","v":""},{"$f":"IF(I131=\"\",G131,(G131-I131))","v":55}]
["UTOPIA ISLAND",{"$f":"IFERROR(VLOOKUP(A132,Sheet2!$B$2:$C$18,2,0),\"\")","v":"Utopia"},"2018-08-09",2,1,"MAKADI BAY",138,null,{"$f":"IFERROR(VALUE(IF(ISERROR(MATCH(A132,Sources!$B:$B,0)),IF(ISERROR(MATCH(F132,Sources!$C:$C,0)),\"\",5*D132+3*E132),IF(AND(NOT(ISERROR(MATCH(A132,Sources!$D:$D,0))),NOT(ISERROR(MATCH(F132,Sources!$E:$E,0)))),5*D132+3*E132,\"\"))&IF(AND(ISERROR(MATCH(A132,Sources!$F:$F,0)),NOT(ISERROR(MATCH(F132,Sources!$G:$G,0)))),5*D132+3*E132,\"\")),\"\")","v":""},138]
["UTOPIA ISLAND",{"$f":"IFERROR(VLOOKUP(A133,Sheet2!$B$2:$C$18,2,0),\"\")","v":"Utopia"},"2018-08-09",1,0,"MAKADI BAY",55,null,{"$f":"IFERROR(VALUE(IF(ISERROR(MATCH(A133,Sources!$B:$B,0)),IF(ISERROR(MATCH(F133,Sources!$C:$C,0)),\"\",5*D133+3*E133),IF(AND(NOT(ISERROR(MATCH(A133,Sources!$D:$D,0))),NOT(ISERROR(MATCH(F133,Sources!$E:$E,0)))),5*D133+3*E133,\"\"))&IF(AND(ISERROR(MATCH(A133,Sources!$F:$F,0)),NOT(ISERROR(MATCH(F133,Sources!$G:$G,0)))),5*D133+3*E133,\"\")),\"\")","v":""},55]
["UTOPIA ISLAND",{"$f":"IFERROR(VLOOKUP(A134,Sheet2!$B$2:$C$18,2,0),\"\")","v":"Utopia"},"2018-08-09",2,0,"HURGADA",110,null,{"$f":"IFERROR(VALUE(IF(ISERROR(MATCH(A134,Sources!$B:$B,0)),IF(ISERROR(MATCH(F134,Sources!$C:$C,0)),\"\",5*D134+3*E134),IF(AND(NOT(ISERROR(MATCH(A134,Sources!$D:$D,0))),NOT(ISERROR(MATCH(F134,Sources!$E:$E,0)))),5*D134+3*E134,\"\"))&IF(AND(ISERROR(MATCH(A134,Sources!$F:$F,0)),NOT(ISERROR(MATCH(F134,Sources!$G:$G,0)))),5*D134+3*E134,\"\")),\"\")","v":""},110]
["UTOPIA ISLAND",{"$f":"IFERROR(VLOOKUP(A135,Sheet2!$B$2:$C$18,2,0),\"\")","v":"Utopia"},"2018-08-09",3,0,"HURGADA",165,null,{"$f":"IFERROR(VALUE(IF(ISERROR(MATCH(A135,Sources!$B:$B,0)),IF(ISERROR(MATCH(F135,Sources!$C:$C,0)),\"\",5*D135+3*E135),IF(AND(NOT(ISERROR(MATCH(A135,Sources!$D:$D,0))),NOT(ISERROR(MATCH(F135,Sources!$E:$E,0)))),5*D135+3*E135,\"\"))&IF(AND(ISERROR(MATCH(A135,Sources!$F:$F,0)),NOT(ISERROR(MATCH(F135,Sources!$G:$G,0)))),5*D135+3*E135,\"\")),\"\")","v":""},165]
["UTOPIA ISLAND",{"$f":"IFERROR(VLOOKUP(A136,Sheet2!$B$2:$C$18,2,0),\"\")","v":"Utopia"},"2018-08-09",2,1,"MAKADI BAY",138,null,{"$f":"IFERROR(VALUE(IF(ISERROR(MATCH(A136,Sources!$B:$B,0)),IF(ISERROR(MATCH(F136,Sources!$C:$C,0)),\"\",5*D136+3*E136),IF(AND(NOT(ISERROR(MATCH(A136,Sources!$D:$D,0))),NOT(ISERROR(MATCH(F136,Sources!$E:$E,0)))),5*D136+3*E136,\"\"))&IF(AND(ISERROR(MATCH(A136,Sources!$F:$F,0)),NOT(ISERROR(MATCH(F136,Sources!$G:$G,0)))),5*D136+3*E136,\"\")),\"\")","v":""},138]
["UTOPIA ISLAND",{"$f":"IFERROR(VLOOKUP(A137,Sheet2!$B$2:$C$18,2,0),\"\")","v":"Utopia"},"2018-08-09",1,0,"MAKADI BAY",55,null,{"$f":"IFERROR(VALUE(IF(ISERROR(MATCH(A137,Sources!$B:$B,0)),IF(ISERROR(MATCH(F137,Sources!$C:$C,0)),\"\",5*D137+3*E137),IF(AND(NOT(ISERROR(MATCH(A137,Sources!$D:$D,0))),NOT(ISERROR(MATCH(F137,Sources!$E:$E,0)))),5*D137+3*E137,\"\"))&IF(AND(ISERROR(MATCH(A137,Sources!$F:$F,0)),NOT(ISERROR(MATCH(F137,Sources!$G:$G,0)))),5*D137+3*E137,\"\")),\"\")","v":""},55]
["UTOPIA ISLAND",{"$f":"IFERROR(VLOOKUP(A138,Sheet2!$B$2:$C$18,2,0),\"\")","v":"Utopia"},"2018-08-09",3,0,"MAKADI BAY",165,null,{"$f":"IFERROR(VALUE(IF(ISERROR(MATCH(A138,Sources!$B:$B,0)),IF(ISERROR(MATCH(F138,Sources!$C:$C,0)),\"\",5*D138+3*E138),IF(AND(NOT(ISERROR(MATCH(A138,Sources!$D:$D,0))),NOT(ISERROR(MATCH(F138,Sources!$E:$E,0)))),5*D138+3*E138,\"\"))&IF(AND(ISERROR(MATCH(A138,Sources!$F:$F,0)),NOT(ISERROR(MATCH(F138,Sources!$G:$G,0)))),5*D138+3*E138,\"\")),\"\")","v":""},165]
["UTOPIA ISLAND",{"$f":"IFERROR(VLOOKUP(A139,Sheet2!$B$2:$C$18,2,0),\"\")","v":"Utopia"},"2018-08-09",4,0,"MAKADI BAY",220,null,{"$f":"IFERROR(VALUE(IF(ISERROR(MATCH(A139,Sources!$B:$B,0)),IF(ISERROR(MATCH(F139,Sources!$C:$C,0)),\"\",5*D139+3*E139),IF(AND(NOT(ISERROR(MATCH(A139,Sources!$D:$D,0))),NOT(ISERROR(MATCH(F139,Sources!$E:$E,0)))),5*D139+3*E139,\"\"))&IF(AND(ISERROR(MATCH(A139,Sources!$F:$F,0)),NOT(ISERROR(MATCH(F139,Sources!$G:$G,0)))),5*D139+3*E139,\"\")),\"\")","v":""},220]
["UTOPIA ISLAND",{"$f":"IFERROR(VLOOKUP(A140,Sheet2!$B$2:$C$18,2,0),\"\")","v":"Utopia"},"2018-08-09",2,0,"MAKADI BAY",110,null,{"$f":"IFERROR(VALUE(IF(ISERROR(MATCH(A140,Sources!$B:$B,0)),IF(ISERROR(MATCH(F140,Sources!$C:$C,0)),\"\",5*D140+3*E140),IF(AND(NOT(ISERROR(MATCH(A140,Sources!$D:$D,0))),NOT(ISERROR(MATCH(F140,Sources!$E:$E,0)))),5*D140+3*E140,\"\"))&IF(AND(ISERROR(MATCH(A140,Sources!$F:$F,0)),NOT(ISERROR(MATCH(F140,Sources!$G:$G,0)))),5*D140+3*E140,\"\")),\"\")","v":""},110]
["UTOPIA ISLAND",{"$f":"IFERROR(VLOOKUP(A141,Sheet2!$B$2:$C$18,2,0),\"\")","v":"Utopia"},"2018-08-09",2,0,"MAKADI BAY",110,null,{"$f":"IFERROR(VALUE(IF(ISERROR(MATCH(A141,Sources!$B:$B,0)),IF(ISERROR(MATCH(F141,Sources!$C:$C,0)),\"\",5*D141+3*E141),IF(AND(NOT(ISERROR(MATCH(A141,Sources!$D:$D,0))),NOT(ISERROR(MATCH(F141,Sources!$E:$E,0)))),5*D141+3*E141,\"\"))&IF(AND(ISERROR(MATCH(A141,Sources!$F:$F,0)),NOT(ISERROR(MATCH(F141,Sources!$G:$G,0)))),5*D141+3*E141,\"\")),\"\")","v":""},110]
["MOTO 1 HOUR",{"$f":"IFERROR(VLOOKUP(A142,Sheet2!$B$2:$C$18,2,0),\"\")","v":"Moto 1 Hour"},"2018-08-10",2,0,"HURGADA",80,null,{"$f":"IFERROR(VALUE(IF(ISERROR(MATCH(A142,Sources!$B:$B,0)),IF(ISERROR(MATCH(F142,Sources!$C:$C,0)),\"\",5*D142+3*E142),IF(AND(NOT(ISERROR(MATCH(A142,Sources!$D:$D,0))),NOT(ISERROR(MATCH(F142,Sources!$E:$E,0)))),5*D142+3*E142,\"\"))&IF(AND(ISERROR(MATCH(A142,Sources!$F:$F,0)),NOT(ISERROR(MATCH(F142,Sources!$G:$G,0)))),5*D142+3*E142,\"\")),\"\")","v":""},80]
["MOTO2",{"$f":"IFERROR(VLOOKUP(A143,Sheet2!$B$2:$C$18,2,0),\"\")","v":"Moto 2"},"2018-08-10",2,0,"HURGADA",90,null,{"$f":"IFERROR(VALUE(IF(ISERROR(MATCH(A143,Sources!$B:$B,0)),IF(ISERROR(MATCH(F143,Sources!$C:$C,0)),\"\",5*D143+3*E143),IF(AND(NOT(ISERROR(MATCH(A143,Sources!$D:$D,0))),NOT(ISERROR(MATCH(F143,Sources!$E:$E,0)))),5*D143+3*E143,\"\"))&IF(AND(ISERROR(MATCH(A143,Sources!$F:$F,0)),NOT(ISERROR(MATCH(F143,Sources!$G:$G,0)))),5*D143+3*E143,\"\")),\"\")","v":""},90]
["MOTO2",{"$f":"IFERROR(VLOOKUP(A144,Sheet2!$B$2:$C$18,2,0),\"\")","v":"Moto 2"},"2018-08-10",2,0,"MAKADI BAY",100,null,{"$f":"IFERROR(VALUE(IF(ISERROR(MATCH(A144,Sources!$B:$B,0)),IF(ISERROR(MATCH(F144,Sources!$C:$C,0)),\"\",5*D144+3*E144),IF(AND(NOT(ISERROR(MATCH(A144,Sources!$D:$D,0))),NOT(ISERROR(MATCH(F144,Sources!$E:$E,0)))),5*D144+3*E144,\"\"))&IF(AND(ISERROR(MATCH(A144,Sources!$F:$F,0)),NOT(ISERROR(MATCH(F144,Sources!$G:$G,0)))),5*D144+3*E144,\"\")),\"\")","v":10},90]
["MOTO2",{"$f":"IFERROR(VLOOKUP(A145,Sheet2!$B$2:$C$18,2,0),\"\")","v":"Moto 2"},"2018-08-10",1,0,"MAKADI BAY",50,null,{"$f":"IFERROR(VALUE(IF(ISERROR(MATCH(A145,Sources!$B:$B,0)),IF(ISERROR(MATCH(F145,Sources!$C:$C,0)),\"\",5*D145+3*E145),IF(AND(NOT(ISERROR(MATCH(A145,Sources!$D:$D,0))),NOT(ISERROR(MATCH(F145,Sources!$E:$E,0)))),5*D145+3*E145,\"\"))&IF(AND(ISERROR(MATCH(A145,Sources!$F:$F,0)),NOT(ISERROR(MATCH(F145,Sources!$G:$G,0)))),5*D145+3*E145,\"\")),\"\")","v":5},45]
["MOTO2",{"$f":"IFERROR(VLOOKUP(A146,Sheet2!$B$2:$C$18,2,0),\"\")","v":"Moto 2"},"2018-08-10",1,0,"HURGADA",55,null,{"$f":"IFERROR(VALUE(IF(ISERROR(MATCH(A146,Sources!$B:$B,0)),IF(ISERROR(MATCH(F146,Sources!$C:$C,0)),\"\",5*D146+3*E146),IF(AND(NOT(ISERROR(MATCH(A146,Sources!$D:$D,0))),NOT(ISERROR(MATCH(F146,Sources!$E:$E,0)))),5*D146+3*E146,\"\"))&IF(AND(ISERROR(MATCH(A146,Sources!$F:$F,0)),NOT(ISERROR(MATCH(F146,Sources!$G:$G,0)))),5*D146+3*E146,\"\")),\"\")","v":""},55]
["GRAND AQUARIUM",{"$f":"IFERROR(VLOOKUP(A147,Sheet2!$B$2:$C$18,2,0),\"\")","v":"Grand Aquarium"},"2018-08-11",2,0,"HURGADA",80,null,{"$f":"IFERROR(VALUE(IF(ISERROR(MATCH(A147,Sources!$B:$B,0)),IF(ISERROR(MATCH(F147,Sources!$C:$C,0)),\"\",5*D147+3*E147),IF(AND(NOT(ISERROR(MATCH(A147,Sources!$D:$D,0))),NOT(ISERROR(MATCH(F147,Sources!$E:$E,0)))),5*D147+3*E147,\"\"))&IF(AND(ISERROR(MATCH(A147,Sources!$F:$F,0)),NOT(ISERROR(MATCH(F147,Sources!$G:$G,0)))),5*D147+3*E147,\"\")),\"\")","v":""},80]
["INTRO DIVING",{"$f":"IFERROR(VLOOKUP(A148,Sheet2!$B$2:$C$18,2,0),\"\")","v":"Diving"},"2018-08-11",2,0,"HURGADA",130,null,{"$f":"IFERROR(VALUE(IF(ISERROR(MATCH(A148,Sources!$B:$B,0)),IF(ISERROR(MATCH(F148,Sources!$C:$C,0)),\"\",5*D148+3*E148),IF(AND(NOT(ISERROR(MATCH(A148,Sources!$D:$D,0))),NOT(ISERROR(MATCH(F148,Sources!$E:$E,0)))),5*D148+3*E148,\"\"))&IF(AND(ISERROR(MATCH(A148,Sources!$F:$F,0)),NOT(ISERROR(MATCH(F148,Sources!$G:$G,0)))),5*D148+3*E148,\"\")),\"\")","v":""},130]
["GRAND AQUARIUM",{"$f":"IFERROR(VLOOKUP(A149,Sheet2!$B$2:$C$18,2,0),\"\")","v":"Grand Aquarium"},"2018-08-11",2,0,"HURGADA",80,null,{"$f":"IFERROR(VALUE(IF(ISERROR(MATCH(A149,Sources!$B:$B,0)),IF(ISERROR(MATCH(F149,Sources!$C:$C,0)),\"\",5*D149+3*E149),IF(AND(NOT(ISERROR(MATCH(A149,Sources!$D:$D,0))),NOT(ISERROR(MATCH(F149,Sources!$E:$E,0)))),5*D149+3*E149,\"\"))&IF(AND(ISERROR(MATCH(A149,Sources!$F:$F,0)),NOT(ISERROR(MATCH(F149,Sources!$G:$G,0)))),5*D149+3*E149,\"\")),\"\")","v":""},80]
["OVER DAY LUXORQUEEN VALLY",{"$f":"IFERROR(VLOOKUP(A150,Sheet2!$B$2:$C$18,2,0),\"\")","v":"LUXOR 2"},"2018-08-11",2,0,"HURGADA",180,null,{"$f":"IFERROR(VALUE(IF(ISERROR(MATCH(A150,Sources!$B:$B,0)),IF(ISERROR(MATCH(F150,Sources!$C:$C,0)),\"\",5*D150+3*E150),IF(AND(NOT(ISERROR(MATCH(A150,Sources!$D:$D,0))),NOT(ISERROR(MATCH(F150,Sources!$E:$E,0)))),5*D150+3*E150,\"\"))&IF(AND(ISERROR(MATCH(A150,Sources!$F:$F,0)),NOT(ISERROR(MATCH(F150,Sources!$G:$G,0)))),5*D150+3*E150,\"\")),\"\")","v":""},180]
["SUBMARINE",{"$f":"IFERROR(VLOOKUP(A151,Sheet2!$B$2:$C$18,2,0),\"\")","v":"Submarine"},"2018-08-11",2,0,"MAKADI BAY",126,null,{"$f":"IFERROR(VALUE(IF(ISERROR(MATCH(A151,Sources!$B:$B,0)),IF(ISERROR(MATCH(F151,Sources!$C:$C,0)),\"\",5*D151+3*E151),IF(AND(NOT(ISERROR(MATCH(A151,Sources!$D:$D,0))),NOT(ISERROR(MATCH(F151,Sources!$E:$E,0)))),5*D151+3*E151,\"\"))&IF(AND(ISERROR(MATCH(A151,Sources!$F:$F,0)),NOT(ISERROR(MATCH(F151,Sources!$G:$G,0)))),5*D151+3*E151,\"\")),\"\")","v":10},116]
["OVER DAY LUXORQUEEN VALLY",{"$f":"IFERROR(VLOOKUP(A152,Sheet2!$B$2:$C$18,2,0),\"\")","v":"LUXOR 2"},"2018-08-11",1,0,"MAKADI BAY",90,null,{"$f":"IFERROR(VALUE(IF(ISERROR(MATCH(A152,Sources!$B:$B,0)),IF(ISERROR(MATCH(F152,Sources!$C:$C,0)),\"\",5*D152+3*E152),IF(AND(NOT(ISERROR(MATCH(A152,Sources!$D:$D,0))),NOT(ISERROR(MATCH(F152,Sources!$E:$E,0)))),5*D152+3*E152,\"\"))&IF(AND(ISERROR(MATCH(A152,Sources!$F:$F,0)),NOT(ISERROR(MATCH(F152,Sources!$G:$G,0)))),5*D152+3*E152,\"\")),\"\")","v":""},90]
["OVER DAY LUXORQUEEN VALLY",{"$f":"IFERROR(VLOOKUP(A153,Sheet2!$B$2:$C$18,2,0),\"\")","v":"LUXOR 2"},"2018-08-11",2,0,"MAKADI BAY",180,null,{"$f":"IFERROR(VALUE(IF(ISERROR(MATCH(A153,Sources!$B:$B,0)),IF(ISERROR(MATCH(F153,Sources!$C:$C,0)),\"\",5*D153+3*E153),IF(AND(NOT(ISERROR(MATCH(A153,Sources!$D:$D,0))),NOT(ISERROR(MATCH(F153,Sources!$E:$E,0)))),5*D153+3*E153,\"\"))&IF(AND(ISERROR(MATCH(A153,Sources!$F:$F,0)),NOT(ISERROR(MATCH(F153,Sources!$G:$G,0)))),5*D153+3*E153,\"\")),\"\")","v":""},180]
["OVER DAY LUXORQUEEN VALLY",{"$f":"IFERROR(VLOOKUP(A154,Sheet2!$B$2:$C$18,2,0),\"\")","v":"LUXOR 2"},"2018-08-11",2,0,"HURGADA",180,"ukaine",{"$f":"IFERROR(VALUE(IF(ISERROR(MATCH(A154,Sources!$B:$B,0)),IF(ISERROR(MATCH(F154,Sources!$C:$C,0)),\"\",5*D154+3*E154),IF(AND(NOT(ISERROR(MATCH(A154,Sources!$D:$D,0))),NOT(ISERROR(MATCH(F154,Sources!$E:$E,0)))),5*D154+3*E154,\"\"))&IF(AND(ISERROR(MATCH(A154,Sources!$F:$F,0)),NOT(ISERROR(MATCH(F154,Sources!$G:$G,0)))),5*D154+3*E154,\"\")),\"\")","v":""},180]
["OVER DAY LUXORQUEEN VALLY",{"$f":"IFERROR(VLOOKUP(A155,Sheet2!$B$2:$C$18,2,0),\"\")","v":"LUXOR 2"},"2018-08-11",3,0,"HURGADA",270,"ukraine",{"$f":"IFERROR(VALUE(IF(ISERROR(MATCH(A155,Sources!$B:$B,0)),IF(ISERROR(MATCH(F155,Sources!$C:$C,0)),\"\",5*D155+3*E155),IF(AND(NOT(ISERROR(MATCH(A155,Sources!$D:$D,0))),NOT(ISERROR(MATCH(F155,Sources!$E:$E,0)))),5*D155+3*E155,\"\"))&IF(AND(ISERROR(MATCH(A155,Sources!$F:$F,0)),NOT(ISERROR(MATCH(F155,Sources!$G:$G,0)))),5*D155+3*E155,\"\")),\"\")","v":""},270]
["OVER DAY LUXORQUEEN VALLY",{"$f":"IFERROR(VLOOKUP(A156,Sheet2!$B$2:$C$18,2,0),\"\")","v":"LUXOR 2"},"2018-08-11",2,1,"MAKADI BAY",225,null,{"$f":"IFERROR(VALUE(IF(ISERROR(MATCH(A156,Sources!$B:$B,0)),IF(ISERROR(MATCH(F156,Sources!$C:$C,0)),\"\",5*D156+3*E156),IF(AND(NOT(ISERROR(MATCH(A156,Sources!$D:$D,0))),NOT(ISERROR(MATCH(F156,Sources!$E:$E,0)))),5*D156+3*E156,\"\"))&IF(AND(ISERROR(MATCH(A156,Sources!$F:$F,0)),NOT(ISERROR(MATCH(F156,Sources!$G:$G,0)))),5*D156+3*E156,\"\")),\"\")","v":""},225]
["OVER DAY LUXORQUEEN VALLY",{"$f":"IFERROR(VLOOKUP(A157,Sheet2!$B$2:$C$18,2,0),\"\")","v":"LUXOR 2"},"2018-08-11",2,0,"MAKADI BAY",180,null,{"$f":"IFERROR(VALUE(IF(ISERROR(MATCH(A157,Sources!$B:$B,0)),IF(ISERROR(MATCH(F157,Sources!$C:$C,0)),\"\",5*D157+3*E157),IF(AND(NOT(ISERROR(MATCH(A157,Sources!$D:$D,0))),NOT(ISERROR(MATCH(F157,Sources!$E:$E,0)))),5*D157+3*E157,\"\"))&IF(AND(ISERROR(MATCH(A157,Sources!$F:$F,0)),NOT(ISERROR(MATCH(F157,Sources!$G:$G,0)))),5*D157+3*E157,\"\")),\"\")","v":""},180]
["OVER DAY LUXORQUEEN VALLY",{"$f":"IFERROR(VLOOKUP(A158,Sheet2!$B$2:$C$18,2,0),\"\")","v":"LUXOR 2"},"2018-08-11",1,0,"MAKADI BAY",90,null,{"$f":"IFERROR(VALUE(IF(ISERROR(MATCH(A158,Sources!$B:$B,0)),IF(ISERROR(MATCH(F158,Sources!$C:$C,0)),\"\",5*D158+3*E158),IF(AND(NOT(ISERROR(MATCH(A158,Sources!$D:$D,0))),NOT(ISERROR(MATCH(F158,Sources!$E:$E,0)))),5*D158+3*E158,\"\"))&IF(AND(ISERROR(MATCH(A158,Sources!$F:$F,0)),NOT(ISERROR(MATCH(F158,Sources!$G:$G,0)))),5*D158+3*E158,\"\")),\"\")","v":""},90]
["OVER DAY LUXORQUEEN VALLY",{"$f":"IFERROR(VLOOKUP(A159,Sheet2!$B$2:$C$18,2,0),\"\")","v":"LUXOR 2"},"2018-08-11",2,0,"MAKADI BAY",180,null,{"$f":"IFERROR(VALUE(IF(ISERROR(MATCH(A159,Sources!$B:$B,0)),IF(ISERROR(MATCH(F159,Sources!$C:$C,0)),\"\",5*D159+3*E159),IF(AND(NOT(ISERROR(MATCH(A159,Sources!$D:$D,0))),NOT(ISERROR(MATCH(F159,Sources!$E:$E,0)))),5*D159+3*E159,\"\"))&IF(AND(ISERROR(MATCH(A159,Sources!$F:$F,0)),NOT(ISERROR(MATCH(F159,Sources!$G:$G,0)))),5*D159+3*E159,\"\")),\"\")","v":""},180]
["OVER DAY LUXORQUEEN VALLY",{"$f":"IFERROR(VLOOKUP(A160,Sheet2!$B$2:$C$18,2,0),\"\")","v":"LUXOR 2"},"2018-08-11",2,0,"SAHL HASHEESH",180,null,{"$f":"IFERROR(VALUE(IF(ISERROR(MATCH(A160,Sources!$B:$B,0)),IF(ISERROR(MATCH(F160,Sources!$C:$C,0)),\"\",5*D160+3*E160),IF(AND(NOT(ISERROR(MATCH(A160,Sources!$D:$D,0))),NOT(ISERROR(MATCH(F160,Sources!$E:$E,0)))),5*D160+3*E160,\"\"))&IF(AND(ISERROR(MATCH(A160,Sources!$F:$F,0)),NOT(ISERROR(MATCH(F160,Sources!$G:$G,0)))),5*D160+3*E160,\"\")),\"\")","v":""},180]
["PARASAILING TRIP","Dbl parasaling","2018-08-11",2,0,"SAHL HASHEESH",75,null,{"$f":"IFERROR(VALUE(IF(ISERROR(MATCH(A161,Sources!$B:$B,0)),IF(ISERROR(MATCH(F161,Sources!$C:$C,0)),\"\",5*D161+3*E161),IF(AND(NOT(ISERROR(MATCH(A161,Sources!$D:$D,0))),NOT(ISERROR(MATCH(F161,Sources!$E:$E,0)))),5*D161+3*E161,\"\"))&IF(AND(ISERROR(MATCH(A161,Sources!$F:$F,0)),NOT(ISERROR(MATCH(F161,Sources!$G:$G,0)))),5*D161+3*E161,\"\")),\"\")","v":""},75]
["UTOPIA ISLAND",{"$f":"IFERROR(VLOOKUP(A162,Sheet2!$B$2:$C$18,2,0),\"\")","v":"Utopia"},"2018-08-12",2,1,"HURGADA",138,null,{"$f":"IFERROR(VALUE(IF(ISERROR(MATCH(A162,Sources!$B:$B,0)),IF(ISERROR(MATCH(F162,Sources!$C:$C,0)),\"\",5*D162+3*E162),IF(AND(NOT(ISERROR(MATCH(A162,Sources!$D:$D,0))),NOT(ISERROR(MATCH(F162,Sources!$E:$E,0)))),5*D162+3*E162,\"\"))&IF(AND(ISERROR(MATCH(A162,Sources!$F:$F,0)),NOT(ISERROR(MATCH(F162,Sources!$G:$G,0)))),5*D162+3*E162,\"\")),\"\")","v":""},138]
["UTOPIA ISLAND",{"$f":"IFERROR(VLOOKUP(A163,Sheet2!$B$2:$C$18,2,0),\"\")","v":"Utopia"},"2018-08-12",2,0,"HURGADA",110,null,{"$f":"IFERROR(VALUE(IF(ISERROR(MATCH(A163,Sources!$B:$B,0)),IF(ISERROR(MATCH(F163,Sources!$C:$C,0)),\"\",5*D163+3*E163),IF(AND(NOT(ISERROR(MATCH(A163,Sources!$D:$D,0))),NOT(ISERROR(MATCH(F163,Sources!$E:$E,0)))),5*D163+3*E163,\"\"))&IF(AND(ISERROR(MATCH(A163,Sources!$F:$F,0)),NOT(ISERROR(MATCH(F163,Sources!$G:$G,0)))),5*D163+3*E163,\"\")),\"\")","v":""},110]
["UTOPIA ISLAND",{"$f":"IFERROR(VLOOKUP(A164,Sheet2!$B$2:$C$18,2,0),\"\")","v":"Utopia"},"2018-08-12",2,0,"HURGADA",110,null,{"$f":"IFERROR(VALUE(IF(ISERROR(MATCH(A164,Sources!$B:$B,0)),IF(ISERROR(MATCH(F164,Sources!$C:$C,0)),\"\",5*D164+3*E164),IF(AND(NOT(ISERROR(MATCH(A164,Sources!$D:$D,0))),NOT(ISERROR(MATCH(F164,Sources!$E:$E,0)))),5*D164+3*E164,\"\"))&IF(AND(ISERROR(MATCH(A164,Sources!$F:$F,0)),NOT(ISERROR(MATCH(F164,Sources!$G:$G,0)))),5*D164+3*E164,\"\")),\"\")","v":""},110]
["UTOPIA ISLAND",{"$f":"IFERROR(VLOOKUP(A165,Sheet2!$B$2:$C$18,2,0),\"\")","v":"Utopia"},"2018-08-12",2,0,"HURGADA",110,null,{"$f":"IFERROR(VALUE(IF(ISERROR(MATCH(A165,Sources!$B:$B,0)),IF(ISERROR(MATCH(F165,Sources!$C:$C,0)),\"\",5*D165+3*E165),IF(AND(NOT(ISERROR(MATCH(A165,Sources!$D:$D,0))),NOT(ISERROR(MATCH(F165,Sources!$E:$E,0)))),5*D165+3*E165,\"\"))&IF(AND(ISERROR(MATCH(A165,Sources!$F:$F,0)),NOT(ISERROR(MATCH(F165,Sources!$G:$G,0)))),5*D165+3*E165,\"\")),\"\")","v":""},110]
["UTOPIA ISLAND",{"$f":"IFERROR(VLOOKUP(A166,Sheet2!$B$2:$C$18,2,0),\"\")","v":"Utopia"},"2018-08-12",2,2,"HURGADA",166,null,{"$f":"IFERROR(VALUE(IF(ISERROR(MATCH(A166,Sources!$B:$B,0)),IF(ISERROR(MATCH(F166,Sources!$C:$C,0)),\"\",5*D166+3*E166),IF(AND(NOT(ISERROR(MATCH(A166,Sources!$D:$D,0))),NOT(ISERROR(MATCH(F166,Sources!$E:$E,0)))),5*D166+3*E166,\"\"))&IF(AND(ISERROR(MATCH(A166,Sources!$F:$F,0)),NOT(ISERROR(MATCH(F166,Sources!$G:$G,0)))),5*D166+3*E166,\"\")),\"\")","v":""},166]
["UTOPIA ISLAND",{"$f":"IFERROR(VLOOKUP(A167,Sheet2!$B$2:$C$18,2,0),\"\")","v":"Utopia"},"2018-08-12",1,1,"MAKADI BAY",83,null,{"$f":"IFERROR(VALUE(IF(ISERROR(MATCH(A167,Sources!$B:$B,0)),IF(ISERROR(MATCH(F167,Sources!$C:$C,0)),\"\",5*D167+3*E167),IF(AND(NOT(ISERROR(MATCH(A167,Sources!$D:$D,0))),NOT(ISERROR(MATCH(F167,Sources!$E:$E,0)))),5*D167+3*E167,\"\"))&IF(AND(ISERROR(MATCH(A167,Sources!$F:$F,0)),NOT(ISERROR(MATCH(F167,Sources!$G:$G,0)))),5*D167+3*E167,\"\")),\"\")","v":""},83]
["UTOPIA ISLAND",{"$f":"IFERROR(VLOOKUP(A168,Sheet2!$B$2:$C$18,2,0),\"\")","v":"Utopia"},"2018-08-12",2,0,"MAKADI BAY",110,null,{"$f":"IFERROR(VALUE(IF(ISERROR(MATCH(A168,Sources!$B:$B,0)),IF(ISERROR(MATCH(F168,Sources!$C:$C,0)),\"\",5*D168+3*E168),IF(AND(NOT(ISERROR(MATCH(A168,Sources!$D:$D,0))),NOT(ISERROR(MATCH(F168,Sources!$E:$E,0)))),5*D168+3*E168,\"\"))&IF(AND(ISERROR(MATCH(A168,Sources!$F:$F,0)),NOT(ISERROR(MATCH(F168,Sources!$G:$G,0)))),5*D168+3*E168,\"\")),\"\")","v":""},110]
["UTOPIA ISLAND",{"$f":"IFERROR(VLOOKUP(A169,Sheet2!$B$2:$C$18,2,0),\"\")","v":"Utopia"},"2018-08-12",3,0,"MAKADI BAY",165,null,{"$f":"IFERROR(VALUE(IF(ISERROR(MATCH(A169,Sources!$B:$B,0)),IF(ISERROR(MATCH(F169,Sources!$C:$C,0)),\"\",5*D169+3*E169),IF(AND(NOT(ISERROR(MATCH(A169,Sources!$D:$D,0))),NOT(ISERROR(MATCH(F169,Sources!$E:$E,0)))),5*D169+3*E169,\"\"))&IF(AND(ISERROR(MATCH(A169,Sources!$F:$F,0)),NOT(ISERROR(MATCH(F169,Sources!$G:$G,0)))),5*D169+3*E169,\"\")),\"\")","v":""},165]
["UTOPIA ISLAND",{"$f":"IFERROR(VLOOKUP(A170,Sheet2!$B$2:$C$18,2,0),\"\")","v":"Utopia"},"2018-08-12",1,0,"MAKADI BAY",55,null,{"$f":"IFERROR(VALUE(IF(ISERROR(MATCH(A170,Sources!$B:$B,0)),IF(ISERROR(MATCH(F170,Sources!$C:$C,0)),\"\",5*D170+3*E170),IF(AND(NOT(ISERROR(MATCH(A170,Sources!$D:$D,0))),NOT(ISERROR(MATCH(F170,Sources!$E:$E,0)))),5*D170+3*E170,\"\"))&IF(AND(ISERROR(MATCH(A170,Sources!$F:$F,0)),NOT(ISERROR(MATCH(F170,Sources!$G:$G,0)))),5*D170+3*E170,\"\")),\"\")","v":""},55]
["UTOPIA ISLAND",{"$f":"IFERROR(VLOOKUP(A171,Sheet2!$B$2:$C$18,2,0),\"\")","v":"Utopia"},"2018-08-12",2,2,"MAKADI BAY",166,null,{"$f":"IFERROR(VALUE(IF(ISERROR(MATCH(A171,Sources!$B:$B,0)),IF(ISERROR(MATCH(F171,Sources!$C:$C,0)),\"\",5*D171+3*E171),IF(AND(NOT(ISERROR(MATCH(A171,Sources!$D:$D,0))),NOT(ISERROR(MATCH(F171,Sources!$E:$E,0)))),5*D171+3*E171,\"\"))&IF(AND(ISERROR(MATCH(A171,Sources!$F:$F,0)),NOT(ISERROR(MATCH(F171,Sources!$G:$G,0)))),5*D171+3*E171,\"\")),\"\")","v":""},166]
["UTOPIA ISLAND",{"$f":"IFERROR(VLOOKUP(A172,Sheet2!$B$2:$C$18,2,0),\"\")","v":"Utopia"},"2018-08-12",2,0,"MAKADI BAY",110,null,{"$f":"IFERROR(VALUE(IF(ISERROR(MATCH(A172,Sources!$B:$B,0)),IF(ISERROR(MATCH(F172,Sources!$C:$C,0)),\"\",5*D172+3*E172),IF(AND(NOT(ISERROR(MATCH(A172,Sources!$D:$D,0))),NOT(ISERROR(MATCH(F172,Sources!$E:$E,0)))),5*D172+3*E172,\"\"))&IF(AND(ISERROR(MATCH(A172,Sources!$F:$F,0)),NOT(ISERROR(MATCH(F172,Sources!$G:$G,0)))),5*D172+3*E172,\"\")),\"\")","v":""},110]
["UTOPIA ISLAND",{"$f":"IFERROR(VLOOKUP(A173,Sheet2!$B$2:$C$18,2,0),\"\")","v":"Utopia"},"2018-08-12",2,0,"MAKADI BAY",110,null,{"$f":"IFERROR(VALUE(IF(ISERROR(MATCH(A173,Sources!$B:$B,0)),IF(ISERROR(MATCH(F173,Sources!$C:$C,0)),\"\",5*D173+3*E173),IF(AND(NOT(ISERROR(MATCH(A173,Sources!$D:$D,0))),NOT(ISERROR(MATCH(F173,Sources!$E:$E,0)))),5*D173+3*E173,\"\"))&IF(AND(ISERROR(MATCH(A173,Sources!$F:$F,0)),NOT(ISERROR(MATCH(F173,Sources!$G:$G,0)))),5*D173+3*E173,\"\")),\"\")","v":""},110]
["UTOPIA ISLAND",{"$f":"IFERROR(VLOOKUP(A174,Sheet2!$B$2:$C$18,2,0),\"\")","v":"Utopia"},"2018-08-12",3,0,"MAKADI BAY",165,null,{"$f":"IFERROR(VALUE(IF(ISERROR(MATCH(A174,Sources!$B:$B,0)),IF(ISERROR(MATCH(F174,Sources!$C:$C,0)),\"\",5*D174+3*E174),IF(AND(NOT(ISERROR(MATCH(A174,Sources!$D:$D,0))),NOT(ISERROR(MATCH(F174,Sources!$E:$E,0)))),5*D174+3*E174,\"\"))&IF(AND(ISERROR(MATCH(A174,Sources!$F:$F,0)),NOT(ISERROR(MATCH(F174,Sources!$G:$G,0)))),5*D174+3*E174,\"\")),\"\")","v":""},165]
["UTOPIA ISLAND",{"$f":"IFERROR(VLOOKUP(A175,Sheet2!$B$2:$C$18,2,0),\"\")","v":"Utopia"},"2018-08-12",2,0,"MAKADI BAY",110,null,{"$f":"IFERROR(VALUE(IF(ISERROR(MATCH(A175,Sources!$B:$B,0)),IF(ISERROR(MATCH(F175,Sources!$C:$C,0)),\"\",5*D175+3*E175),IF(AND(NOT(ISERROR(MATCH(A175,Sources!$D:$D,0))),NOT(ISERROR(MATCH(F175,Sources!$E:$E,0)))),5*D175+3*E175,\"\"))&IF(AND(ISERROR(MATCH(A175,Sources!$F:$F,0)),NOT(ISERROR(MATCH(F175,Sources!$G:$G,0)))),5*D175+3*E175,\"\")),\"\")","v":""},110]
["UTOPIA ISLAND",{"$f":"IFERROR(VLOOKUP(A176,Sheet2!$B$2:$C$18,2,0),\"\")","v":"Utopia"},"2018-08-12",2,0,"MAKADI BAY",110,null,{"$f":"IFERROR(VALUE(IF(ISERROR(MATCH(A176,Sources!$B:$B,0)),IF(ISERROR(MATCH(F176,Sources!$C:$C,0)),\"\",5*D176+3*E176),IF(AND(NOT(ISERROR(MATCH(A176,Sources!$D:$D,0))),NOT(ISERROR(MATCH(F176,Sources!$E:$E,0)))),5*D176+3*E176,\"\"))&IF(AND(ISERROR(MATCH(A176,Sources!$F:$F,0)),NOT(ISERROR(MATCH(F176,Sources!$G:$G,0)))),5*D176+3*E176,\"\")),\"\")","v":""},110]
["UTOPIA ISLAND",{"$f":"IFERROR(VLOOKUP(A177,Sheet2!$B$2:$C$18,2,0),\"\")","v":"Utopia"},"2018-08-12",2,0,"MAKADI BAY",110,null,{"$f":"IFERROR(VALUE(IF(ISERROR(MATCH(A177,Sources!$B:$B,0)),IF(ISERROR(MATCH(F177,Sources!$C:$C,0)),\"\",5*D177+3*E177),IF(AND(NOT(ISERROR(MATCH(A177,Sources!$D:$D,0))),NOT(ISERROR(MATCH(F177,Sources!$E:$E,0)))),5*D177+3*E177,\"\"))&IF(AND(ISERROR(MATCH(A177,Sources!$F:$F,0)),NOT(ISERROR(MATCH(F177,Sources!$G:$G,0)))),5*D177+3*E177,\"\")),\"\")","v":""},110]
["UTOPIA ISLAND",{"$f":"IFERROR(VLOOKUP(A178,Sheet2!$B$2:$C$18,2,0),\"\")","v":"Utopia"},"2018-08-12",2,0,"MAKADI BAY",110,null,{"$f":"IFERROR(VALUE(IF(ISERROR(MATCH(A178,Sources!$B:$B,0)),IF(ISERROR(MATCH(F178,Sources!$C:$C,0)),\"\",5*D178+3*E178),IF(AND(NOT(ISERROR(MATCH(A178,Sources!$D:$D,0))),NOT(ISERROR(MATCH(F178,Sources!$E:$E,0)))),5*D178+3*E178,\"\"))&IF(AND(ISERROR(MATCH(A178,Sources!$F:$F,0)),NOT(ISERROR(MATCH(F178,Sources!$G:$G,0)))),5*D178+3*E178,\"\")),\"\")","v":""},110]
["UTOPIA ISLAND",{"$f":"IFERROR(VLOOKUP(A179,Sheet2!$B$2:$C$18,2,0),\"\")","v":"Utopia"},"2018-08-12",2,0,"SAHL HASHEESH",110,null,{"$f":"IFERROR(VALUE(IF(ISERROR(MATCH(A179,Sources!$B:$B,0)),IF(ISERROR(MATCH(F179,Sources!$C:$C,0)),\"\",5*D179+3*E179),IF(AND(NOT(ISERROR(MATCH(A179,Sources!$D:$D,0))),NOT(ISERROR(MATCH(F179,Sources!$E:$E,0)))),5*D179+3*E179,\"\"))&IF(AND(ISERROR(MATCH(A179,Sources!$F:$F,0)),NOT(ISERROR(MATCH(F179,Sources!$G:$G,0)))),5*D179+3*E179,\"\")),\"\")","v":""},110]
["UTOPIA ISLAND",{"$f":"IFERROR(VLOOKUP(A180,Sheet2!$B$2:$C$18,2,0),\"\")","v":"Utopia"},"2018-08-12",4,0,"HURGADA",220,null,{"$f":"IFERROR(VALUE(IF(ISERROR(MATCH(A180,Sources!$B:$B,0)),IF(ISERROR(MATCH(F180,Sources!$C:$C,0)),\"\",5*D180+3*E180),IF(AND(NOT(ISERROR(MATCH(A180,Sources!$D:$D,0))),NOT(ISERROR(MATCH(F180,Sources!$E:$E,0)))),5*D180+3*E180,\"\"))&IF(AND(ISERROR(MATCH(A180,Sources!$F:$F,0)),NOT(ISERROR(MATCH(F180,Sources!$G:$G,0)))),5*D180+3*E180,\"\")),\"\")","v":""},220]
["UTOPIA ISLAND",{"$f":"IFERROR(VLOOKUP(A181,Sheet2!$B$2:$C$18,2,0),\"\")","v":"Utopia"},"2018-08-12",2,0,"HURGADA",110,null,{"$f":"IFERROR(VALUE(IF(ISERROR(MATCH(A181,Sources!$B:$B,0)),IF(ISERROR(MATCH(F181,Sources!$C:$C,0)),\"\",5*D181+3*E181),IF(AND(NOT(ISERROR(MATCH(A181,Sources!$D:$D,0))),NOT(ISERROR(MATCH(F181,Sources!$E:$E,0)))),5*D181+3*E181,\"\"))&IF(AND(ISERROR(MATCH(A181,Sources!$F:$F,0)),NOT(ISERROR(MATCH(F181,Sources!$G:$G,0)))),5*D181+3*E181,\"\")),\"\")","v":""},110]
["UTOPIA ISLAND",{"$f":"IFERROR(VLOOKUP(A182,Sheet2!$B$2:$C$18,2,0),\"\")","v":"Utopia"},"2018-08-12",3,0,"MAKADI BAY",165,null,{"$f":"IFERROR(VALUE(IF(ISERROR(MATCH(A182,Sources!$B:$B,0)),IF(ISERROR(MATCH(F182,Sources!$C:$C,0)),\"\",5*D182+3*E182),IF(AND(NOT(ISERROR(MATCH(A182,Sources!$D:$D,0))),NOT(ISERROR(MATCH(F182,Sources!$E:$E,0)))),5*D182+3*E182,\"\"))&IF(AND(ISERROR(MATCH(A182,Sources!$F:$F,0)),NOT(ISERROR(MATCH(F182,Sources!$G:$G,0)))),5*D182+3*E182,\"\")),\"\")","v":""},165]
["SEA TRIP",{"$f":"IFERROR(VLOOKUP(A183,Sheet2!$B$2:$C$18,2,0),\"\")","v":"Sea Trip"},"2018-08-13",2,0,"HURGADA",80,null,{"$f":"IFERROR(VALUE(IF(ISERROR(MATCH(A183,Sources!$B:$B,0)),IF(ISERROR(MATCH(F183,Sources!$C:$C,0)),\"\",5*D183+3*E183),IF(AND(NOT(ISERROR(MATCH(A183,Sources!$D:$D,0))),NOT(ISERROR(MATCH(F183,Sources!$E:$E,0)))),5*D183+3*E183,\"\"))&IF(AND(ISERROR(MATCH(A183,Sources!$F:$F,0)),NOT(ISERROR(MATCH(F183,Sources!$G:$G,0)))),5*D183+3*E183,\"\")),\"\")","v":""},80]
["INTRO DIVING",{"$f":"IFERROR(VLOOKUP(A184,Sheet2!$B$2:$C$18,2,0),\"\")","v":"Diving"},"2018-08-13",1,0,"MAKADI BAY",70,"NO SHOW",{"$f":"IFERROR(VALUE(IF(ISERROR(MATCH(A184,Sources!$B:$B,0)),IF(ISERROR(MATCH(F184,Sources!$C:$C,0)),\"\",5*D184+3*E184),IF(AND(NOT(ISERROR(MATCH(A184,Sources!$D:$D,0))),NOT(ISERROR(MATCH(F184,Sources!$E:$E,0)))),5*D184+3*E184,\"\"))&IF(AND(ISERROR(MATCH(A184,Sources!$F:$F,0)),NOT(ISERROR(MATCH(F184,Sources!$G:$G,0)))),5*D184+3*E184,\"\")),\"\")","v":5},65]
["MOTO2",{"$f":"IFERROR(VLOOKUP(A185,Sheet2!$B$2:$C$18,2,0),\"\")","v":"Moto 2"},"2018-08-13",2,0,"SAHL HASHEESH",90,null,{"$f":"IFERROR(VALUE(IF(ISERROR(MATCH(A185,Sources!$B:$B,0)),IF(ISERROR(MATCH(F185,Sources!$C:$C,0)),\"\",5*D185+3*E185),IF(AND(NOT(ISERROR(MATCH(A185,Sources!$D:$D,0))),NOT(ISERROR(MATCH(F185,Sources!$E:$E,0)))),5*D185+3*E185,\"\"))&IF(AND(ISERROR(MATCH(A185,Sources!$F:$F,0)),NOT(ISERROR(MATCH(F185,Sources!$G:$G,0)))),5*D185+3*E185,\"\")),\"\")","v":""},90]
["MOTO2",{"$f":"IFERROR(VLOOKUP(A186,Sheet2!$B$2:$C$18,2,0),\"\")","v":"Moto 2"},"2018-08-13",2,0,"SAHL HASHEESH",90,null,{"$f":"IFERROR(VALUE(IF(ISERROR(MATCH(A186,Sources!$B:$B,0)),IF(ISERROR(MATCH(F186,Sources!$C:$C,0)),\"\",5*D186+3*E186),IF(AND(NOT(ISERROR(MATCH(A186,Sources!$D:$D,0))),NOT(ISERROR(MATCH(F186,Sources!$E:$E,0)))),5*D186+3*E186,\"\"))&IF(AND(ISERROR(MATCH(A186,Sources!$F:$F,0)),NOT(ISERROR(MATCH(F186,Sources!$G:$G,0)))),5*D186+3*E186,\"\")),\"\")","v":""},90]
["SEA TRIP",{"$f":"IFERROR(VLOOKUP(A187,Sheet2!$B$2:$C$18,2,0),\"\")","v":"Sea Trip"},"2018-08-13",3,0,"HURGADA",120,null,{"$f":"IFERROR(VALUE(IF(ISERROR(MATCH(A187,Sources!$B:$B,0)),IF(ISERROR(MATCH(F187,Sources!$C:$C,0)),\"\",5*D187+3*E187),IF(AND(NOT(ISERROR(MATCH(A187,Sources!$D:$D,0))),NOT(ISERROR(MATCH(F187,Sources!$E:$E,0)))),5*D187+3*E187,\"\"))&IF(AND(ISERROR(MATCH(A187,Sources!$F:$F,0)),NOT(ISERROR(MATCH(F187,Sources!$G:$G,0)))),5*D187+3*E187,\"\")),\"\")","v":""},120]
["MOTO2",{"$f":"IFERROR(VLOOKUP(A188,Sheet2!$B$2:$C$18,2,0),\"\")","v":"Moto 2"},"2018-08-13",2,0,"HURGADA",90,null,{"$f":"IFERROR(VALUE(IF(ISERROR(MATCH(A188,Sources!$B:$B,0)),IF(ISERROR(MATCH(F188,Sources!$C:$C,0)),\"\",5*D188+3*E188),IF(AND(NOT(ISERROR(MATCH(A188,Sources!$D:$D,0))),NOT(ISERROR(MATCH(F188,Sources!$E:$E,0)))),5*D188+3*E188,\"\"))&IF(AND(ISERROR(MATCH(A188,Sources!$F:$F,0)),NOT(ISERROR(MATCH(F188,Sources!$G:$G,0)))),5*D188+3*E188,\"\")),\"\")","v":""},90]
["ASPENDOS TURKISH BATH","Aspendos Turkish Bath","2018-08-13",2,0,"HURGADA",70,null,{"$f":"IFERROR(VALUE(IF(ISERROR(MATCH(A189,Sources!$B:$B,0)),IF(ISERROR(MATCH(F189,Sources!$C:$C,0)),\"\",5*D189+3*E189),IF(AND(NOT(ISERROR(MATCH(A189,Sources!$D:$D,0))),NOT(ISERROR(MATCH(F189,Sources!$E:$E,0)))),5*D189+3*E189,\"\"))&IF(AND(ISERROR(MATCH(A189,Sources!$F:$F,0)),NOT(ISERROR(MATCH(F189,Sources!$G:$G,0)))),5*D189+3*E189,\"\")),\"\")","v":""},70]
["ASPENDOS TURKISH BATH","Aspendos Turkish Bath","2018-08-13",2,0,"HURGADA",70,null,{"$f":"IFERROR(VALUE(IF(ISERROR(MATCH(A190,Sources!$B:$B,0)),IF(ISERROR(MATCH(F190,Sources!$C:$C,0)),\"\",5*D190+3*E190),IF(AND(NOT(ISERROR(MATCH(A190,Sources!$D:$D,0))),NOT(ISERROR(MATCH(F190,Sources!$E:$E,0)))),5*D190+3*E190,\"\"))&IF(AND(ISERROR(MATCH(A190,Sources!$F:$F,0)),NOT(ISERROR(MATCH(F190,Sources!$G:$G,0)))),5*D190+3*E190,\"\")),\"\")","v":""},70]
["UTOPIA ISLAND",{"$f":"IFERROR(VLOOKUP(A191,Sheet2!$B$2:$C$18,2,0),\"\")","v":"Utopia"},"2018-08-14",2,0,"HURGADA",110,null,{"$f":"IFERROR(VALUE(IF(ISERROR(MATCH(A191,Sources!$B:$B,0)),IF(ISERROR(MATCH(F191,Sources!$C:$C,0)),\"\",5*D191+3*E191),IF(AND(NOT(ISERROR(MATCH(A191,Sources!$D:$D,0))),NOT(ISERROR(MATCH(F191,Sources!$E:$E,0)))),5*D191+3*E191,\"\"))&IF(AND(ISERROR(MATCH(A191,Sources!$F:$F,0)),NOT(ISERROR(MATCH(F191,Sources!$G:$G,0)))),5*D191+3*E191,\"\")),\"\")","v":""},110]
["GRAND AQUARIUM",{"$f":"IFERROR(VLOOKUP(A192,Sheet2!$B$2:$C$18,2,0),\"\")","v":"Grand Aquarium"},"2018-08-14",2,0,"HURGADA",80,null,{"$f":"IFERROR(VALUE(IF(ISERROR(MATCH(A192,Sources!$B:$B,0)),IF(ISERROR(MATCH(F192,Sources!$C:$C,0)),\"\",5*D192+3*E192),IF(AND(NOT(ISERROR(MATCH(A192,Sources!$D:$D,0))),NOT(ISERROR(MATCH(F192,Sources!$E:$E,0)))),5*D192+3*E192,\"\"))&IF(AND(ISERROR(MATCH(A192,Sources!$F:$F,0)),NOT(ISERROR(MATCH(F192,Sources!$G:$G,0)))),5*D192+3*E192,\"\")),\"\")","v":""},80]
["UTOPIA ISLAND",{"$f":"IFERROR(VLOOKUP(A193,Sheet2!$B$2:$C$18,2,0),\"\")","v":"Utopia"},"2018-08-14",3,0,"HURGADA",165,null,{"$f":"IFERROR(VALUE(IF(ISERROR(MATCH(A193,Sources!$B:$B,0)),IF(ISERROR(MATCH(F193,Sources!$C:$C,0)),\"\",5*D193+3*E193),IF(AND(NOT(ISERROR(MATCH(A193,Sources!$D:$D,0))),NOT(ISERROR(MATCH(F193,Sources!$E:$E,0)))),5*D193+3*E193,\"\"))&IF(AND(ISERROR(MATCH(A193,Sources!$F:$F,0)),NOT(ISERROR(MATCH(F193,Sources!$G:$G,0)))),5*D193+3*E193,\"\")),\"\")","v":""},165]
["UTOPIA ISLAND",{"$f":"IFERROR(VLOOKUP(A194,Sheet2!$B$2:$C$18,2,0),\"\")","v":"Utopia"},"2018-08-14",2,0,"HURGADA",110,null,{"$f":"IFERROR(VALUE(IF(ISERROR(MATCH(A194,Sources!$B:$B,0)),IF(ISERROR(MATCH(F194,Sources!$C:$C,0)),\"\",5*D194+3*E194),IF(AND(NOT(ISERROR(MATCH(A194,Sources!$D:$D,0))),NOT(ISERROR(MATCH(F194,Sources!$E:$E,0)))),5*D194+3*E194,\"\"))&IF(AND(ISERROR(MATCH(A194,Sources!$F:$F,0)),NOT(ISERROR(MATCH(F194,Sources!$G:$G,0)))),5*D194+3*E194,\"\")),\"\")","v":""},110]
["UTOPIA ISLAND",{"$f":"IFERROR(VLOOKUP(A195,Sheet2!$B$2:$C$18,2,0),\"\")","v":"Utopia"},"2018-08-14",2,0,"HURGADA",110,null,{"$f":"IFERROR(VALUE(IF(ISERROR(MATCH(A195,Sources!$B:$B,0)),IF(ISERROR(MATCH(F195,Sources!$C:$C,0)),\"\",5*D195+3*E195),IF(AND(NOT(ISERROR(MATCH(A195,Sources!$D:$D,0))),NOT(ISERROR(MATCH(F195,Sources!$E:$E,0)))),5*D195+3*E195,\"\"))&IF(AND(ISERROR(MATCH(A195,Sources!$F:$F,0)),NOT(ISERROR(MATCH(F195,Sources!$G:$G,0)))),5*D195+3*E195,\"\")),\"\")","v":""},{"$f":"IF(I195=\"\",G195,(G195-I195))","v":110}]
["MOTO2",{"$f":"IFERROR(VLOOKUP(A196,Sheet2!$B$2:$C$18,2,0),\"\")","v":"Moto 2"},"2018-08-14",1,0,"MAKADI BAY",50,null,{"$f":"IFERROR(VALUE(IF(ISERROR(MATCH(A196,Sources!$B:$B,0)),IF(ISERROR(MATCH(F196,Sources!$C:$C,0)),\"\",5*D196+3*E196),IF(AND(NOT(ISERROR(MATCH(A196,Sources!$D:$D,0))),NOT(ISERROR(MATCH(F196,Sources!$E:$E,0)))),5*D196+3*E196,\"\"))&IF(AND(ISERROR(MATCH(A196,Sources!$F:$F,0)),NOT(ISERROR(MATCH(F196,Sources!$G:$G,0)))),5*D196+3*E196,\"\")),\"\")","v":5},45]
["UTOPIA ISLAND",{"$f":"IFERROR(VLOOKUP(A197,Sheet2!$B$2:$C$18,2,0),\"\")","v":"Utopia"},"2018-08-14",1,0,"MAKADI BAY",55,null,{"$f":"IFERROR(VALUE(IF(ISERROR(MATCH(A197,Sources!$B:$B,0)),IF(ISERROR(MATCH(F197,Sources!$C:$C,0)),\"\",5*D197+3*E197),IF(AND(NOT(ISERROR(MATCH(A197,Sources!$D:$D,0))),NOT(ISERROR(MATCH(F197,Sources!$E:$E,0)))),5*D197+3*E197,\"\"))&IF(AND(ISERROR(MATCH(A197,Sources!$F:$F,0)),NOT(ISERROR(MATCH(F197,Sources!$G:$G,0)))),5*D197+3*E197,\"\")),\"\")","v":""},55]
["GRAND AQUARIUM",{"$f":"IFERROR(VLOOKUP(A198,Sheet2!$B$2:$C$18,2,0),\"\")","v":"Grand Aquarium"},"2018-08-14",2,0,"SAHL HASHEESH",80,null,{"$f":"IFERROR(VALUE(IF(ISERROR(MATCH(A198,Sources!$B:$B,0)),IF(ISERROR(MATCH(F198,Sources!$C:$C,0)),\"\",5*D198+3*E198),IF(AND(NOT(ISERROR(MATCH(A198,Sources!$D:$D,0))),NOT(ISERROR(MATCH(F198,Sources!$E:$E,0)))),5*D198+3*E198,\"\"))&IF(AND(ISERROR(MATCH(A198,Sources!$F:$F,0)),NOT(ISERROR(MATCH(F198,Sources!$G:$G,0)))),5*D198+3*E198,\"\")),\"\")","v":""},80]
["INTRO DIVING",{"$f":"IFERROR(VLOOKUP(A199,Sheet2!$B$2:$C$18,2,0),\"\")","v":"Diving"},"2018-08-14",2,0,"SAHL HASHEESH",130,null,{"$f":"IFERROR(VALUE(IF(ISERROR(MATCH(A199,Sources!$B:$B,0)),IF(ISERROR(MATCH(F199,Sources!$C:$C,0)),\"\",5*D199+3*E199),IF(AND(NOT(ISERROR(MATCH(A199,Sources!$D:$D,0))),NOT(ISERROR(MATCH(F199,Sources!$E:$E,0)))),5*D199+3*E199,\"\"))&IF(AND(ISERROR(MATCH(A199,Sources!$F:$F,0)),NOT(ISERROR(MATCH(F199,Sources!$G:$G,0)))),5*D199+3*E199,\"\")),\"\")","v":""},130]
["GRAND AQUARIUM",{"$f":"IFERROR(VLOOKUP(A200,Sheet2!$B$2:$C$18,2,0),\"\")","v":"Grand Aquarium"},"2018-08-14",2,0,"HURGADA",80,null,{"$f":"IFERROR(VALUE(IF(ISERROR(MATCH(A200,Sources!$B:$B,0)),IF(ISERROR(MATCH(F200,Sources!$C:$C,0)),\"\",5*D200+3*E200),IF(AND(NOT(ISERROR(MATCH(A200,Sources!$D:$D,0))),NOT(ISERROR(MATCH(F200,Sources!$E:$E,0)))),5*D200+3*E200,\"\"))&IF(AND(ISERROR(MATCH(A200,Sources!$F:$F,0)),NOT(ISERROR(MATCH(F200,Sources!$G:$G,0)))),5*D200+3*E200,\"\")),\"\")","v":""},80]
["UTOPIA ISLAND",{"$f":"IFERROR(VLOOKUP(A201,Sheet2!$B$2:$C$18,2,0),\"\")","v":"Utopia"},"2018-08-14",2,0,"HURGADA",110,null,{"$f":"IFERROR(VALUE(IF(ISERROR(MATCH(A201,Sources!$B:$B,0)),IF(ISERROR(MATCH(F201,Sources!$C:$C,0)),\"\",5*D201+3*E201),IF(AND(NOT(ISERROR(MATCH(A201,Sources!$D:$D,0))),NOT(ISERROR(MATCH(F201,Sources!$E:$E,0)))),5*D201+3*E201,\"\"))&IF(AND(ISERROR(MATCH(A201,Sources!$F:$F,0)),NOT(ISERROR(MATCH(F201,Sources!$G:$G,0)))),5*D201+3*E201,\"\")),\"\")","v":""},110]
["OVER DAY LUXORQUEEN VALLY",{"$f":"IFERROR(VLOOKUP(A202,Sheet2!$B$2:$C$18,2,0),\"\")","v":"LUXOR 2"},"2018-08-14",2,0,"HURGADA",180,"belarus",{"$f":"IFERROR(VALUE(IF(ISERROR(MATCH(A202,Sources!$B:$B,0)),IF(ISERROR(MATCH(F202,Sources!$C:$C,0)),\"\",5*D202+3*E202),IF(AND(NOT(ISERROR(MATCH(A202,Sources!$D:$D,0))),NOT(ISERROR(MATCH(F202,Sources!$E:$E,0)))),5*D202+3*E202,\"\"))&IF(AND(ISERROR(MATCH(A202,Sources!$F:$F,0)),NOT(ISERROR(MATCH(F202,Sources!$G:$G,0)))),5*D202+3*E202,\"\")),\"\")","v":""},180]
["UTOPIA ISLAND",{"$f":"IFERROR(VLOOKUP(A203,Sheet2!$B$2:$C$18,2,0),\"\")","v":"Utopia"},"2018-08-14",2,0,"HURGADA",110,null,{"$f":"IFERROR(VALUE(IF(ISERROR(MATCH(A203,Sources!$B:$B,0)),IF(ISERROR(MATCH(F203,Sources!$C:$C,0)),\"\",5*D203+3*E203),IF(AND(NOT(ISERROR(MATCH(A203,Sources!$D:$D,0))),NOT(ISERROR(MATCH(F203,Sources!$E:$E,0)))),5*D203+3*E203,\"\"))&IF(AND(ISERROR(MATCH(A203,Sources!$F:$F,0)),NOT(ISERROR(MATCH(F203,Sources!$G:$G,0)))),5*D203+3*E203,\"\")),\"\")","v":""},110]
["UTOPIA ISLAND",{"$f":"IFERROR(VLOOKUP(A204,Sheet2!$B$2:$C$18,2,0),\"\")","v":"Utopia"},"2018-08-14",2,0,"HURGADA",110,null,{"$f":"IFERROR(VALUE(IF(ISERROR(MATCH(A204,Sources!$B:$B,0)),IF(ISERROR(MATCH(F204,Sources!$C:$C,0)),\"\",5*D204+3*E204),IF(AND(NOT(ISERROR(MATCH(A204,Sources!$D:$D,0))),NOT(ISERROR(MATCH(F204,Sources!$E:$E,0)))),5*D204+3*E204,\"\"))&IF(AND(ISERROR(MATCH(A204,Sources!$F:$F,0)),NOT(ISERROR(MATCH(F204,Sources!$G:$G,0)))),5*D204+3*E204,\"\")),\"\")","v":""},110]
["UTOPIA ISLAND",{"$f":"IFERROR(VLOOKUP(A205,Sheet2!$B$2:$C$18,2,0),\"\")","v":"Utopia"},"2018-08-14",2,0,"MAKADI BAY",110,null,{"$f":"IFERROR(VALUE(IF(ISERROR(MATCH(A205,Sources!$B:$B,0)),IF(ISERROR(MATCH(F205,Sources!$C:$C,0)),\"\",5*D205+3*E205),IF(AND(NOT(ISERROR(MATCH(A205,Sources!$D:$D,0))),NOT(ISERROR(MATCH(F205,Sources!$E:$E,0)))),5*D205+3*E205,\"\"))&IF(AND(ISERROR(MATCH(A205,Sources!$F:$F,0)),NOT(ISERROR(MATCH(F205,Sources!$G:$G,0)))),5*D205+3*E205,\"\")),\"\")","v":""},110]
["UTOPIA ISLAND",{"$f":"IFERROR(VLOOKUP(A206,Sheet2!$B$2:$C$18,2,0),\"\")","v":"Utopia"},"2018-08-14",2,0,"MAKADI BAY",110,null,{"$f":"IFERROR(VALUE(IF(ISERROR(MATCH(A206,Sources!$B:$B,0)),IF(ISERROR(MATCH(F206,Sources!$C:$C,0)),\"\",5*D206+3*E206),IF(AND(NOT(ISERROR(MATCH(A206,Sources!$D:$D,0))),NOT(ISERROR(MATCH(F206,Sources!$E:$E,0)))),5*D206+3*E206,\"\"))&IF(AND(ISERROR(MATCH(A206,Sources!$F:$F,0)),NOT(ISERROR(MATCH(F206,Sources!$G:$G,0)))),5*D206+3*E206,\"\")),\"\")","v":""},110]
["UTOPIA ISLAND",{"$f":"IFERROR(VLOOKUP(A207,Sheet2!$B$2:$C$18,2,0),\"\")","v":"Utopia"},"2018-08-14",2,1,"MAKADI BAY",138,null,{"$f":"IFERROR(VALUE(IF(ISERROR(MATCH(A207,Sources!$B:$B,0)),IF(ISERROR(MATCH(F207,Sources!$C:$C,0)),\"\",5*D207+3*E207),IF(AND(NOT(ISERROR(MATCH(A207,Sources!$D:$D,0))),NOT(ISERROR(MATCH(F207,Sources!$E:$E,0)))),5*D207+3*E207,\"\"))&IF(AND(ISERROR(MATCH(A207,Sources!$F:$F,0)),NOT(ISERROR(MATCH(F207,Sources!$G:$G,0)))),5*D207+3*E207,\"\")),\"\")","v":""},138]
["RUSALKA  ( MERMAID )",{"$f":"IFERROR(VLOOKUP(A208,Sheet2!$B$2:$C$18,2,0),\"\")","v":"Rusalka (Mermaid)"},"2018-08-14",2,0,"HURGADA",80,null,{"$f":"IFERROR(VALUE(IF(ISERROR(MATCH(A208,Sources!$B:$B,0)),IF(ISERROR(MATCH(F208,Sources!$C:$C,0)),\"\",5*D208+3*E208),IF(AND(NOT(ISERROR(MATCH(A208,Sources!$D:$D,0))),NOT(ISERROR(MATCH(F208,Sources!$E:$E,0)))),5*D208+3*E208,\"\"))&IF(AND(ISERROR(MATCH(A208,Sources!$F:$F,0)),NOT(ISERROR(MATCH(F208,Sources!$G:$G,0)))),5*D208+3*E208,\"\")),\"\")","v":""},80]
["OVER DAY LUXORQUEEN VALLY",{"$f":"IFERROR(VLOOKUP(A209,Sheet2!$B$2:$C$18,2,0),\"\")","v":"LUXOR 2"},"2018-08-14",2,0,"HURGADA",180,"belarus",{"$f":"IFERROR(VALUE(IF(ISERROR(MATCH(A209,Sources!$B:$B,0)),IF(ISERROR(MATCH(F209,Sources!$C:$C,0)),\"\",5*D209+3*E209),IF(AND(NOT(ISERROR(MATCH(A209,Sources!$D:$D,0))),NOT(ISERROR(MATCH(F209,Sources!$E:$E,0)))),5*D209+3*E209,\"\"))&IF(AND(ISERROR(MATCH(A209,Sources!$F:$F,0)),NOT(ISERROR(MATCH(F209,Sources!$G:$G,0)))),5*D209+3*E209,\"\")),\"\")","v":""},180]
["OVER DAY LUXORQUEEN VALLY",{"$f":"IFERROR(VLOOKUP(A210,Sheet2!$B$2:$C$18,2,0),\"\")","v":"LUXOR 2"},"2018-08-14",2,0,"HURGADA",180,null,{"$f":"IFERROR(VALUE(IF(ISERROR(MATCH(A210,Sources!$B:$B,0)),IF(ISERROR(MATCH(F210,Sources!$C:$C,0)),\"\",5*D210+3*E210),IF(AND(NOT(ISERROR(MATCH(A210,Sources!$D:$D,0))),NOT(ISERROR(MATCH(F210,Sources!$E:$E,0)))),5*D210+3*E210,\"\"))&IF(AND(ISERROR(MATCH(A210,Sources!$F:$F,0)),NOT(ISERROR(MATCH(F210,Sources!$G:$G,0)))),5*D210+3*E210,\"\")),\"\")","v":""},180]
["OVER DAY LUXORQUEEN VALLY",{"$f":"IFERROR(VLOOKUP(A211,Sheet2!$B$2:$C$18,2,0),\"\")","v":"LUXOR 2"},"2018-08-14",2,0,"HURGADA",180,"ukraine",{"$f":"IFERROR(VALUE(IF(ISERROR(MATCH(A211,Sources!$B:$B,0)),IF(ISERROR(MATCH(F211,Sources!$C:$C,0)),\"\",5*D211+3*E211),IF(AND(NOT(ISERROR(MATCH(A211,Sources!$D:$D,0))),NOT(ISERROR(MATCH(F211,Sources!$E:$E,0)))),5*D211+3*E211,\"\"))&IF(AND(ISERROR(MATCH(A211,Sources!$F:$F,0)),NOT(ISERROR(MATCH(F211,Sources!$G:$G,0)))),5*D211+3*E211,\"\")),\"\")","v":""},180]
["OVER DAY LUXORQUEEN VALLY",{"$f":"IFERROR(VLOOKUP(A212,Sheet2!$B$2:$C$18,2,0),\"\")","v":"LUXOR 2"},"2018-08-14",2,0,"HURGADA",180,"belarus",{"$f":"IFERROR(VALUE(IF(ISERROR(MATCH(A212,Sources!$B:$B,0)),IF(ISERROR(MATCH(F212,Sources!$C:$C,0)),\"\",5*D212+3*E212),IF(AND(NOT(ISERROR(MATCH(A212,Sources!$D:$D,0))),NOT(ISERROR(MATCH(F212,Sources!$E:$E,0)))),5*D212+3*E212,\"\"))&IF(AND(ISERROR(MATCH(A212,Sources!$F:$F,0)),NOT(ISERROR(MATCH(F212,Sources!$G:$G,0)))),5*D212+3*E212,\"\")),\"\")","v":""},180]
["OVER DAY LUXORQUEEN VALLY",{"$f":"IFERROR(VLOOKUP(A213,Sheet2!$B$2:$C$18,2,0),\"\")","v":"LUXOR 2"},"2018-08-14",2,0,"HURGADA",180,"ukraine",{"$f":"IFERROR(VALUE(IF(ISERROR(MATCH(A213,Sources!$B:$B,0)),IF(ISERROR(MATCH(F213,Sources!$C:$C,0)),\"\",5*D213+3*E213),IF(AND(NOT(ISERROR(MATCH(A213,Sources!$D:$D,0))),NOT(ISERROR(MATCH(F213,Sources!$E:$E,0)))),5*D213+3*E213,\"\"))&IF(AND(ISERROR(MATCH(A213,Sources!$F:$F,0)),NOT(ISERROR(MATCH(F213,Sources!$G:$G,0)))),5*D213+3*E213,\"\")),\"\")","v":""},180]
["OVER DAY LUXORQUEEN VALLY",{"$f":"IFERROR(VLOOKUP(A214,Sheet2!$B$2:$C$18,2,0),\"\")","v":"LUXOR 2"},"2018-08-14",1,1,"HURGADA",135,"ukraine",{"$f":"IFERROR(VALUE(IF(ISERROR(MATCH(A214,Sources!$B:$B,0)),IF(ISERROR(MATCH(F214,Sources!$C:$C,0)),\"\",5*D214+3*E214),IF(AND(NOT(ISERROR(MATCH(A214,Sources!$D:$D,0))),NOT(ISERROR(MATCH(F214,Sources!$E:$E,0)))),5*D214+3*E214,\"\"))&IF(AND(ISERROR(MATCH(A214,Sources!$F:$F,0)),NOT(ISERROR(MATCH(F214,Sources!$G:$G,0)))),5*D214+3*E214,\"\")),\"\")","v":""},135]
["MOTO2",{"$f":"IFERROR(VLOOKUP(A215,Sheet2!$B$2:$C$18,2,0),\"\")","v":"Moto 2"},"2018-08-14",1,0,"HURGADA",45,null,{"$f":"IFERROR(VALUE(IF(ISERROR(MATCH(A215,Sources!$B:$B,0)),IF(ISERROR(MATCH(F215,Sources!$C:$C,0)),\"\",5*D215+3*E215),IF(AND(NOT(ISERROR(MATCH(A215,Sources!$D:$D,0))),NOT(ISERROR(MATCH(F215,Sources!$E:$E,0)))),5*D215+3*E215,\"\"))&IF(AND(ISERROR(MATCH(A215,Sources!$F:$F,0)),NOT(ISERROR(MATCH(F215,Sources!$G:$G,0)))),5*D215+3*E215,\"\")),\"\")","v":""},45]
["MOTO2",{"$f":"IFERROR(VLOOKUP(A216,Sheet2!$B$2:$C$18,2,0),\"\")","v":"Moto 2"},"2018-08-14",1,0,"HURGADA",45,null,{"$f":"IFERROR(VALUE(IF(ISERROR(MATCH(A216,Sources!$B:$B,0)),IF(ISERROR(MATCH(F216,Sources!$C:$C,0)),\"\",5*D216+3*E216),IF(AND(NOT(ISERROR(MATCH(A216,Sources!$D:$D,0))),NOT(ISERROR(MATCH(F216,Sources!$E:$E,0)))),5*D216+3*E216,\"\"))&IF(AND(ISERROR(MATCH(A216,Sources!$F:$F,0)),NOT(ISERROR(MATCH(F216,Sources!$G:$G,0)))),5*D216+3*E216,\"\")),\"\")","v":""},45]
["OVER DAY LUXORQUEEN VALLY",{"$f":"IFERROR(VLOOKUP(A217,Sheet2!$B$2:$C$18,2,0),\"\")","v":"LUXOR 2"},"2018-08-14",2,0,"HURGADA",180,null,{"$f":"IFERROR(VALUE(IF(ISERROR(MATCH(A217,Sources!$B:$B,0)),IF(ISERROR(MATCH(F217,Sources!$C:$C,0)),\"\",5*D217+3*E217),IF(AND(NOT(ISERROR(MATCH(A217,Sources!$D:$D,0))),NOT(ISERROR(MATCH(F217,Sources!$E:$E,0)))),5*D217+3*E217,\"\"))&IF(AND(ISERROR(MATCH(A217,Sources!$F:$F,0)),NOT(ISERROR(MATCH(F217,Sources!$G:$G,0)))),5*D217+3*E217,\"\")),\"\")","v":""},180]
["MOTO2",{"$f":"IFERROR(VLOOKUP(A218,Sheet2!$B$2:$C$18,2,0),\"\")","v":"Moto 2"},"2018-08-14",2,0,"SAFAGA",100,null,{"$f":"IFERROR(VALUE(IF(ISERROR(MATCH(A218,Sources!$B:$B,0)),IF(ISERROR(MATCH(F218,Sources!$C:$C,0)),\"\",5*D218+3*E218),IF(AND(NOT(ISERROR(MATCH(A218,Sources!$D:$D,0))),NOT(ISERROR(MATCH(F218,Sources!$E:$E,0)))),5*D218+3*E218,\"\"))&IF(AND(ISERROR(MATCH(A218,Sources!$F:$F,0)),NOT(ISERROR(MATCH(F218,Sources!$G:$G,0)))),5*D218+3*E218,\"\")),\"\")","v":10},90]
["OVER DAY LUXORQUEEN VALLY",{"$f":"IFERROR(VLOOKUP(A219,Sheet2!$B$2:$C$18,2,0),\"\")","v":"LUXOR 2"},"2018-08-14",1,0,"MAKADI BAY",90,null,{"$f":"IFERROR(VALUE(IF(ISERROR(MATCH(A219,Sources!$B:$B,0)),IF(ISERROR(MATCH(F219,Sources!$C:$C,0)),\"\",5*D219+3*E219),IF(AND(NOT(ISERROR(MATCH(A219,Sources!$D:$D,0))),NOT(ISERROR(MATCH(F219,Sources!$E:$E,0)))),5*D219+3*E219,\"\"))&IF(AND(ISERROR(MATCH(A219,Sources!$F:$F,0)),NOT(ISERROR(MATCH(F219,Sources!$G:$G,0)))),5*D219+3*E219,\"\")),\"\")","v":""},90]
["UTOPIA ISLAND",{"$f":"IFERROR(VLOOKUP(A220,Sheet2!$B$2:$C$18,2,0),\"\")","v":"Utopia"},"2018-08-14",3,0,"MAKADI BAY",165,null,{"$f":"IFERROR(VALUE(IF(ISERROR(MATCH(A220,Sources!$B:$B,0)),IF(ISERROR(MATCH(F220,Sources!$C:$C,0)),\"\",5*D220+3*E220),IF(AND(NOT(ISERROR(MATCH(A220,Sources!$D:$D,0))),NOT(ISERROR(MATCH(F220,Sources!$E:$E,0)))),5*D220+3*E220,\"\"))&IF(AND(ISERROR(MATCH(A220,Sources!$F:$F,0)),NOT(ISERROR(MATCH(F220,Sources!$G:$G,0)))),5*D220+3*E220,\"\")),\"\")","v":""},165]
["JUNGLE AQUAPARK",{"$f":"IFERROR(VLOOKUP(A221,Sheet2!$B$2:$C$18,2,0),\"\")","v":"Jungle Aqua Park"},"2018-08-15",2,0,"SAHL HASHEESH",90,"WITHOUT TRANSFER",{"$f":"IFERROR(VALUE(IF(ISERROR(MATCH(A221,Sources!$B:$B,0)),IF(ISERROR(MATCH(F221,Sources!$C:$C,0)),\"\",5*D221+3*E221),IF(AND(NOT(ISERROR(MATCH(A221,Sources!$D:$D,0))),NOT(ISERROR(MATCH(F221,Sources!$E:$E,0)))),5*D221+3*E221,\"\"))&IF(AND(ISERROR(MATCH(A221,Sources!$F:$F,0)),NOT(ISERROR(MATCH(F221,Sources!$G:$G,0)))),5*D221+3*E221,\"\")),\"\")","v":""},90]
["SEA TRIP",{"$f":"IFERROR(VLOOKUP(A222,Sheet2!$B$2:$C$18,2,0),\"\")","v":"Sea Trip"},"2018-08-15",2,0,"HURGADA",80,null,{"$f":"IFERROR(VALUE(IF(ISERROR(MATCH(A222,Sources!$B:$B,0)),IF(ISERROR(MATCH(F222,Sources!$C:$C,0)),\"\",5*D222+3*E222),IF(AND(NOT(ISERROR(MATCH(A222,Sources!$D:$D,0))),NOT(ISERROR(MATCH(F222,Sources!$E:$E,0)))),5*D222+3*E222,\"\"))&IF(AND(ISERROR(MATCH(A222,Sources!$F:$F,0)),NOT(ISERROR(MATCH(F222,Sources!$G:$G,0)))),5*D222+3*E222,\"\")),\"\")","v":""},80]
["SEA TRIP",{"$f":"IFERROR(VLOOKUP(A223,Sheet2!$B$2:$C$18,2,0),\"\")","v":"Sea Trip"},"2018-08-15",3,0,"HURGADA",120,null,{"$f":"IFERROR(VALUE(IF(ISERROR(MATCH(A223,Sources!$B:$B,0)),IF(ISERROR(MATCH(F223,Sources!$C:$C,0)),\"\",5*D223+3*E223),IF(AND(NOT(ISERROR(MATCH(A223,Sources!$D:$D,0))),NOT(ISERROR(MATCH(F223,Sources!$E:$E,0)))),5*D223+3*E223,\"\"))&IF(AND(ISERROR(MATCH(A223,Sources!$F:$F,0)),NOT(ISERROR(MATCH(F223,Sources!$G:$G,0)))),5*D223+3*E223,\"\")),\"\")","v":""},120]
["UTOPIA ISLAND",{"$f":"IFERROR(VLOOKUP(A224,Sheet2!$B$2:$C$18,2,0),\"\")","v":"Utopia"},"2018-08-16",1,2,"HURGADA",111,null,{"$f":"IFERROR(VALUE(IF(ISERROR(MATCH(A224,Sources!$B:$B,0)),IF(ISERROR(MATCH(F224,Sources!$C:$C,0)),\"\",5*D224+3*E224),IF(AND(NOT(ISERROR(MATCH(A224,Sources!$D:$D,0))),NOT(ISERROR(MATCH(F224,Sources!$E:$E,0)))),5*D224+3*E224,\"\"))&IF(AND(ISERROR(MATCH(A224,Sources!$F:$F,0)),NOT(ISERROR(MATCH(F224,Sources!$G:$G,0)))),5*D224+3*E224,\"\")),\"\")","v":""},111]
["UTOPIA ISLAND",{"$f":"IFERROR(VLOOKUP(A225,Sheet2!$B$2:$C$18,2,0),\"\")","v":"Utopia"},"2018-08-16",1,0,"HURGADA",55,null,{"$f":"IFERROR(VALUE(IF(ISERROR(MATCH(A225,Sources!$B:$B,0)),IF(ISERROR(MATCH(F225,Sources!$C:$C,0)),\"\",5*D225+3*E225),IF(AND(NOT(ISERROR(MATCH(A225,Sources!$D:$D,0))),NOT(ISERROR(MATCH(F225,Sources!$E:$E,0)))),5*D225+3*E225,\"\"))&IF(AND(ISERROR(MATCH(A225,Sources!$F:$F,0)),NOT(ISERROR(MATCH(F225,Sources!$G:$G,0)))),5*D225+3*E225,\"\")),\"\")","v":""},55]
["UTOPIA ISLAND",{"$f":"IFERROR(VLOOKUP(A226,Sheet2!$B$2:$C$18,2,0),\"\")","v":"Utopia"},"2018-08-16",1,1,"HURGADA",83,null,{"$f":"IFERROR(VALUE(IF(ISERROR(MATCH(A226,Sources!$B:$B,0)),IF(ISERROR(MATCH(F226,Sources!$C:$C,0)),\"\",5*D226+3*E226),IF(AND(NOT(ISERROR(MATCH(A226,Sources!$D:$D,0))),NOT(ISERROR(MATCH(F226,Sources!$E:$E,0)))),5*D226+3*E226,\"\"))&IF(AND(ISERROR(MATCH(A226,Sources!$F:$F,0)),NOT(ISERROR(MATCH(F226,Sources!$G:$G,0)))),5*D226+3*E226,\"\")),\"\")","v":""},83]
["UTOPIA ISLAND",{"$f":"IFERROR(VLOOKUP(A227,Sheet2!$B$2:$C$18,2,0),\"\")","v":"Utopia"},"2018-08-16",2,0,"HURGADA",110,null,{"$f":"IFERROR(VALUE(IF(ISERROR(MATCH(A227,Sources!$B:$B,0)),IF(ISERROR(MATCH(F227,Sources!$C:$C,0)),\"\",5*D227+3*E227),IF(AND(NOT(ISERROR(MATCH(A227,Sources!$D:$D,0))),NOT(ISERROR(MATCH(F227,Sources!$E:$E,0)))),5*D227+3*E227,\"\"))&IF(AND(ISERROR(MATCH(A227,Sources!$F:$F,0)),NOT(ISERROR(MATCH(F227,Sources!$G:$G,0)))),5*D227+3*E227,\"\")),\"\")","v":""},110]
["UTOPIA ISLAND",{"$f":"IFERROR(VLOOKUP(A228,Sheet2!$B$2:$C$18,2,0),\"\")","v":"Utopia"},"2018-08-16",2,0,"HURGADA",110,null,{"$f":"IFERROR(VALUE(IF(ISERROR(MATCH(A228,Sources!$B:$B,0)),IF(ISERROR(MATCH(F228,Sources!$C:$C,0)),\"\",5*D228+3*E228),IF(AND(NOT(ISERROR(MATCH(A228,Sources!$D:$D,0))),NOT(ISERROR(MATCH(F228,Sources!$E:$E,0)))),5*D228+3*E228,\"\"))&IF(AND(ISERROR(MATCH(A228,Sources!$F:$F,0)),NOT(ISERROR(MATCH(F228,Sources!$G:$G,0)))),5*D228+3*E228,\"\")),\"\")","v":""},110]
["UTOPIA ISLAND",{"$f":"IFERROR(VLOOKUP(A229,Sheet2!$B$2:$C$18,2,0),\"\")","v":"Utopia"},"2018-08-16",2,0,"HURGADA",110,null,{"$f":"IFERROR(VALUE(IF(ISERROR(MATCH(A229,Sources!$B:$B,0)),IF(ISERROR(MATCH(F229,Sources!$C:$C,0)),\"\",5*D229+3*E229),IF(AND(NOT(ISERROR(MATCH(A229,Sources!$D:$D,0))),NOT(ISERROR(MATCH(F229,Sources!$E:$E,0)))),5*D229+3*E229,\"\"))&IF(AND(ISERROR(MATCH(A229,Sources!$F:$F,0)),NOT(ISERROR(MATCH(F229,Sources!$G:$G,0)))),5*D229+3*E229,\"\")),\"\")","v":""},110]
["UTOPIA ISLAND",{"$f":"IFERROR(VLOOKUP(A230,Sheet2!$B$2:$C$18,2,0),\"\")","v":"Utopia"},"2018-08-16",1,0,"HURGADA",55,null,{"$f":"IFERROR(VALUE(IF(ISERROR(MATCH(A230,Sources!$B:$B,0)),IF(ISERROR(MATCH(F230,Sources!$C:$C,0)),\"\",5*D230+3*E230),IF(AND(NOT(ISERROR(MATCH(A230,Sources!$D:$D,0))),NOT(ISERROR(MATCH(F230,Sources!$E:$E,0)))),5*D230+3*E230,\"\"))&IF(AND(ISERROR(MATCH(A230,Sources!$F:$F,0)),NOT(ISERROR(MATCH(F230,Sources!$G:$G,0)))),5*D230+3*E230,\"\")),\"\")","v":""},55]
["UTOPIA ISLAND",{"$f":"IFERROR(VLOOKUP(A231,Sheet2!$B$2:$C$18,2,0),\"\")","v":"Utopia"},"2018-08-16",2,0,"HURGADA",110,null,{"$f":"IFERROR(VALUE(IF(ISERROR(MATCH(A231,Sources!$B:$B,0)),IF(ISERROR(MATCH(F231,Sources!$C:$C,0)),\"\",5*D231+3*E231),IF(AND(NOT(ISERROR(MATCH(A231,Sources!$D:$D,0))),NOT(ISERROR(MATCH(F231,Sources!$E:$E,0)))),5*D231+3*E231,\"\"))&IF(AND(ISERROR(MATCH(A231,Sources!$F:$F,0)),NOT(ISERROR(MATCH(F231,Sources!$G:$G,0)))),5*D231+3*E231,\"\")),\"\")","v":""},110]
["UTOPIA ISLAND",{"$f":"IFERROR(VLOOKUP(A232,Sheet2!$B$2:$C$18,2,0),\"\")","v":"Utopia"},"2018-08-16",2,0,"HURGADA",110,null,{"$f":"IFERROR(VALUE(IF(ISERROR(MATCH(A232,Sources!$B:$B,0)),IF(ISERROR(MATCH(F232,Sources!$C:$C,0)),\"\",5*D232+3*E232),IF(AND(NOT(ISERROR(MATCH(A232,Sources!$D:$D,0))),NOT(ISERROR(MATCH(F232,Sources!$E:$E,0)))),5*D232+3*E232,\"\"))&IF(AND(ISERROR(MATCH(A232,Sources!$F:$F,0)),NOT(ISERROR(MATCH(F232,Sources!$G:$G,0)))),5*D232+3*E232,\"\")),\"\")","v":""},110]
["UTOPIA ISLAND",{"$f":"IFERROR(VLOOKUP(A233,Sheet2!$B$2:$C$18,2,0),\"\")","v":"Utopia"},"2018-08-16",2,0,"HURGADA",110,null,{"$f":"IFERROR(VALUE(IF(ISERROR(MATCH(A233,Sources!$B:$B,0)),IF(ISERROR(MATCH(F233,Sources!$C:$C,0)),\"\",5*D233+3*E233),IF(AND(NOT(ISERROR(MATCH(A233,Sources!$D:$D,0))),NOT(ISERROR(MATCH(F233,Sources!$E:$E,0)))),5*D233+3*E233,\"\"))&IF(AND(ISERROR(MATCH(A233,Sources!$F:$F,0)),NOT(ISERROR(MATCH(F233,Sources!$G:$G,0)))),5*D233+3*E233,\"\")),\"\")","v":""},110]
["UTOPIA ISLAND",{"$f":"IFERROR(VLOOKUP(A234,Sheet2!$B$2:$C$18,2,0),\"\")","v":"Utopia"},"2018-08-16",3,1,"MAKADI BAY",193,null,{"$f":"IFERROR(VALUE(IF(ISERROR(MATCH(A234,Sources!$B:$B,0)),IF(ISERROR(MATCH(F234,Sources!$C:$C,0)),\"\",5*D234+3*E234),IF(AND(NOT(ISERROR(MATCH(A234,Sources!$D:$D,0))),NOT(ISERROR(MATCH(F234,Sources!$E:$E,0)))),5*D234+3*E234,\"\"))&IF(AND(ISERROR(MATCH(A234,Sources!$F:$F,0)),NOT(ISERROR(MATCH(F234,Sources!$G:$G,0)))),5*D234+3*E234,\"\")),\"\")","v":""},193]
["UTOPIA ISLAND",{"$f":"IFERROR(VLOOKUP(A235,Sheet2!$B$2:$C$18,2,0),\"\")","v":"Utopia"},"2018-08-16",1,0,"MAKADI BAY",55,null,{"$f":"IFERROR(VALUE(IF(ISERROR(MATCH(A235,Sources!$B:$B,0)),IF(ISERROR(MATCH(F235,Sources!$C:$C,0)),\"\",5*D235+3*E235),IF(AND(NOT(ISERROR(MATCH(A235,Sources!$D:$D,0))),NOT(ISERROR(MATCH(F235,Sources!$E:$E,0)))),5*D235+3*E235,\"\"))&IF(AND(ISERROR(MATCH(A235,Sources!$F:$F,0)),NOT(ISERROR(MATCH(F235,Sources!$G:$G,0)))),5*D235+3*E235,\"\")),\"\")","v":""},55]
["UTOPIA ISLAND",{"$f":"IFERROR(VLOOKUP(A236,Sheet2!$B$2:$C$18,2,0),\"\")","v":"Utopia"},"2018-08-16",2,0,"MAKADI BAY",110,null,{"$f":"IFERROR(VALUE(IF(ISERROR(MATCH(A236,Sources!$B:$B,0)),IF(ISERROR(MATCH(F236,Sources!$C:$C,0)),\"\",5*D236+3*E236),IF(AND(NOT(ISERROR(MATCH(A236,Sources!$D:$D,0))),NOT(ISERROR(MATCH(F236,Sources!$E:$E,0)))),5*D236+3*E236,\"\"))&IF(AND(ISERROR(MATCH(A236,Sources!$F:$F,0)),NOT(ISERROR(MATCH(F236,Sources!$G:$G,0)))),5*D236+3*E236,\"\")),\"\")","v":""},110]
["UTOPIA ISLAND",{"$f":"IFERROR(VLOOKUP(A237,Sheet2!$B$2:$C$18,2,0),\"\")","v":"Utopia"},"2018-08-16",2,0,"MAKADI BAY",110,null,{"$f":"IFERROR(VALUE(IF(ISERROR(MATCH(A237,Sources!$B:$B,0)),IF(ISERROR(MATCH(F237,Sources!$C:$C,0)),\"\",5*D237+3*E237),IF(AND(NOT(ISERROR(MATCH(A237,Sources!$D:$D,0))),NOT(ISERROR(MATCH(F237,Sources!$E:$E,0)))),5*D237+3*E237,\"\"))&IF(AND(ISERROR(MATCH(A237,Sources!$F:$F,0)),NOT(ISERROR(MATCH(F237,Sources!$G:$G,0)))),5*D237+3*E237,\"\")),\"\")","v":""},110]
["UTOPIA ISLAND",{"$f":"IFERROR(VLOOKUP(A238,Sheet2!$B$2:$C$18,2,0),\"\")","v":"Utopia"},"2018-08-16",3,0,"MAKADI BAY",165,null,{"$f":"IFERROR(VALUE(IF(ISERROR(MATCH(A238,Sources!$B:$B,0)),IF(ISERROR(MATCH(F238,Sources!$C:$C,0)),\"\",5*D238+3*E238),IF(AND(NOT(ISERROR(MATCH(A238,Sources!$D:$D,0))),NOT(ISERROR(MATCH(F238,Sources!$E:$E,0)))),5*D238+3*E238,\"\"))&IF(AND(ISERROR(MATCH(A238,Sources!$F:$F,0)),NOT(ISERROR(MATCH(F238,Sources!$G:$G,0)))),5*D238+3*E238,\"\")),\"\")","v":""},165]
["UTOPIA ISLAND",{"$f":"IFERROR(VLOOKUP(A239,Sheet2!$B$2:$C$18,2,0),\"\")","v":"Utopia"},"2018-08-16",2,0,"MAKADI BAY",110,null,{"$f":"IFERROR(VALUE(IF(ISERROR(MATCH(A239,Sources!$B:$B,0)),IF(ISERROR(MATCH(F239,Sources!$C:$C,0)),\"\",5*D239+3*E239),IF(AND(NOT(ISERROR(MATCH(A239,Sources!$D:$D,0))),NOT(ISERROR(MATCH(F239,Sources!$E:$E,0)))),5*D239+3*E239,\"\"))&IF(AND(ISERROR(MATCH(A239,Sources!$F:$F,0)),NOT(ISERROR(MATCH(F239,Sources!$G:$G,0)))),5*D239+3*E239,\"\")),\"\")","v":""},110]
["UTOPIA ISLAND",{"$f":"IFERROR(VLOOKUP(A240,Sheet2!$B$2:$C$18,2,0),\"\")","v":"Utopia"},"2018-08-16",2,0,"MAKADI BAY",110,null,{"$f":"IFERROR(VALUE(IF(ISERROR(MATCH(A240,Sources!$B:$B,0)),IF(ISERROR(MATCH(F240,Sources!$C:$C,0)),\"\",5*D240+3*E240),IF(AND(NOT(ISERROR(MATCH(A240,Sources!$D:$D,0))),NOT(ISERROR(MATCH(F240,Sources!$E:$E,0)))),5*D240+3*E240,\"\"))&IF(AND(ISERROR(MATCH(A240,Sources!$F:$F,0)),NOT(ISERROR(MATCH(F240,Sources!$G:$G,0)))),5*D240+3*E240,\"\")),\"\")","v":""},110]
["UTOPIA ISLAND",{"$f":"IFERROR(VLOOKUP(A241,Sheet2!$B$2:$C$18,2,0),\"\")","v":"Utopia"},"2018-08-16",2,0,"HURGADA",110,null,{"$f":"IFERROR(VALUE(IF(ISERROR(MATCH(A241,Sources!$B:$B,0)),IF(ISERROR(MATCH(F241,Sources!$C:$C,0)),\"\",5*D241+3*E241),IF(AND(NOT(ISERROR(MATCH(A241,Sources!$D:$D,0))),NOT(ISERROR(MATCH(F241,Sources!$E:$E,0)))),5*D241+3*E241,\"\"))&IF(AND(ISERROR(MATCH(A241,Sources!$F:$F,0)),NOT(ISERROR(MATCH(F241,Sources!$G:$G,0)))),5*D241+3*E241,\"\")),\"\")","v":""},110]
["UTOPIA ISLAND",{"$f":"IFERROR(VLOOKUP(A242,Sheet2!$B$2:$C$18,2,0),\"\")","v":"Utopia"},"2018-08-16",2,0,"HURGADA",110,null,{"$f":"IFERROR(VALUE(IF(ISERROR(MATCH(A242,Sources!$B:$B,0)),IF(ISERROR(MATCH(F242,Sources!$C:$C,0)),\"\",5*D242+3*E242),IF(AND(NOT(ISERROR(MATCH(A242,Sources!$D:$D,0))),NOT(ISERROR(MATCH(F242,Sources!$E:$E,0)))),5*D242+3*E242,\"\"))&IF(AND(ISERROR(MATCH(A242,Sources!$F:$F,0)),NOT(ISERROR(MATCH(F242,Sources!$G:$G,0)))),5*D242+3*E242,\"\")),\"\")","v":""},110]
["UTOPIA ISLAND",{"$f":"IFERROR(VLOOKUP(A243,Sheet2!$B$2:$C$18,2,0),\"\")","v":"Utopia"},"2018-08-16",5,2,"HURGADA",331,null,{"$f":"IFERROR(VALUE(IF(ISERROR(MATCH(A243,Sources!$B:$B,0)),IF(ISERROR(MATCH(F243,Sources!$C:$C,0)),\"\",5*D243+3*E243),IF(AND(NOT(ISERROR(MATCH(A243,Sources!$D:$D,0))),NOT(ISERROR(MATCH(F243,Sources!$E:$E,0)))),5*D243+3*E243,\"\"))&IF(AND(ISERROR(MATCH(A243,Sources!$F:$F,0)),NOT(ISERROR(MATCH(F243,Sources!$G:$G,0)))),5*D243+3*E243,\"\")),\"\")","v":""},331]
["UTOPIA ISLAND",{"$f":"IFERROR(VLOOKUP(A244,Sheet2!$B$2:$C$18,2,0),\"\")","v":"Utopia"},"2018-08-16",2,0,"MAKADI BAY",110,null,{"$f":"IFERROR(VALUE(IF(ISERROR(MATCH(A244,Sources!$B:$B,0)),IF(ISERROR(MATCH(F244,Sources!$C:$C,0)),\"\",5*D244+3*E244),IF(AND(NOT(ISERROR(MATCH(A244,Sources!$D:$D,0))),NOT(ISERROR(MATCH(F244,Sources!$E:$E,0)))),5*D244+3*E244,\"\"))&IF(AND(ISERROR(MATCH(A244,Sources!$F:$F,0)),NOT(ISERROR(MATCH(F244,Sources!$G:$G,0)))),5*D244+3*E244,\"\")),\"\")","v":""},110]
["UTOPIA ISLAND",{"$f":"IFERROR(VLOOKUP(A245,Sheet2!$B$2:$C$18,2,0),\"\")","v":"Utopia"},"2018-08-16",2,0,"MAKADI BAY",110,null,{"$f":"IFERROR(VALUE(IF(ISERROR(MATCH(A245,Sources!$B:$B,0)),IF(ISERROR(MATCH(F245,Sources!$C:$C,0)),\"\",5*D245+3*E245),IF(AND(NOT(ISERROR(MATCH(A245,Sources!$D:$D,0))),NOT(ISERROR(MATCH(F245,Sources!$E:$E,0)))),5*D245+3*E245,\"\"))&IF(AND(ISERROR(MATCH(A245,Sources!$F:$F,0)),NOT(ISERROR(MATCH(F245,Sources!$G:$G,0)))),5*D245+3*E245,\"\")),\"\")","v":""},110]
["UTOPIA ISLAND",{"$f":"IFERROR(VLOOKUP(A246,Sheet2!$B$2:$C$18,2,0),\"\")","v":"Utopia"},"2018-08-16",3,0,"SAHL HASHEESH",165,null,{"$f":"IFERROR(VALUE(IF(ISERROR(MATCH(A246,Sources!$B:$B,0)),IF(ISERROR(MATCH(F246,Sources!$C:$C,0)),\"\",5*D246+3*E246),IF(AND(NOT(ISERROR(MATCH(A246,Sources!$D:$D,0))),NOT(ISERROR(MATCH(F246,Sources!$E:$E,0)))),5*D246+3*E246,\"\"))&IF(AND(ISERROR(MATCH(A246,Sources!$F:$F,0)),NOT(ISERROR(MATCH(F246,Sources!$G:$G,0)))),5*D246+3*E246,\"\")),\"\")","v":""},165]
["MOTO2",{"$f":"IFERROR(VLOOKUP(A247,Sheet2!$B$2:$C$18,2,0),\"\")","v":"Moto 2"},"2018-08-17",2,0,"HURGADA",90,null,{"$f":"IFERROR(VALUE(IF(ISERROR(MATCH(A247,Sources!$B:$B,0)),IF(ISERROR(MATCH(F247,Sources!$C:$C,0)),\"\",5*D247+3*E247),IF(AND(NOT(ISERROR(MATCH(A247,Sources!$D:$D,0))),NOT(ISERROR(MATCH(F247,Sources!$E:$E,0)))),5*D247+3*E247,\"\"))&IF(AND(ISERROR(MATCH(A247,Sources!$F:$F,0)),NOT(ISERROR(MATCH(F247,Sources!$G:$G,0)))),5*D247+3*E247,\"\")),\"\")","v":""},90]
["MOTO 1 HOUR",{"$f":"IFERROR(VLOOKUP(A248,Sheet2!$B$2:$C$18,2,0),\"\")","v":"Moto 1 Hour"},"2018-08-17",1,0,"HURGADA",40,null,{"$f":"IFERROR(VALUE(IF(ISERROR(MATCH(A248,Sources!$B:$B,0)),IF(ISERROR(MATCH(F248,Sources!$C:$C,0)),\"\",5*D248+3*E248),IF(AND(NOT(ISERROR(MATCH(A248,Sources!$D:$D,0))),NOT(ISERROR(MATCH(F248,Sources!$E:$E,0)))),5*D248+3*E248,\"\"))&IF(AND(ISERROR(MATCH(A248,Sources!$F:$F,0)),NOT(ISERROR(MATCH(F248,Sources!$G:$G,0)))),5*D248+3*E248,\"\")),\"\")","v":""},40]
["MOTO2",{"$f":"IFERROR(VLOOKUP(A249,Sheet2!$B$2:$C$18,2,0),\"\")","v":"Moto 2"},"2018-08-17",2,0,"HURGADA",90,null,{"$f":"IFERROR(VALUE(IF(ISERROR(MATCH(A249,Sources!$B:$B,0)),IF(ISERROR(MATCH(F249,Sources!$C:$C,0)),\"\",5*D249+3*E249),IF(AND(NOT(ISERROR(MATCH(A249,Sources!$D:$D,0))),NOT(ISERROR(MATCH(F249,Sources!$E:$E,0)))),5*D249+3*E249,\"\"))&IF(AND(ISERROR(MATCH(A249,Sources!$F:$F,0)),NOT(ISERROR(MATCH(F249,Sources!$G:$G,0)))),5*D249+3*E249,\"\")),\"\")","v":""},90]
["MOTO2",{"$f":"IFERROR(VLOOKUP(A250,Sheet2!$B$2:$C$18,2,0),\"\")","v":"Moto 2"},"2018-08-17",2,0,"MAKADI BAY",100,null,{"$f":"IFERROR(VALUE(IF(ISERROR(MATCH(A250,Sources!$B:$B,0)),IF(ISERROR(MATCH(F250,Sources!$C:$C,0)),\"\",5*D250+3*E250),IF(AND(NOT(ISERROR(MATCH(A250,Sources!$D:$D,0))),NOT(ISERROR(MATCH(F250,Sources!$E:$E,0)))),5*D250+3*E250,\"\"))&IF(AND(ISERROR(MATCH(A250,Sources!$F:$F,0)),NOT(ISERROR(MATCH(F250,Sources!$G:$G,0)))),5*D250+3*E250,\"\")),\"\")","v":10},90]
["MOTO2",{"$f":"IFERROR(VLOOKUP(A251,Sheet2!$B$2:$C$18,2,0),\"\")","v":"Moto 2"},"2018-08-17",3,0,"SAHL HASHEESH",135,null,{"$f":"IFERROR(VALUE(IF(ISERROR(MATCH(A251,Sources!$B:$B,0)),IF(ISERROR(MATCH(F251,Sources!$C:$C,0)),\"\",5*D251+3*E251),IF(AND(NOT(ISERROR(MATCH(A251,Sources!$D:$D,0))),NOT(ISERROR(MATCH(F251,Sources!$E:$E,0)))),5*D251+3*E251,\"\"))&IF(AND(ISERROR(MATCH(A251,Sources!$F:$F,0)),NOT(ISERROR(MATCH(F251,Sources!$G:$G,0)))),5*D251+3*E251,\"\")),\"\")","v":""},135]
["MOTO2",{"$f":"IFERROR(VLOOKUP(A252,Sheet2!$B$2:$C$18,2,0),\"\")","v":"Moto 2"},"2018-08-17",2,0,"SAHL HASHEESH",90,null,{"$f":"IFERROR(VALUE(IF(ISERROR(MATCH(A252,Sources!$B:$B,0)),IF(ISERROR(MATCH(F252,Sources!$C:$C,0)),\"\",5*D252+3*E252),IF(AND(NOT(ISERROR(MATCH(A252,Sources!$D:$D,0))),NOT(ISERROR(MATCH(F252,Sources!$E:$E,0)))),5*D252+3*E252,\"\"))&IF(AND(ISERROR(MATCH(A252,Sources!$F:$F,0)),NOT(ISERROR(MATCH(F252,Sources!$G:$G,0)))),5*D252+3*E252,\"\")),\"\")","v":""},90]
["GRAND AQUARIUM",{"$f":"IFERROR(VLOOKUP(A253,Sheet2!$B$2:$C$18,2,0),\"\")","v":"Grand Aquarium"},"2018-08-18",2,0,"HURGADA",80,null,{"$f":"IFERROR(VALUE(IF(ISERROR(MATCH(A253,Sources!$B:$B,0)),IF(ISERROR(MATCH(F253,Sources!$C:$C,0)),\"\",5*D253+3*E253),IF(AND(NOT(ISERROR(MATCH(A253,Sources!$D:$D,0))),NOT(ISERROR(MATCH(F253,Sources!$E:$E,0)))),5*D253+3*E253,\"\"))&IF(AND(ISERROR(MATCH(A253,Sources!$F:$F,0)),NOT(ISERROR(MATCH(F253,Sources!$G:$G,0)))),5*D253+3*E253,\"\")),\"\")","v":""},80]
["OVER DAY LUXORQUEEN VALLY",{"$f":"IFERROR(VLOOKUP(A254,Sheet2!$B$2:$C$18,2,0),\"\")","v":"LUXOR 2"},"2018-08-18",2,0,"HURGADA",180,"ukraine",{"$f":"IFERROR(VALUE(IF(ISERROR(MATCH(A254,Sources!$B:$B,0)),IF(ISERROR(MATCH(F254,Sources!$C:$C,0)),\"\",5*D254+3*E254),IF(AND(NOT(ISERROR(MATCH(A254,Sources!$D:$D,0))),NOT(ISERROR(MATCH(F254,Sources!$E:$E,0)))),5*D254+3*E254,\"\"))&IF(AND(ISERROR(MATCH(A254,Sources!$F:$F,0)),NOT(ISERROR(MATCH(F254,Sources!$G:$G,0)))),5*D254+3*E254,\"\")),\"\")","v":""},180]
["OVER DAY LUXORQUEEN VALLY",{"$f":"IFERROR(VLOOKUP(A255,Sheet2!$B$2:$C$18,2,0),\"\")","v":"LUXOR 2"},"2018-08-18",2,0,"HURGADA",180,"russian,belarus",{"$f":"IFERROR(VALUE(IF(ISERROR(MATCH(A255,Sources!$B:$B,0)),IF(ISERROR(MATCH(F255,Sources!$C:$C,0)),\"\",5*D255+3*E255),IF(AND(NOT(ISERROR(MATCH(A255,Sources!$D:$D,0))),NOT(ISERROR(MATCH(F255,Sources!$E:$E,0)))),5*D255+3*E255,\"\"))&IF(AND(ISERROR(MATCH(A255,Sources!$F:$F,0)),NOT(ISERROR(MATCH(F255,Sources!$G:$G,0)))),5*D255+3*E255,\"\")),\"\")","v":""},180]
["OVER DAY LUXORQUEEN VALLY",{"$f":"IFERROR(VLOOKUP(A256,Sheet2!$B$2:$C$18,2,0),\"\")","v":"LUXOR 2"},"2018-08-18",3,0,"HURGADA",270,"ukraine",{"$f":"IFERROR(VALUE(IF(ISERROR(MATCH(A256,Sources!$B:$B,0)),IF(ISERROR(MATCH(F256,Sources!$C:$C,0)),\"\",5*D256+3*E256),IF(AND(NOT(ISERROR(MATCH(A256,Sources!$D:$D,0))),NOT(ISERROR(MATCH(F256,Sources!$E:$E,0)))),5*D256+3*E256,\"\"))&IF(AND(ISERROR(MATCH(A256,Sources!$F:$F,0)),NOT(ISERROR(MATCH(F256,Sources!$G:$G,0)))),5*D256+3*E256,\"\")),\"\")","v":""},270]
["OVER DAY LUXORQUEEN VALLY",{"$f":"IFERROR(VLOOKUP(A257,Sheet2!$B$2:$C$18,2,0),\"\")","v":"LUXOR 2"},"2018-08-18",2,0,"HURGADA",180,"ukraine",{"$f":"IFERROR(VALUE(IF(ISERROR(MATCH(A257,Sources!$B:$B,0)),IF(ISERROR(MATCH(F257,Sources!$C:$C,0)),\"\",5*D257+3*E257),IF(AND(NOT(ISERROR(MATCH(A257,Sources!$D:$D,0))),NOT(ISERROR(MATCH(F257,Sources!$E:$E,0)))),5*D257+3*E257,\"\"))&IF(AND(ISERROR(MATCH(A257,Sources!$F:$F,0)),NOT(ISERROR(MATCH(F257,Sources!$G:$G,0)))),5*D257+3*E257,\"\")),\"\")","v":""},180]
["OVER DAY LUXORQUEEN VALLY",{"$f":"IFERROR(VLOOKUP(A258,Sheet2!$B$2:$C$18,2,0),\"\")","v":"LUXOR 2"},"2018-08-18",2,1,"HURGADA",225,"ukraine",{"$f":"IFERROR(VALUE(IF(ISERROR(MATCH(A258,Sources!$B:$B,0)),IF(ISERROR(MATCH(F258,Sources!$C:$C,0)),\"\",5*D258+3*E258),IF(AND(NOT(ISERROR(MATCH(A258,Sources!$D:$D,0))),NOT(ISERROR(MATCH(F258,Sources!$E:$E,0)))),5*D258+3*E258,\"\"))&IF(AND(ISERROR(MATCH(A258,Sources!$F:$F,0)),NOT(ISERROR(MATCH(F258,Sources!$G:$G,0)))),5*D258+3*E258,\"\")),\"\")","v":""},225]
["OVER DAY LUXORQUEEN VALLY",{"$f":"IFERROR(VLOOKUP(A259,Sheet2!$B$2:$C$18,2,0),\"\")","v":"LUXOR 2"},"2018-08-18",2,1,"SAFAGA",225,null,{"$f":"IFERROR(VALUE(IF(ISERROR(MATCH(A259,Sources!$B:$B,0)),IF(ISERROR(MATCH(F259,Sources!$C:$C,0)),\"\",5*D259+3*E259),IF(AND(NOT(ISERROR(MATCH(A259,Sources!$D:$D,0))),NOT(ISERROR(MATCH(F259,Sources!$E:$E,0)))),5*D259+3*E259,\"\"))&IF(AND(ISERROR(MATCH(A259,Sources!$F:$F,0)),NOT(ISERROR(MATCH(F259,Sources!$G:$G,0)))),5*D259+3*E259,\"\")),\"\")","v":""},{"$f":"IF(I259=\"\",G259,(G259-I259))","v":225}]
["UTOPIA ISLAND",{"$f":"IFERROR(VLOOKUP(A260,Sheet2!$B$2:$C$18,2,0),\"\")","v":"Utopia"},"2018-08-19",3,1,"HURGADA",193,null,{"$f":"IFERROR(VALUE(IF(ISERROR(MATCH(A260,Sources!$B:$B,0)),IF(ISERROR(MATCH(F260,Sources!$C:$C,0)),\"\",5*D260+3*E260),IF(AND(NOT(ISERROR(MATCH(A260,Sources!$D:$D,0))),NOT(ISERROR(MATCH(F260,Sources!$E:$E,0)))),5*D260+3*E260,\"\"))&IF(AND(ISERROR(MATCH(A260,Sources!$F:$F,0)),NOT(ISERROR(MATCH(F260,Sources!$G:$G,0)))),5*D260+3*E260,\"\")),\"\")","v":""},193]
["UTOPIA ISLAND",{"$f":"IFERROR(VLOOKUP(A261,Sheet2!$B$2:$C$18,2,0),\"\")","v":"Utopia"},"2018-08-19",2,0,"MAKADI BAY",110,null,{"$f":"IFERROR(VALUE(IF(ISERROR(MATCH(A261,Sources!$B:$B,0)),IF(ISERROR(MATCH(F261,Sources!$C:$C,0)),\"\",5*D261+3*E261),IF(AND(NOT(ISERROR(MATCH(A261,Sources!$D:$D,0))),NOT(ISERROR(MATCH(F261,Sources!$E:$E,0)))),5*D261+3*E261,\"\"))&IF(AND(ISERROR(MATCH(A261,Sources!$F:$F,0)),NOT(ISERROR(MATCH(F261,Sources!$G:$G,0)))),5*D261+3*E261,\"\")),\"\")","v":""},110]
["CAIRO BY PLANE",{"$f":"IFERROR(VLOOKUP(A262,Sheet2!$B$2:$C$18,2,0),\"\")","v":0},"2018-08-19",3,0,"SAHL HASHEESH",900,null,{"$f":"IFERROR(VALUE(IF(ISERROR(MATCH(A262,Sources!$B:$B,0)),IF(ISERROR(MATCH(F262,Sources!$C:$C,0)),\"\",5*D262+3*E262),IF(AND(NOT(ISERROR(MATCH(A262,Sources!$D:$D,0))),NOT(ISERROR(MATCH(F262,Sources!$E:$E,0)))),5*D262+3*E262,\"\"))&IF(AND(ISERROR(MATCH(A262,Sources!$F:$F,0)),NOT(ISERROR(MATCH(F262,Sources!$G:$G,0)))),5*D262+3*E262,\"\")),\"\")","v":""},900]
["UTOPIA ISLAND",{"$f":"IFERROR(VLOOKUP(A263,Sheet2!$B$2:$C$18,2,0),\"\")","v":"Utopia"},"2018-08-19",2,0,"HURGADA",110,null,{"$f":"IFERROR(VALUE(IF(ISERROR(MATCH(A263,Sources!$B:$B,0)),IF(ISERROR(MATCH(F263,Sources!$C:$C,0)),\"\",5*D263+3*E263),IF(AND(NOT(ISERROR(MATCH(A263,Sources!$D:$D,0))),NOT(ISERROR(MATCH(F263,Sources!$E:$E,0)))),5*D263+3*E263,\"\"))&IF(AND(ISERROR(MATCH(A263,Sources!$F:$F,0)),NOT(ISERROR(MATCH(F263,Sources!$G:$G,0)))),5*D263+3*E263,\"\")),\"\")","v":""},110]
["UTOPIA ISLAND",{"$f":"IFERROR(VLOOKUP(A264,Sheet2!$B$2:$C$18,2,0),\"\")","v":"Utopia"},"2018-08-19",2,0,"HURGADA",110,null,{"$f":"IFERROR(VALUE(IF(ISERROR(MATCH(A264,Sources!$B:$B,0)),IF(ISERROR(MATCH(F264,Sources!$C:$C,0)),\"\",5*D264+3*E264),IF(AND(NOT(ISERROR(MATCH(A264,Sources!$D:$D,0))),NOT(ISERROR(MATCH(F264,Sources!$E:$E,0)))),5*D264+3*E264,\"\"))&IF(AND(ISERROR(MATCH(A264,Sources!$F:$F,0)),NOT(ISERROR(MATCH(F264,Sources!$G:$G,0)))),5*D264+3*E264,\"\")),\"\")","v":""},110]
["UTOPIA ISLAND",{"$f":"IFERROR(VLOOKUP(A265,Sheet2!$B$2:$C$18,2,0),\"\")","v":"Utopia"},"2018-08-19",2,0,"MAKADI BAY",110,null,{"$f":"IFERROR(VALUE(IF(ISERROR(MATCH(A265,Sources!$B:$B,0)),IF(ISERROR(MATCH(F265,Sources!$C:$C,0)),\"\",5*D265+3*E265),IF(AND(NOT(ISERROR(MATCH(A265,Sources!$D:$D,0))),NOT(ISERROR(MATCH(F265,Sources!$E:$E,0)))),5*D265+3*E265,\"\"))&IF(AND(ISERROR(MATCH(A265,Sources!$F:$F,0)),NOT(ISERROR(MATCH(F265,Sources!$G:$G,0)))),5*D265+3*E265,\"\")),\"\")","v":""},110]
["UTOPIA ISLAND",{"$f":"IFERROR(VLOOKUP(A266,Sheet2!$B$2:$C$18,2,0),\"\")","v":"Utopia"},"2018-08-19",2,1,"MAKADI BAY",138,null,{"$f":"IFERROR(VALUE(IF(ISERROR(MATCH(A266,Sources!$B:$B,0)),IF(ISERROR(MATCH(F266,Sources!$C:$C,0)),\"\",5*D266+3*E266),IF(AND(NOT(ISERROR(MATCH(A266,Sources!$D:$D,0))),NOT(ISERROR(MATCH(F266,Sources!$E:$E,0)))),5*D266+3*E266,\"\"))&IF(AND(ISERROR(MATCH(A266,Sources!$F:$F,0)),NOT(ISERROR(MATCH(F266,Sources!$G:$G,0)))),5*D266+3*E266,\"\")),\"\")","v":""},138]
["UTOPIA ISLAND",{"$f":"IFERROR(VLOOKUP(A267,Sheet2!$B$2:$C$18,2,0),\"\")","v":"Utopia"},"2018-08-19",2,0,"MAKADI BAY",110,null,{"$f":"IFERROR(VALUE(IF(ISERROR(MATCH(A267,Sources!$B:$B,0)),IF(ISERROR(MATCH(F267,Sources!$C:$C,0)),\"\",5*D267+3*E267),IF(AND(NOT(ISERROR(MATCH(A267,Sources!$D:$D,0))),NOT(ISERROR(MATCH(F267,Sources!$E:$E,0)))),5*D267+3*E267,\"\"))&IF(AND(ISERROR(MATCH(A267,Sources!$F:$F,0)),NOT(ISERROR(MATCH(F267,Sources!$G:$G,0)))),5*D267+3*E267,\"\")),\"\")","v":""},110]
["UTOPIA ISLAND",{"$f":"IFERROR(VLOOKUP(A268,Sheet2!$B$2:$C$18,2,0),\"\")","v":"Utopia"},"2018-08-19",2,0,"HURGADA",110,null,{"$f":"IFERROR(VALUE(IF(ISERROR(MATCH(A268,Sources!$B:$B,0)),IF(ISERROR(MATCH(F268,Sources!$C:$C,0)),\"\",5*D268+3*E268),IF(AND(NOT(ISERROR(MATCH(A268,Sources!$D:$D,0))),NOT(ISERROR(MATCH(F268,Sources!$E:$E,0)))),5*D268+3*E268,\"\"))&IF(AND(ISERROR(MATCH(A268,Sources!$F:$F,0)),NOT(ISERROR(MATCH(F268,Sources!$G:$G,0)))),5*D268+3*E268,\"\")),\"\")","v":""},110]
["UTOPIA ISLAND",{"$f":"IFERROR(VLOOKUP(A269,Sheet2!$B$2:$C$18,2,0),\"\")","v":"Utopia"},"2018-08-19",2,0,"HURGADA",110,null,{"$f":"IFERROR(VALUE(IF(ISERROR(MATCH(A269,Sources!$B:$B,0)),IF(ISERROR(MATCH(F269,Sources!$C:$C,0)),\"\",5*D269+3*E269),IF(AND(NOT(ISERROR(MATCH(A269,Sources!$D:$D,0))),NOT(ISERROR(MATCH(F269,Sources!$E:$E,0)))),5*D269+3*E269,\"\"))&IF(AND(ISERROR(MATCH(A269,Sources!$F:$F,0)),NOT(ISERROR(MATCH(F269,Sources!$G:$G,0)))),5*D269+3*E269,\"\")),\"\")","v":""},110]
["UTOPIA ISLAND",{"$f":"IFERROR(VLOOKUP(A270,Sheet2!$B$2:$C$18,2,0),\"\")","v":"Utopia"},"2018-08-19",2,0,"HURGADA",110,null,{"$f":"IFERROR(VALUE(IF(ISERROR(MATCH(A270,Sources!$B:$B,0)),IF(ISERROR(MATCH(F270,Sources!$C:$C,0)),\"\",5*D270+3*E270),IF(AND(NOT(ISERROR(MATCH(A270,Sources!$D:$D,0))),NOT(ISERROR(MATCH(F270,Sources!$E:$E,0)))),5*D270+3*E270,\"\"))&IF(AND(ISERROR(MATCH(A270,Sources!$F:$F,0)),NOT(ISERROR(MATCH(F270,Sources!$G:$G,0)))),5*D270+3*E270,\"\")),\"\")","v":""},110]
["UTOPIA ISLAND",{"$f":"IFERROR(VLOOKUP(A271,Sheet2!$B$2:$C$18,2,0),\"\")","v":"Utopia"},"2018-08-19",3,0,"HURGADA",165,null,{"$f":"IFERROR(VALUE(IF(ISERROR(MATCH(A271,Sources!$B:$B,0)),IF(ISERROR(MATCH(F271,Sources!$C:$C,0)),\"\",5*D271+3*E271),IF(AND(NOT(ISERROR(MATCH(A271,Sources!$D:$D,0))),NOT(ISERROR(MATCH(F271,Sources!$E:$E,0)))),5*D271+3*E271,\"\"))&IF(AND(ISERROR(MATCH(A271,Sources!$F:$F,0)),NOT(ISERROR(MATCH(F271,Sources!$G:$G,0)))),5*D271+3*E271,\"\")),\"\")","v":""},165]
["UTOPIA ISLAND",{"$f":"IFERROR(VLOOKUP(A272,Sheet2!$B$2:$C$18,2,0),\"\")","v":"Utopia"},"2018-08-19",4,0,"HURGADA",220,null,{"$f":"IFERROR(VALUE(IF(ISERROR(MATCH(A272,Sources!$B:$B,0)),IF(ISERROR(MATCH(F272,Sources!$C:$C,0)),\"\",5*D272+3*E272),IF(AND(NOT(ISERROR(MATCH(A272,Sources!$D:$D,0))),NOT(ISERROR(MATCH(F272,Sources!$E:$E,0)))),5*D272+3*E272,\"\"))&IF(AND(ISERROR(MATCH(A272,Sources!$F:$F,0)),NOT(ISERROR(MATCH(F272,Sources!$G:$G,0)))),5*D272+3*E272,\"\")),\"\")","v":""},220]
["UTOPIA ISLAND",{"$f":"IFERROR(VLOOKUP(A273,Sheet2!$B$2:$C$18,2,0),\"\")","v":"Utopia"},"2018-08-19",5,0,"HURGADA",261,"14 $ DISCOUNT-5%",{"$f":"IFERROR(VALUE(IF(ISERROR(MATCH(A273,Sources!$B:$B,0)),IF(ISERROR(MATCH(F273,Sources!$C:$C,0)),\"\",5*D273+3*E273),IF(AND(NOT(ISERROR(MATCH(A273,Sources!$D:$D,0))),NOT(ISERROR(MATCH(F273,Sources!$E:$E,0)))),5*D273+3*E273,\"\"))&IF(AND(ISERROR(MATCH(A273,Sources!$F:$F,0)),NOT(ISERROR(MATCH(F273,Sources!$G:$G,0)))),5*D273+3*E273,\"\")),\"\")","v":""},261]
["UTOPIA ISLAND",{"$f":"IFERROR(VLOOKUP(A274,Sheet2!$B$2:$C$18,2,0),\"\")","v":"Utopia"},"2018-08-19",5,0,"HURGADA",261,"14 $ DISCOUNT -5%",{"$f":"IFERROR(VALUE(IF(ISERROR(MATCH(A274,Sources!$B:$B,0)),IF(ISERROR(MATCH(F274,Sources!$C:$C,0)),\"\",5*D274+3*E274),IF(AND(NOT(ISERROR(MATCH(A274,Sources!$D:$D,0))),NOT(ISERROR(MATCH(F274,Sources!$E:$E,0)))),5*D274+3*E274,\"\"))&IF(AND(ISERROR(MATCH(A274,Sources!$F:$F,0)),NOT(ISERROR(MATCH(F274,Sources!$G:$G,0)))),5*D274+3*E274,\"\")),\"\")","v":""},261]
["UTOPIA ISLAND",{"$f":"IFERROR(VLOOKUP(A275,Sheet2!$B$2:$C$18,2,0),\"\")","v":"Utopia"},"2018-08-19",4,0,"HURGADA",220,null,{"$f":"IFERROR(VALUE(IF(ISERROR(MATCH(A275,Sources!$B:$B,0)),IF(ISERROR(MATCH(F275,Sources!$C:$C,0)),\"\",5*D275+3*E275),IF(AND(NOT(ISERROR(MATCH(A275,Sources!$D:$D,0))),NOT(ISERROR(MATCH(F275,Sources!$E:$E,0)))),5*D275+3*E275,\"\"))&IF(AND(ISERROR(MATCH(A275,Sources!$F:$F,0)),NOT(ISERROR(MATCH(F275,Sources!$G:$G,0)))),5*D275+3*E275,\"\")),\"\")","v":""},220]
["UTOPIA ISLAND",{"$f":"IFERROR(VLOOKUP(A276,Sheet2!$B$2:$C$18,2,0),\"\")","v":"Utopia"},"2018-08-19",2,1,"MAKADI BAY",138,null,{"$f":"IFERROR(VALUE(IF(ISERROR(MATCH(A276,Sources!$B:$B,0)),IF(ISERROR(MATCH(F276,Sources!$C:$C,0)),\"\",5*D276+3*E276),IF(AND(NOT(ISERROR(MATCH(A276,Sources!$D:$D,0))),NOT(ISERROR(MATCH(F276,Sources!$E:$E,0)))),5*D276+3*E276,\"\"))&IF(AND(ISERROR(MATCH(A276,Sources!$F:$F,0)),NOT(ISERROR(MATCH(F276,Sources!$G:$G,0)))),5*D276+3*E276,\"\")),\"\")","v":""},138]
["UTOPIA ISLAND",{"$f":"IFERROR(VLOOKUP(A277,Sheet2!$B$2:$C$18,2,0),\"\")","v":"Utopia"},"2018-08-19",2,0,"MAKADI BAY",110,null,{"$f":"IFERROR(VALUE(IF(ISERROR(MATCH(A277,Sources!$B:$B,0)),IF(ISERROR(MATCH(F277,Sources!$C:$C,0)),\"\",5*D277+3*E277),IF(AND(NOT(ISERROR(MATCH(A277,Sources!$D:$D,0))),NOT(ISERROR(MATCH(F277,Sources!$E:$E,0)))),5*D277+3*E277,\"\"))&IF(AND(ISERROR(MATCH(A277,Sources!$F:$F,0)),NOT(ISERROR(MATCH(F277,Sources!$G:$G,0)))),5*D277+3*E277,\"\")),\"\")","v":""},110]
["UTOPIA ISLAND",{"$f":"IFERROR(VLOOKUP(A278,Sheet2!$B$2:$C$18,2,0),\"\")","v":"Utopia"},"2018-08-19",2,1,"MAKADI BAY",138,null,{"$f":"IFERROR(VALUE(IF(ISERROR(MATCH(A278,Sources!$B:$B,0)),IF(ISERROR(MATCH(F278,Sources!$C:$C,0)),\"\",5*D278+3*E278),IF(AND(NOT(ISERROR(MATCH(A278,Sources!$D:$D,0))),NOT(ISERROR(MATCH(F278,Sources!$E:$E,0)))),5*D278+3*E278,\"\"))&IF(AND(ISERROR(MATCH(A278,Sources!$F:$F,0)),NOT(ISERROR(MATCH(F278,Sources!$G:$G,0)))),5*D278+3*E278,\"\")),\"\")","v":""},138]
["UTOPIA ISLAND",{"$f":"IFERROR(VLOOKUP(A279,Sheet2!$B$2:$C$18,2,0),\"\")","v":"Utopia"},"2018-08-19",2,1,"MAKADI BAY",138,null,{"$f":"IFERROR(VALUE(IF(ISERROR(MATCH(A279,Sources!$B:$B,0)),IF(ISERROR(MATCH(F279,Sources!$C:$C,0)),\"\",5*D279+3*E279),IF(AND(NOT(ISERROR(MATCH(A279,Sources!$D:$D,0))),NOT(ISERROR(MATCH(F279,Sources!$E:$E,0)))),5*D279+3*E279,\"\"))&IF(AND(ISERROR(MATCH(A279,Sources!$F:$F,0)),NOT(ISERROR(MATCH(F279,Sources!$G:$G,0)))),5*D279+3*E279,\"\")),\"\")","v":""},138]
["UTOPIA ISLAND",{"$f":"IFERROR(VLOOKUP(A280,Sheet2!$B$2:$C$18,2,0),\"\")","v":"Utopia"},"2018-08-19",2,0,"MAKADI BAY",110,null,{"$f":"IFERROR(VALUE(IF(ISERROR(MATCH(A280,Sources!$B:$B,0)),IF(ISERROR(MATCH(F280,Sources!$C:$C,0)),\"\",5*D280+3*E280),IF(AND(NOT(ISERROR(MATCH(A280,Sources!$D:$D,0))),NOT(ISERROR(MATCH(F280,Sources!$E:$E,0)))),5*D280+3*E280,\"\"))&IF(AND(ISERROR(MATCH(A280,Sources!$F:$F,0)),NOT(ISERROR(MATCH(F280,Sources!$G:$G,0)))),5*D280+3*E280,\"\")),\"\")","v":""},110]
["UTOPIA ISLAND",{"$f":"IFERROR(VLOOKUP(A281,Sheet2!$B$2:$C$18,2,0),\"\")","v":"Utopia"},"2018-08-19",2,1,"MAKADI BAY",138,null,{"$f":"IFERROR(VALUE(IF(ISERROR(MATCH(A281,Sources!$B:$B,0)),IF(ISERROR(MATCH(F281,Sources!$C:$C,0)),\"\",5*D281+3*E281),IF(AND(NOT(ISERROR(MATCH(A281,Sources!$D:$D,0))),NOT(ISERROR(MATCH(F281,Sources!$E:$E,0)))),5*D281+3*E281,\"\"))&IF(AND(ISERROR(MATCH(A281,Sources!$F:$F,0)),NOT(ISERROR(MATCH(F281,Sources!$G:$G,0)))),5*D281+3*E281,\"\")),\"\")","v":""},138]
["UTOPIA ISLAND",{"$f":"IFERROR(VLOOKUP(A282,Sheet2!$B$2:$C$18,2,0),\"\")","v":"Utopia"},"2018-08-19",1,0,"MAKADI BAY",55,null,{"$f":"IFERROR(VALUE(IF(ISERROR(MATCH(A282,Sources!$B:$B,0)),IF(ISERROR(MATCH(F282,Sources!$C:$C,0)),\"\",5*D282+3*E282),IF(AND(NOT(ISERROR(MATCH(A282,Sources!$D:$D,0))),NOT(ISERROR(MATCH(F282,Sources!$E:$E,0)))),5*D282+3*E282,\"\"))&IF(AND(ISERROR(MATCH(A282,Sources!$F:$F,0)),NOT(ISERROR(MATCH(F282,Sources!$G:$G,0)))),5*D282+3*E282,\"\")),\"\")","v":""},55]
["UTOPIA ISLAND",{"$f":"IFERROR(VLOOKUP(A283,Sheet2!$B$2:$C$18,2,0),\"\")","v":"Utopia"},"2018-08-19",3,0,"MAKADI BAY",165,null,{"$f":"IFERROR(VALUE(IF(ISERROR(MATCH(A283,Sources!$B:$B,0)),IF(ISERROR(MATCH(F283,Sources!$C:$C,0)),\"\",5*D283+3*E283),IF(AND(NOT(ISERROR(MATCH(A283,Sources!$D:$D,0))),NOT(ISERROR(MATCH(F283,Sources!$E:$E,0)))),5*D283+3*E283,\"\"))&IF(AND(ISERROR(MATCH(A283,Sources!$F:$F,0)),NOT(ISERROR(MATCH(F283,Sources!$G:$G,0)))),5*D283+3*E283,\"\")),\"\")","v":""},165]
["UTOPIA ISLAND",{"$f":"IFERROR(VLOOKUP(A284,Sheet2!$B$2:$C$18,2,0),\"\")","v":"Utopia"},"2018-08-19",1,0,"SAFAGA",55,null,{"$f":"IFERROR(VALUE(IF(ISERROR(MATCH(A284,Sources!$B:$B,0)),IF(ISERROR(MATCH(F284,Sources!$C:$C,0)),\"\",5*D284+3*E284),IF(AND(NOT(ISERROR(MATCH(A284,Sources!$D:$D,0))),NOT(ISERROR(MATCH(F284,Sources!$E:$E,0)))),5*D284+3*E284,\"\"))&IF(AND(ISERROR(MATCH(A284,Sources!$F:$F,0)),NOT(ISERROR(MATCH(F284,Sources!$G:$G,0)))),5*D284+3*E284,\"\")),\"\")","v":""},55]
["UTOPIA ISLAND",{"$f":"IFERROR(VLOOKUP(A285,Sheet2!$B$2:$C$18,2,0),\"\")","v":"Utopia"},"2018-08-19",1,0,"MAKADI BAY",55,"without ex ticket",{"$f":"IFERROR(VALUE(IF(ISERROR(MATCH(A285,Sources!$B:$B,0)),IF(ISERROR(MATCH(F285,Sources!$C:$C,0)),\"\",5*D285+3*E285),IF(AND(NOT(ISERROR(MATCH(A285,Sources!$D:$D,0))),NOT(ISERROR(MATCH(F285,Sources!$E:$E,0)))),5*D285+3*E285,\"\"))&IF(AND(ISERROR(MATCH(A285,Sources!$F:$F,0)),NOT(ISERROR(MATCH(F285,Sources!$G:$G,0)))),5*D285+3*E285,\"\")),\"\")","v":""},55]
["RUSALKA  ( MERMAID )",{"$f":"IFERROR(VLOOKUP(A286,Sheet2!$B$2:$C$18,2,0),\"\")","v":"Rusalka (Mermaid)"},"2018-08-20",1,0,"HURGADA",40,null,{"$f":"IFERROR(VALUE(IF(ISERROR(MATCH(A286,Sources!$B:$B,0)),IF(ISERROR(MATCH(F286,Sources!$C:$C,0)),\"\",5*D286+3*E286),IF(AND(NOT(ISERROR(MATCH(A286,Sources!$D:$D,0))),NOT(ISERROR(MATCH(F286,Sources!$E:$E,0)))),5*D286+3*E286,\"\"))&IF(AND(ISERROR(MATCH(A286,Sources!$F:$F,0)),NOT(ISERROR(MATCH(F286,Sources!$G:$G,0)))),5*D286+3*E286,\"\")),\"\")","v":""},40]
["INTRO DIVING",{"$f":"IFERROR(VLOOKUP(A287,Sheet2!$B$2:$C$18,2,0),\"\")","v":"Diving"},"2018-08-20",2,0,"HURGADA",130,null,{"$f":"IFERROR(VALUE(IF(ISERROR(MATCH(A287,Sources!$B:$B,0)),IF(ISERROR(MATCH(F287,Sources!$C:$C,0)),\"\",5*D287+3*E287),IF(AND(NOT(ISERROR(MATCH(A287,Sources!$D:$D,0))),NOT(ISERROR(MATCH(F287,Sources!$E:$E,0)))),5*D287+3*E287,\"\"))&IF(AND(ISERROR(MATCH(A287,Sources!$F:$F,0)),NOT(ISERROR(MATCH(F287,Sources!$G:$G,0)))),5*D287+3*E287,\"\")),\"\")","v":""},130]
["JUNGLE AQUAPARK",{"$f":"IFERROR(VLOOKUP(A288,Sheet2!$B$2:$C$18,2,0),\"\")","v":"Jungle Aqua Park"},"2018-08-21",3,0,"SAHL HASHEESH",150,null,{"$f":"IFERROR(VALUE(IF(ISERROR(MATCH(A288,Sources!$B:$B,0)),IF(ISERROR(MATCH(F288,Sources!$C:$C,0)),\"\",5*D288+3*E288),IF(AND(NOT(ISERROR(MATCH(A288,Sources!$D:$D,0))),NOT(ISERROR(MATCH(F288,Sources!$E:$E,0)))),5*D288+3*E288,\"\"))&IF(AND(ISERROR(MATCH(A288,Sources!$F:$F,0)),NOT(ISERROR(MATCH(F288,Sources!$G:$G,0)))),5*D288+3*E288,\"\")),\"\")","v":""},150]
["JUNGLE AQUAPARK",{"$f":"IFERROR(VLOOKUP(A289,Sheet2!$B$2:$C$18,2,0),\"\")","v":"Jungle Aqua Park"},"2018-08-21",2,0,"HURGADA",100,null,{"$f":"IFERROR(VALUE(IF(ISERROR(MATCH(A289,Sources!$B:$B,0)),IF(ISERROR(MATCH(F289,Sources!$C:$C,0)),\"\",5*D289+3*E289),IF(AND(NOT(ISERROR(MATCH(A289,Sources!$D:$D,0))),NOT(ISERROR(MATCH(F289,Sources!$E:$E,0)))),5*D289+3*E289,\"\"))&IF(AND(ISERROR(MATCH(A289,Sources!$F:$F,0)),NOT(ISERROR(MATCH(F289,Sources!$G:$G,0)))),5*D289+3*E289,\"\")),\"\")","v":""},100]
["UTOPIA ISLAND",{"$f":"IFERROR(VLOOKUP(A290,Sheet2!$B$2:$C$18,2,0),\"\")","v":"Utopia"},"2018-08-21",2,0,"HURGADA",110,null,{"$f":"IFERROR(VALUE(IF(ISERROR(MATCH(A290,Sources!$B:$B,0)),IF(ISERROR(MATCH(F290,Sources!$C:$C,0)),\"\",5*D290+3*E290),IF(AND(NOT(ISERROR(MATCH(A290,Sources!$D:$D,0))),NOT(ISERROR(MATCH(F290,Sources!$E:$E,0)))),5*D290+3*E290,\"\"))&IF(AND(ISERROR(MATCH(A290,Sources!$F:$F,0)),NOT(ISERROR(MATCH(F290,Sources!$G:$G,0)))),5*D290+3*E290,\"\")),\"\")","v":""},110]
["INTRO DIVING",{"$f":"IFERROR(VLOOKUP(A291,Sheet2!$B$2:$C$18,2,0),\"\")","v":"Diving"},"2018-08-21",2,0,"MAKADI BAY",140,null,{"$f":"IFERROR(VALUE(IF(ISERROR(MATCH(A291,Sources!$B:$B,0)),IF(ISERROR(MATCH(F291,Sources!$C:$C,0)),\"\",5*D291+3*E291),IF(AND(NOT(ISERROR(MATCH(A291,Sources!$D:$D,0))),NOT(ISERROR(MATCH(F291,Sources!$E:$E,0)))),5*D291+3*E291,\"\"))&IF(AND(ISERROR(MATCH(A291,Sources!$F:$F,0)),NOT(ISERROR(MATCH(F291,Sources!$G:$G,0)))),5*D291+3*E291,\"\")),\"\")","v":10},130]
["SNORKELING ON DIVING BOAT",{"$f":"IFERROR(VLOOKUP(A292,Sheet2!$B$2:$C$18,2,0),\"\")","v":"Snorkling"},"2018-08-21",0,1,"MAKADI BAY",23,null,{"$f":"IFERROR(VALUE(IF(ISERROR(MATCH(A292,Sources!$B:$B,0)),IF(ISERROR(MATCH(F292,Sources!$C:$C,0)),\"\",5*D292+3*E292),IF(AND(NOT(ISERROR(MATCH(A292,Sources!$D:$D,0))),NOT(ISERROR(MATCH(F292,Sources!$E:$E,0)))),5*D292+3*E292,\"\"))&IF(AND(ISERROR(MATCH(A292,Sources!$F:$F,0)),NOT(ISERROR(MATCH(F292,Sources!$G:$G,0)))),5*D292+3*E292,\"\")),\"\")","v":3},20]
["INTRO DIVING",{"$f":"IFERROR(VLOOKUP(A293,Sheet2!$B$2:$C$18,2,0),\"\")","v":"Diving"},"2018-08-21",2,0,"MAKADI BAY",140,null,{"$f":"IFERROR(VALUE(IF(ISERROR(MATCH(A293,Sources!$B:$B,0)),IF(ISERROR(MATCH(F293,Sources!$C:$C,0)),\"\",5*D293+3*E293),IF(AND(NOT(ISERROR(MATCH(A293,Sources!$D:$D,0))),NOT(ISERROR(MATCH(F293,Sources!$E:$E,0)))),5*D293+3*E293,\"\"))&IF(AND(ISERROR(MATCH(A293,Sources!$F:$F,0)),NOT(ISERROR(MATCH(F293,Sources!$G:$G,0)))),5*D293+3*E293,\"\")),\"\")","v":10},130]
["INTRO DIVING",{"$f":"IFERROR(VLOOKUP(A294,Sheet2!$B$2:$C$18,2,0),\"\")","v":"Diving"},"2018-08-21",2,0,"MAKADI BAY",140,null,{"$f":"IFERROR(VALUE(IF(ISERROR(MATCH(A294,Sources!$B:$B,0)),IF(ISERROR(MATCH(F294,Sources!$C:$C,0)),\"\",5*D294+3*E294),IF(AND(NOT(ISERROR(MATCH(A294,Sources!$D:$D,0))),NOT(ISERROR(MATCH(F294,Sources!$E:$E,0)))),5*D294+3*E294,\"\"))&IF(AND(ISERROR(MATCH(A294,Sources!$F:$F,0)),NOT(ISERROR(MATCH(F294,Sources!$G:$G,0)))),5*D294+3*E294,\"\")),\"\")","v":10},130]
["INTRO DIVING",{"$f":"IFERROR(VLOOKUP(A295,Sheet2!$B$2:$C$18,2,0),\"\")","v":"Diving"},"2018-08-21",1,0,"MAKADI BAY",70,null,{"$f":"IFERROR(VALUE(IF(ISERROR(MATCH(A295,Sources!$B:$B,0)),IF(ISERROR(MATCH(F295,Sources!$C:$C,0)),\"\",5*D295+3*E295),IF(AND(NOT(ISERROR(MATCH(A295,Sources!$D:$D,0))),NOT(ISERROR(MATCH(F295,Sources!$E:$E,0)))),5*D295+3*E295,\"\"))&IF(AND(ISERROR(MATCH(A295,Sources!$F:$F,0)),NOT(ISERROR(MATCH(F295,Sources!$G:$G,0)))),5*D295+3*E295,\"\")),\"\")","v":5},65]
["UTOPIA ISLAND",{"$f":"IFERROR(VLOOKUP(A296,Sheet2!$B$2:$C$18,2,0),\"\")","v":"Utopia"},"2018-08-21",3,0,"MAKADI BAY",165,null,{"$f":"IFERROR(VALUE(IF(ISERROR(MATCH(A296,Sources!$B:$B,0)),IF(ISERROR(MATCH(F296,Sources!$C:$C,0)),\"\",5*D296+3*E296),IF(AND(NOT(ISERROR(MATCH(A296,Sources!$D:$D,0))),NOT(ISERROR(MATCH(F296,Sources!$E:$E,0)))),5*D296+3*E296,\"\"))&IF(AND(ISERROR(MATCH(A296,Sources!$F:$F,0)),NOT(ISERROR(MATCH(F296,Sources!$G:$G,0)))),5*D296+3*E296,\"\")),\"\")","v":""},165]
["SUBMARINE",{"$f":"IFERROR(VLOOKUP(A297,Sheet2!$B$2:$C$18,2,0),\"\")","v":"Submarine"},"2018-08-21",3,0,"MAKADI BAY",189,null,{"$f":"IFERROR(VALUE(IF(ISERROR(MATCH(A297,Sources!$B:$B,0)),IF(ISERROR(MATCH(F297,Sources!$C:$C,0)),\"\",5*D297+3*E297),IF(AND(NOT(ISERROR(MATCH(A297,Sources!$D:$D,0))),NOT(ISERROR(MATCH(F297,Sources!$E:$E,0)))),5*D297+3*E297,\"\"))&IF(AND(ISERROR(MATCH(A297,Sources!$F:$F,0)),NOT(ISERROR(MATCH(F297,Sources!$G:$G,0)))),5*D297+3*E297,\"\")),\"\")","v":15},174]
["UTOPIA ISLAND",{"$f":"IFERROR(VLOOKUP(A298,Sheet2!$B$2:$C$18,2,0),\"\")","v":"Utopia"},"2018-08-21",2,0,"HURGADA",110,null,{"$f":"IFERROR(VALUE(IF(ISERROR(MATCH(A298,Sources!$B:$B,0)),IF(ISERROR(MATCH(F298,Sources!$C:$C,0)),\"\",5*D298+3*E298),IF(AND(NOT(ISERROR(MATCH(A298,Sources!$D:$D,0))),NOT(ISERROR(MATCH(F298,Sources!$E:$E,0)))),5*D298+3*E298,\"\"))&IF(AND(ISERROR(MATCH(A298,Sources!$F:$F,0)),NOT(ISERROR(MATCH(F298,Sources!$G:$G,0)))),5*D298+3*E298,\"\")),\"\")","v":""},110]
["UTOPIA ISLAND",{"$f":"IFERROR(VLOOKUP(A299,Sheet2!$B$2:$C$18,2,0),\"\")","v":"Utopia"},"2018-08-21",2,1,"HURGADA",138,null,{"$f":"IFERROR(VALUE(IF(ISERROR(MATCH(A299,Sources!$B:$B,0)),IF(ISERROR(MATCH(F299,Sources!$C:$C,0)),\"\",5*D299+3*E299),IF(AND(NOT(ISERROR(MATCH(A299,Sources!$D:$D,0))),NOT(ISERROR(MATCH(F299,Sources!$E:$E,0)))),5*D299+3*E299,\"\"))&IF(AND(ISERROR(MATCH(A299,Sources!$F:$F,0)),NOT(ISERROR(MATCH(F299,Sources!$G:$G,0)))),5*D299+3*E299,\"\")),\"\")","v":""},138]
["UTOPIA ISLAND",{"$f":"IFERROR(VLOOKUP(A300,Sheet2!$B$2:$C$18,2,0),\"\")","v":"Utopia"},"2018-08-21",1,1,"MAKADI BAY",83,null,{"$f":"IFERROR(VALUE(IF(ISERROR(MATCH(A300,Sources!$B:$B,0)),IF(ISERROR(MATCH(F300,Sources!$C:$C,0)),\"\",5*D300+3*E300),IF(AND(NOT(ISERROR(MATCH(A300,Sources!$D:$D,0))),NOT(ISERROR(MATCH(F300,Sources!$E:$E,0)))),5*D300+3*E300,\"\"))&IF(AND(ISERROR(MATCH(A300,Sources!$F:$F,0)),NOT(ISERROR(MATCH(F300,Sources!$G:$G,0)))),5*D300+3*E300,\"\")),\"\")","v":""},83]
["UTOPIA ISLAND",{"$f":"IFERROR(VLOOKUP(A301,Sheet2!$B$2:$C$18,2,0),\"\")","v":"Utopia"},"2018-08-21",1,1,"MAKADI BAY",83,null,{"$f":"IFERROR(VALUE(IF(ISERROR(MATCH(A301,Sources!$B:$B,0)),IF(ISERROR(MATCH(F301,Sources!$C:$C,0)),\"\",5*D301+3*E301),IF(AND(NOT(ISERROR(MATCH(A301,Sources!$D:$D,0))),NOT(ISERROR(MATCH(F301,Sources!$E:$E,0)))),5*D301+3*E301,\"\"))&IF(AND(ISERROR(MATCH(A301,Sources!$F:$F,0)),NOT(ISERROR(MATCH(F301,Sources!$G:$G,0)))),5*D301+3*E301,\"\")),\"\")","v":""},83]
["SUBMARINE",{"$f":"IFERROR(VLOOKUP(A302,Sheet2!$B$2:$C$18,2,0),\"\")","v":"Submarine"},"2018-08-21",0,1,"MAKADI BAY",32,null,{"$f":"IFERROR(VALUE(IF(ISERROR(MATCH(A302,Sources!$B:$B,0)),IF(ISERROR(MATCH(F302,Sources!$C:$C,0)),\"\",5*D302+3*E302),IF(AND(NOT(ISERROR(MATCH(A302,Sources!$D:$D,0))),NOT(ISERROR(MATCH(F302,Sources!$E:$E,0)))),5*D302+3*E302,\"\"))&IF(AND(ISERROR(MATCH(A302,Sources!$F:$F,0)),NOT(ISERROR(MATCH(F302,Sources!$G:$G,0)))),5*D302+3*E302,\"\")),\"\")","v":3},29]
["OVER DAY LUXORQUEEN VALLY",{"$f":"IFERROR(VLOOKUP(A303,Sheet2!$B$2:$C$18,2,0),\"\")","v":"LUXOR 2"},"2018-08-21",2,0,"HURGADA",180,"ukraine",{"$f":"IFERROR(VALUE(IF(ISERROR(MATCH(A303,Sources!$B:$B,0)),IF(ISERROR(MATCH(F303,Sources!$C:$C,0)),\"\",5*D303+3*E303),IF(AND(NOT(ISERROR(MATCH(A303,Sources!$D:$D,0))),NOT(ISERROR(MATCH(F303,Sources!$E:$E,0)))),5*D303+3*E303,\"\"))&IF(AND(ISERROR(MATCH(A303,Sources!$F:$F,0)),NOT(ISERROR(MATCH(F303,Sources!$G:$G,0)))),5*D303+3*E303,\"\")),\"\")","v":""},180]
["UTOPIA ISLAND",{"$f":"IFERROR(VLOOKUP(A304,Sheet2!$B$2:$C$18,2,0),\"\")","v":"Utopia"},"2018-08-21",3,1,"EL GOUNA",213,null,{"$f":"IFERROR(VALUE(IF(ISERROR(MATCH(A304,Sources!$B:$B,0)),IF(ISERROR(MATCH(F304,Sources!$C:$C,0)),\"\",5*D304+3*E304),IF(AND(NOT(ISERROR(MATCH(A304,Sources!$D:$D,0))),NOT(ISERROR(MATCH(F304,Sources!$E:$E,0)))),5*D304+3*E304,\"\"))&IF(AND(ISERROR(MATCH(A304,Sources!$F:$F,0)),NOT(ISERROR(MATCH(F304,Sources!$G:$G,0)))),5*D304+3*E304,\"\")),\"\")","v":18},195]
["OVER DAY LUXORQUEEN VALLY",{"$f":"IFERROR(VLOOKUP(A305,Sheet2!$B$2:$C$18,2,0),\"\")","v":"LUXOR 2"},"2018-08-21",2,1,"HURGADA",225,"ukraine",{"$f":"IFERROR(VALUE(IF(ISERROR(MATCH(A305,Sources!$B:$B,0)),IF(ISERROR(MATCH(F305,Sources!$C:$C,0)),\"\",5*D305+3*E305),IF(AND(NOT(ISERROR(MATCH(A305,Sources!$D:$D,0))),NOT(ISERROR(MATCH(F305,Sources!$E:$E,0)))),5*D305+3*E305,\"\"))&IF(AND(ISERROR(MATCH(A305,Sources!$F:$F,0)),NOT(ISERROR(MATCH(F305,Sources!$G:$G,0)))),5*D305+3*E305,\"\")),\"\")","v":""},225]
["OVER DAY LUXORQUEEN VALLY",{"$f":"IFERROR(VLOOKUP(A306,Sheet2!$B$2:$C$18,2,0),\"\")","v":"LUXOR 2"},"2018-08-21",1,0,"HURGADA",90,"ukraine",{"$f":"IFERROR(VALUE(IF(ISERROR(MATCH(A306,Sources!$B:$B,0)),IF(ISERROR(MATCH(F306,Sources!$C:$C,0)),\"\",5*D306+3*E306),IF(AND(NOT(ISERROR(MATCH(A306,Sources!$D:$D,0))),NOT(ISERROR(MATCH(F306,Sources!$E:$E,0)))),5*D306+3*E306,\"\"))&IF(AND(ISERROR(MATCH(A306,Sources!$F:$F,0)),NOT(ISERROR(MATCH(F306,Sources!$G:$G,0)))),5*D306+3*E306,\"\")),\"\")","v":""},90]
["OVER DAY LUXORQUEEN VALLY",{"$f":"IFERROR(VLOOKUP(A307,Sheet2!$B$2:$C$18,2,0),\"\")","v":"LUXOR 2"},"2018-08-21",1,0,"HURGADA",90,"ukraine",{"$f":"IFERROR(VALUE(IF(ISERROR(MATCH(A307,Sources!$B:$B,0)),IF(ISERROR(MATCH(F307,Sources!$C:$C,0)),\"\",5*D307+3*E307),IF(AND(NOT(ISERROR(MATCH(A307,Sources!$D:$D,0))),NOT(ISERROR(MATCH(F307,Sources!$E:$E,0)))),5*D307+3*E307,\"\"))&IF(AND(ISERROR(MATCH(A307,Sources!$F:$F,0)),NOT(ISERROR(MATCH(F307,Sources!$G:$G,0)))),5*D307+3*E307,\"\")),\"\")","v":""},90]
["OVER DAY LUXORQUEEN VALLY",{"$f":"IFERROR(VLOOKUP(A308,Sheet2!$B$2:$C$18,2,0),\"\")","v":"LUXOR 2"},"2018-08-21",2,0,"HURGADA",180,"Belarus",{"$f":"IFERROR(VALUE(IF(ISERROR(MATCH(A308,Sources!$B:$B,0)),IF(ISERROR(MATCH(F308,Sources!$C:$C,0)),\"\",5*D308+3*E308),IF(AND(NOT(ISERROR(MATCH(A308,Sources!$D:$D,0))),NOT(ISERROR(MATCH(F308,Sources!$E:$E,0)))),5*D308+3*E308,\"\"))&IF(AND(ISERROR(MATCH(A308,Sources!$F:$F,0)),NOT(ISERROR(MATCH(F308,Sources!$G:$G,0)))),5*D308+3*E308,\"\")),\"\")","v":""},180]
["OVER DAY LUXORQUEEN VALLY",{"$f":"IFERROR(VLOOKUP(A309,Sheet2!$B$2:$C$18,2,0),\"\")","v":"LUXOR 2"},"2018-08-21",2,0,"HURGADA",180,"ukraine",{"$f":"IFERROR(VALUE(IF(ISERROR(MATCH(A309,Sources!$B:$B,0)),IF(ISERROR(MATCH(F309,Sources!$C:$C,0)),\"\",5*D309+3*E309),IF(AND(NOT(ISERROR(MATCH(A309,Sources!$D:$D,0))),NOT(ISERROR(MATCH(F309,Sources!$E:$E,0)))),5*D309+3*E309,\"\"))&IF(AND(ISERROR(MATCH(A309,Sources!$F:$F,0)),NOT(ISERROR(MATCH(F309,Sources!$G:$G,0)))),5*D309+3*E309,\"\")),\"\")","v":""},180]
["INTRO DIVING",{"$f":"IFERROR(VLOOKUP(A310,Sheet2!$B$2:$C$18,2,0),\"\")","v":"Diving"},"2018-08-21",2,0,"HURGADA",130,null,{"$f":"IFERROR(VALUE(IF(ISERROR(MATCH(A310,Sources!$B:$B,0)),IF(ISERROR(MATCH(F310,Sources!$C:$C,0)),\"\",5*D310+3*E310),IF(AND(NOT(ISERROR(MATCH(A310,Sources!$D:$D,0))),NOT(ISERROR(MATCH(F310,Sources!$E:$E,0)))),5*D310+3*E310,\"\"))&IF(AND(ISERROR(MATCH(A310,Sources!$F:$F,0)),NOT(ISERROR(MATCH(F310,Sources!$G:$G,0)))),5*D310+3*E310,\"\")),\"\")","v":""},130]
["UTOPIA ISLAND",{"$f":"IFERROR(VLOOKUP(A311,Sheet2!$B$2:$C$18,2,0),\"\")","v":"Utopia"},"2018-08-21",2,0,"MAKADI BAY",110,null,{"$f":"IFERROR(VALUE(IF(ISERROR(MATCH(A311,Sources!$B:$B,0)),IF(ISERROR(MATCH(F311,Sources!$C:$C,0)),\"\",5*D311+3*E311),IF(AND(NOT(ISERROR(MATCH(A311,Sources!$D:$D,0))),NOT(ISERROR(MATCH(F311,Sources!$E:$E,0)))),5*D311+3*E311,\"\"))&IF(AND(ISERROR(MATCH(A311,Sources!$F:$F,0)),NOT(ISERROR(MATCH(F311,Sources!$G:$G,0)))),5*D311+3*E311,\"\")),\"\")","v":""},110]
["OVER DAY LUXORQUEEN VALLY",{"$f":"IFERROR(VLOOKUP(A312,Sheet2!$B$2:$C$18,2,0),\"\")","v":"LUXOR 2"},"2018-08-21",1,0,"MAKADI BAY",90,null,{"$f":"IFERROR(VALUE(IF(ISERROR(MATCH(A312,Sources!$B:$B,0)),IF(ISERROR(MATCH(F312,Sources!$C:$C,0)),\"\",5*D312+3*E312),IF(AND(NOT(ISERROR(MATCH(A312,Sources!$D:$D,0))),NOT(ISERROR(MATCH(F312,Sources!$E:$E,0)))),5*D312+3*E312,\"\"))&IF(AND(ISERROR(MATCH(A312,Sources!$F:$F,0)),NOT(ISERROR(MATCH(F312,Sources!$G:$G,0)))),5*D312+3*E312,\"\")),\"\")","v":""},90]
["OVER DAY LUXORQUEEN VALLY",{"$f":"IFERROR(VLOOKUP(A313,Sheet2!$B$2:$C$18,2,0),\"\")","v":"LUXOR 2"},"2018-08-21",1,1,"MAKADI BAY",135,null,{"$f":"IFERROR(VALUE(IF(ISERROR(MATCH(A313,Sources!$B:$B,0)),IF(ISERROR(MATCH(F313,Sources!$C:$C,0)),\"\",5*D313+3*E313),IF(AND(NOT(ISERROR(MATCH(A313,Sources!$D:$D,0))),NOT(ISERROR(MATCH(F313,Sources!$E:$E,0)))),5*D313+3*E313,\"\"))&IF(AND(ISERROR(MATCH(A313,Sources!$F:$F,0)),NOT(ISERROR(MATCH(F313,Sources!$G:$G,0)))),5*D313+3*E313,\"\")),\"\")","v":""},135]
["OVER DAY LUXORQUEEN VALLY",{"$f":"IFERROR(VLOOKUP(A314,Sheet2!$B$2:$C$18,2,0),\"\")","v":"LUXOR 2"},"2018-08-21",3,0,"HURGADA",270,"Belarus",{"$f":"IFERROR(VALUE(IF(ISERROR(MATCH(A314,Sources!$B:$B,0)),IF(ISERROR(MATCH(F314,Sources!$C:$C,0)),\"\",5*D314+3*E314),IF(AND(NOT(ISERROR(MATCH(A314,Sources!$D:$D,0))),NOT(ISERROR(MATCH(F314,Sources!$E:$E,0)))),5*D314+3*E314,\"\"))&IF(AND(ISERROR(MATCH(A314,Sources!$F:$F,0)),NOT(ISERROR(MATCH(F314,Sources!$G:$G,0)))),5*D314+3*E314,\"\")),\"\")","v":""},270]
["OVER DAY LUXORQUEEN VALLY",{"$f":"IFERROR(VLOOKUP(A315,Sheet2!$B$2:$C$18,2,0),\"\")","v":"LUXOR 2"},"2018-08-21",2,0,"HURGADA",180,"belarus",{"$f":"IFERROR(VALUE(IF(ISERROR(MATCH(A315,Sources!$B:$B,0)),IF(ISERROR(MATCH(F315,Sources!$C:$C,0)),\"\",5*D315+3*E315),IF(AND(NOT(ISERROR(MATCH(A315,Sources!$D:$D,0))),NOT(ISERROR(MATCH(F315,Sources!$E:$E,0)))),5*D315+3*E315,\"\"))&IF(AND(ISERROR(MATCH(A315,Sources!$F:$F,0)),NOT(ISERROR(MATCH(F315,Sources!$G:$G,0)))),5*D315+3*E315,\"\")),\"\")","v":""},180]
["MOTO 1 HOUR",{"$f":"IFERROR(VLOOKUP(A316,Sheet2!$B$2:$C$18,2,0),\"\")","v":"Moto 1 Hour"},"2018-08-22",2,0,"HURGADA",80,null,{"$f":"IFERROR(VALUE(IF(ISERROR(MATCH(A316,Sources!$B:$B,0)),IF(ISERROR(MATCH(F316,Sources!$C:$C,0)),\"\",5*D316+3*E316),IF(AND(NOT(ISERROR(MATCH(A316,Sources!$D:$D,0))),NOT(ISERROR(MATCH(F316,Sources!$E:$E,0)))),5*D316+3*E316,\"\"))&IF(AND(ISERROR(MATCH(A316,Sources!$F:$F,0)),NOT(ISERROR(MATCH(F316,Sources!$G:$G,0)))),5*D316+3*E316,\"\")),\"\")","v":""},80]
["MOTO2",{"$f":"IFERROR(VLOOKUP(A317,Sheet2!$B$2:$C$18,2,0),\"\")","v":"Moto 2"},"2018-08-22",2,0,"MAKADI BAY",100,null,{"$f":"IFERROR(VALUE(IF(ISERROR(MATCH(A317,Sources!$B:$B,0)),IF(ISERROR(MATCH(F317,Sources!$C:$C,0)),\"\",5*D317+3*E317),IF(AND(NOT(ISERROR(MATCH(A317,Sources!$D:$D,0))),NOT(ISERROR(MATCH(F317,Sources!$E:$E,0)))),5*D317+3*E317,\"\"))&IF(AND(ISERROR(MATCH(A317,Sources!$F:$F,0)),NOT(ISERROR(MATCH(F317,Sources!$G:$G,0)))),5*D317+3*E317,\"\")),\"\")","v":10},90]
["MOTO2",{"$f":"IFERROR(VLOOKUP(A318,Sheet2!$B$2:$C$18,2,0),\"\")","v":"Moto 2"},"2018-08-22",2,0,"HURGADA",90,null,{"$f":"IFERROR(VALUE(IF(ISERROR(MATCH(A318,Sources!$B:$B,0)),IF(ISERROR(MATCH(F318,Sources!$C:$C,0)),\"\",5*D318+3*E318),IF(AND(NOT(ISERROR(MATCH(A318,Sources!$D:$D,0))),NOT(ISERROR(MATCH(F318,Sources!$E:$E,0)))),5*D318+3*E318,\"\"))&IF(AND(ISERROR(MATCH(A318,Sources!$F:$F,0)),NOT(ISERROR(MATCH(F318,Sources!$G:$G,0)))),5*D318+3*E318,\"\")),\"\")","v":""},90]
["MOTO2",{"$f":"IFERROR(VLOOKUP(A319,Sheet2!$B$2:$C$18,2,0),\"\")","v":"Moto 2"},"2018-08-22",4,0,"HURGADA",180,null,{"$f":"IFERROR(VALUE(IF(ISERROR(MATCH(A319,Sources!$B:$B,0)),IF(ISERROR(MATCH(F319,Sources!$C:$C,0)),\"\",5*D319+3*E319),IF(AND(NOT(ISERROR(MATCH(A319,Sources!$D:$D,0))),NOT(ISERROR(MATCH(F319,Sources!$E:$E,0)))),5*D319+3*E319,\"\"))&IF(AND(ISERROR(MATCH(A319,Sources!$F:$F,0)),NOT(ISERROR(MATCH(F319,Sources!$G:$G,0)))),5*D319+3*E319,\"\")),\"\")","v":""},180]
["MOTO2",{"$f":"IFERROR(VLOOKUP(A320,Sheet2!$B$2:$C$18,2,0),\"\")","v":"Moto 2"},"2018-08-22",2,0,"HURGADA",90,null,{"$f":"IFERROR(VALUE(IF(ISERROR(MATCH(A320,Sources!$B:$B,0)),IF(ISERROR(MATCH(F320,Sources!$C:$C,0)),\"\",5*D320+3*E320),IF(AND(NOT(ISERROR(MATCH(A320,Sources!$D:$D,0))),NOT(ISERROR(MATCH(F320,Sources!$E:$E,0)))),5*D320+3*E320,\"\"))&IF(AND(ISERROR(MATCH(A320,Sources!$F:$F,0)),NOT(ISERROR(MATCH(F320,Sources!$G:$G,0)))),5*D320+3*E320,\"\")),\"\")","v":""},90]
["MOTO2",{"$f":"IFERROR(VLOOKUP(A321,Sheet2!$B$2:$C$18,2,0),\"\")","v":"Moto 2"},"2018-08-22",2,0,"HURGADA",90,null,{"$f":"IFERROR(VALUE(IF(ISERROR(MATCH(A321,Sources!$B:$B,0)),IF(ISERROR(MATCH(F321,Sources!$C:$C,0)),\"\",5*D321+3*E321),IF(AND(NOT(ISERROR(MATCH(A321,Sources!$D:$D,0))),NOT(ISERROR(MATCH(F321,Sources!$E:$E,0)))),5*D321+3*E321,\"\"))&IF(AND(ISERROR(MATCH(A321,Sources!$F:$F,0)),NOT(ISERROR(MATCH(F321,Sources!$G:$G,0)))),5*D321+3*E321,\"\")),\"\")","v":""},90]
["MOTO2",{"$f":"IFERROR(VLOOKUP(A322,Sheet2!$B$2:$C$18,2,0),\"\")","v":"Moto 2"},"2018-08-22",2,1,"MAKADI BAY",126,null,{"$f":"IFERROR(VALUE(IF(ISERROR(MATCH(A322,Sources!$B:$B,0)),IF(ISERROR(MATCH(F322,Sources!$C:$C,0)),\"\",5*D322+3*E322),IF(AND(NOT(ISERROR(MATCH(A322,Sources!$D:$D,0))),NOT(ISERROR(MATCH(F322,Sources!$E:$E,0)))),5*D322+3*E322,\"\"))&IF(AND(ISERROR(MATCH(A322,Sources!$F:$F,0)),NOT(ISERROR(MATCH(F322,Sources!$G:$G,0)))),5*D322+3*E322,\"\")),\"\")","v":13},113]
["MOTO2",{"$f":"IFERROR(VLOOKUP(A323,Sheet2!$B$2:$C$18,2,0),\"\")","v":"Moto 2"},"2018-08-22",2,0,"MAKADI BAY",100,null,{"$f":"IFERROR(VALUE(IF(ISERROR(MATCH(A323,Sources!$B:$B,0)),IF(ISERROR(MATCH(F323,Sources!$C:$C,0)),\"\",5*D323+3*E323),IF(AND(NOT(ISERROR(MATCH(A323,Sources!$D:$D,0))),NOT(ISERROR(MATCH(F323,Sources!$E:$E,0)))),5*D323+3*E323,\"\"))&IF(AND(ISERROR(MATCH(A323,Sources!$F:$F,0)),NOT(ISERROR(MATCH(F323,Sources!$G:$G,0)))),5*D323+3*E323,\"\")),\"\")","v":10},{"$f":"IF(I323=\"\",G323,(G323-I323))","v":90}]
["MOTO2",{"$f":"IFERROR(VLOOKUP(A324,Sheet2!$B$2:$C$18,2,0),\"\")","v":"Moto 2"},"2018-08-22",2,1,"MAKADI BAY",126,null,{"$f":"IFERROR(VALUE(IF(ISERROR(MATCH(A324,Sources!$B:$B,0)),IF(ISERROR(MATCH(F324,Sources!$C:$C,0)),\"\",5*D324+3*E324),IF(AND(NOT(ISERROR(MATCH(A324,Sources!$D:$D,0))),NOT(ISERROR(MATCH(F324,Sources!$E:$E,0)))),5*D324+3*E324,\"\"))&IF(AND(ISERROR(MATCH(A324,Sources!$F:$F,0)),NOT(ISERROR(MATCH(F324,Sources!$G:$G,0)))),5*D324+3*E324,\"\")),\"\")","v":13},113]
["MOTO2",{"$f":"IFERROR(VLOOKUP(A325,Sheet2!$B$2:$C$18,2,0),\"\")","v":"Moto 2"},"2018-08-22",2,1,"MAKADI BAY",126,null,{"$f":"IFERROR(VALUE(IF(ISERROR(MATCH(A325,Sources!$B:$B,0)),IF(ISERROR(MATCH(F325,Sources!$C:$C,0)),\"\",5*D325+3*E325),IF(AND(NOT(ISERROR(MATCH(A325,Sources!$D:$D,0))),NOT(ISERROR(MATCH(F325,Sources!$E:$E,0)))),5*D325+3*E325,\"\"))&IF(AND(ISERROR(MATCH(A325,Sources!$F:$F,0)),NOT(ISERROR(MATCH(F325,Sources!$G:$G,0)))),5*D325+3*E325,\"\")),\"\")","v":13},113]
["MOTO2",{"$f":"IFERROR(VLOOKUP(A326,Sheet2!$B$2:$C$18,2,0),\"\")","v":"Moto 2"},"2018-08-22",3,0,"MAKADI BAY",150,null,{"$f":"IFERROR(VALUE(IF(ISERROR(MATCH(A326,Sources!$B:$B,0)),IF(ISERROR(MATCH(F326,Sources!$C:$C,0)),\"\",5*D326+3*E326),IF(AND(NOT(ISERROR(MATCH(A326,Sources!$D:$D,0))),NOT(ISERROR(MATCH(F326,Sources!$E:$E,0)))),5*D326+3*E326,\"\"))&IF(AND(ISERROR(MATCH(A326,Sources!$F:$F,0)),NOT(ISERROR(MATCH(F326,Sources!$G:$G,0)))),5*D326+3*E326,\"\")),\"\")","v":15},135]
["MOTO2",{"$f":"IFERROR(VLOOKUP(A327,Sheet2!$B$2:$C$18,2,0),\"\")","v":"Moto 2"},"2018-08-22",1,1,"MAKADI BAY",76,null,{"$f":"IFERROR(VALUE(IF(ISERROR(MATCH(A327,Sources!$B:$B,0)),IF(ISERROR(MATCH(F327,Sources!$C:$C,0)),\"\",5*D327+3*E327),IF(AND(NOT(ISERROR(MATCH(A327,Sources!$D:$D,0))),NOT(ISERROR(MATCH(F327,Sources!$E:$E,0)))),5*D327+3*E327,\"\"))&IF(AND(ISERROR(MATCH(A327,Sources!$F:$F,0)),NOT(ISERROR(MATCH(F327,Sources!$G:$G,0)))),5*D327+3*E327,\"\")),\"\")","v":8},68]
["OVER DAY LUXORQUEEN VALLY",{"$f":"IFERROR(VLOOKUP(A328,Sheet2!$B$2:$C$18,2,0),\"\")","v":"LUXOR 2"},"2018-08-22",3,1,"SOMA BAY",510,null,{"$f":"IFERROR(VALUE(IF(ISERROR(MATCH(A328,Sources!$B:$B,0)),IF(ISERROR(MATCH(F328,Sources!$C:$C,0)),\"\",5*D328+3*E328),IF(AND(NOT(ISERROR(MATCH(A328,Sources!$D:$D,0))),NOT(ISERROR(MATCH(F328,Sources!$E:$E,0)))),5*D328+3*E328,\"\"))&IF(AND(ISERROR(MATCH(A328,Sources!$F:$F,0)),NOT(ISERROR(MATCH(F328,Sources!$G:$G,0)))),5*D328+3*E328,\"\")),\"\")","v":""},510]
["INTRO DIVING",{"$f":"IFERROR(VLOOKUP(A329,Sheet2!$B$2:$C$18,2,0),\"\")","v":"Diving"},"2018-08-22",2,0,"MAKADI BAY",140,null,{"$f":"IFERROR(VALUE(IF(ISERROR(MATCH(A329,Sources!$B:$B,0)),IF(ISERROR(MATCH(F329,Sources!$C:$C,0)),\"\",5*D329+3*E329),IF(AND(NOT(ISERROR(MATCH(A329,Sources!$D:$D,0))),NOT(ISERROR(MATCH(F329,Sources!$E:$E,0)))),5*D329+3*E329,\"\"))&IF(AND(ISERROR(MATCH(A329,Sources!$F:$F,0)),NOT(ISERROR(MATCH(F329,Sources!$G:$G,0)))),5*D329+3*E329,\"\")),\"\")","v":10},130]
["MOTO2",{"$f":"IFERROR(VLOOKUP(A330,Sheet2!$B$2:$C$18,2,0),\"\")","v":"Moto 2"},"2018-08-22",3,2,"HURGADA",270,null,{"$f":"IFERROR(VALUE(IF(ISERROR(MATCH(A330,Sources!$B:$B,0)),IF(ISERROR(MATCH(F330,Sources!$C:$C,0)),\"\",5*D330+3*E330),IF(AND(NOT(ISERROR(MATCH(A330,Sources!$D:$D,0))),NOT(ISERROR(MATCH(F330,Sources!$E:$E,0)))),5*D330+3*E330,\"\"))&IF(AND(ISERROR(MATCH(A330,Sources!$F:$F,0)),NOT(ISERROR(MATCH(F330,Sources!$G:$G,0)))),5*D330+3*E330,\"\")),\"\")","v":""},270]
["UTOPIA ISLAND",{"$f":"IFERROR(VLOOKUP(A331,Sheet2!$B$2:$C$18,2,0),\"\")","v":"Utopia"},"2018-08-23",2,1,"HURGADA",138,null,{"$f":"IFERROR(VALUE(IF(ISERROR(MATCH(A331,Sources!$B:$B,0)),IF(ISERROR(MATCH(F331,Sources!$C:$C,0)),\"\",5*D331+3*E331),IF(AND(NOT(ISERROR(MATCH(A331,Sources!$D:$D,0))),NOT(ISERROR(MATCH(F331,Sources!$E:$E,0)))),5*D331+3*E331,\"\"))&IF(AND(ISERROR(MATCH(A331,Sources!$F:$F,0)),NOT(ISERROR(MATCH(F331,Sources!$G:$G,0)))),5*D331+3*E331,\"\")),\"\")","v":""},138]
["UTOPIA ISLAND",{"$f":"IFERROR(VLOOKUP(A332,Sheet2!$B$2:$C$18,2,0),\"\")","v":"Utopia"},"2018-08-23",5,0,"HURGADA",260,"15 $ DISCOUNT",{"$f":"IFERROR(VALUE(IF(ISERROR(MATCH(A332,Sources!$B:$B,0)),IF(ISERROR(MATCH(F332,Sources!$C:$C,0)),\"\",5*D332+3*E332),IF(AND(NOT(ISERROR(MATCH(A332,Sources!$D:$D,0))),NOT(ISERROR(MATCH(F332,Sources!$E:$E,0)))),5*D332+3*E332,\"\"))&IF(AND(ISERROR(MATCH(A332,Sources!$F:$F,0)),NOT(ISERROR(MATCH(F332,Sources!$G:$G,0)))),5*D332+3*E332,\"\")),\"\")","v":""},260]
["UTOPIA ISLAND",{"$f":"IFERROR(VLOOKUP(A333,Sheet2!$B$2:$C$18,2,0),\"\")","v":"Utopia"},"2018-08-23",2,0,"HURGADA",110,null,{"$f":"IFERROR(VALUE(IF(ISERROR(MATCH(A333,Sources!$B:$B,0)),IF(ISERROR(MATCH(F333,Sources!$C:$C,0)),\"\",5*D333+3*E333),IF(AND(NOT(ISERROR(MATCH(A333,Sources!$D:$D,0))),NOT(ISERROR(MATCH(F333,Sources!$E:$E,0)))),5*D333+3*E333,\"\"))&IF(AND(ISERROR(MATCH(A333,Sources!$F:$F,0)),NOT(ISERROR(MATCH(F333,Sources!$G:$G,0)))),5*D333+3*E333,\"\")),\"\")","v":""},110]
["UTOPIA ISLAND",{"$f":"IFERROR(VLOOKUP(A334,Sheet2!$B$2:$C$18,2,0),\"\")","v":"Utopia"},"2018-08-23",1,0,"HURGADA",55,null,{"$f":"IFERROR(VALUE(IF(ISERROR(MATCH(A334,Sources!$B:$B,0)),IF(ISERROR(MATCH(F334,Sources!$C:$C,0)),\"\",5*D334+3*E334),IF(AND(NOT(ISERROR(MATCH(A334,Sources!$D:$D,0))),NOT(ISERROR(MATCH(F334,Sources!$E:$E,0)))),5*D334+3*E334,\"\"))&IF(AND(ISERROR(MATCH(A334,Sources!$F:$F,0)),NOT(ISERROR(MATCH(F334,Sources!$G:$G,0)))),5*D334+3*E334,\"\")),\"\")","v":""},55]
["UTOPIA ISLAND",{"$f":"IFERROR(VLOOKUP(A335,Sheet2!$B$2:$C$18,2,0),\"\")","v":"Utopia"},"2018-08-23",2,0,"MAKADI BAY",110,null,{"$f":"IFERROR(VALUE(IF(ISERROR(MATCH(A335,Sources!$B:$B,0)),IF(ISERROR(MATCH(F335,Sources!$C:$C,0)),\"\",5*D335+3*E335),IF(AND(NOT(ISERROR(MATCH(A335,Sources!$D:$D,0))),NOT(ISERROR(MATCH(F335,Sources!$E:$E,0)))),5*D335+3*E335,\"\"))&IF(AND(ISERROR(MATCH(A335,Sources!$F:$F,0)),NOT(ISERROR(MATCH(F335,Sources!$G:$G,0)))),5*D335+3*E335,\"\")),\"\")","v":""},110]
["UTOPIA ISLAND",{"$f":"IFERROR(VLOOKUP(A336,Sheet2!$B$2:$C$18,2,0),\"\")","v":"Utopia"},"2018-08-23",3,1,"MAKADI BAY",193,null,{"$f":"IFERROR(VALUE(IF(ISERROR(MATCH(A336,Sources!$B:$B,0)),IF(ISERROR(MATCH(F336,Sources!$C:$C,0)),\"\",5*D336+3*E336),IF(AND(NOT(ISERROR(MATCH(A336,Sources!$D:$D,0))),NOT(ISERROR(MATCH(F336,Sources!$E:$E,0)))),5*D336+3*E336,\"\"))&IF(AND(ISERROR(MATCH(A336,Sources!$F:$F,0)),NOT(ISERROR(MATCH(F336,Sources!$G:$G,0)))),5*D336+3*E336,\"\")),\"\")","v":""},193]
["UTOPIA ISLAND",{"$f":"IFERROR(VLOOKUP(A337,Sheet2!$B$2:$C$18,2,0),\"\")","v":"Utopia"},"2018-08-23",2,0,"MAKADI BAY",110,null,{"$f":"IFERROR(VALUE(IF(ISERROR(MATCH(A337,Sources!$B:$B,0)),IF(ISERROR(MATCH(F337,Sources!$C:$C,0)),\"\",5*D337+3*E337),IF(AND(NOT(ISERROR(MATCH(A337,Sources!$D:$D,0))),NOT(ISERROR(MATCH(F337,Sources!$E:$E,0)))),5*D337+3*E337,\"\"))&IF(AND(ISERROR(MATCH(A337,Sources!$F:$F,0)),NOT(ISERROR(MATCH(F337,Sources!$G:$G,0)))),5*D337+3*E337,\"\")),\"\")","v":""},110]
["UTOPIA ISLAND",{"$f":"IFERROR(VLOOKUP(A338,Sheet2!$B$2:$C$18,2,0),\"\")","v":"Utopia"},"2018-08-23",2,0,"HURGADA",110,null,{"$f":"IFERROR(VALUE(IF(ISERROR(MATCH(A338,Sources!$B:$B,0)),IF(ISERROR(MATCH(F338,Sources!$C:$C,0)),\"\",5*D338+3*E338),IF(AND(NOT(ISERROR(MATCH(A338,Sources!$D:$D,0))),NOT(ISERROR(MATCH(F338,Sources!$E:$E,0)))),5*D338+3*E338,\"\"))&IF(AND(ISERROR(MATCH(A338,Sources!$F:$F,0)),NOT(ISERROR(MATCH(F338,Sources!$G:$G,0)))),5*D338+3*E338,\"\")),\"\")","v":""},110]
["UTOPIA ISLAND",{"$f":"IFERROR(VLOOKUP(A339,Sheet2!$B$2:$C$18,2,0),\"\")","v":"Utopia"},"2018-08-23",2,0,"HURGADA",110,null,{"$f":"IFERROR(VALUE(IF(ISERROR(MATCH(A339,Sources!$B:$B,0)),IF(ISERROR(MATCH(F339,Sources!$C:$C,0)),\"\",5*D339+3*E339),IF(AND(NOT(ISERROR(MATCH(A339,Sources!$D:$D,0))),NOT(ISERROR(MATCH(F339,Sources!$E:$E,0)))),5*D339+3*E339,\"\"))&IF(AND(ISERROR(MATCH(A339,Sources!$F:$F,0)),NOT(ISERROR(MATCH(F339,Sources!$G:$G,0)))),5*D339+3*E339,\"\")),\"\")","v":""},110]
["UTOPIA ISLAND",{"$f":"IFERROR(VLOOKUP(A340,Sheet2!$B$2:$C$18,2,0),\"\")","v":"Utopia"},"2018-08-23",2,1,"HURGADA",138,null,{"$f":"IFERROR(VALUE(IF(ISERROR(MATCH(A340,Sources!$B:$B,0)),IF(ISERROR(MATCH(F340,Sources!$C:$C,0)),\"\",5*D340+3*E340),IF(AND(NOT(ISERROR(MATCH(A340,Sources!$D:$D,0))),NOT(ISERROR(MATCH(F340,Sources!$E:$E,0)))),5*D340+3*E340,\"\"))&IF(AND(ISERROR(MATCH(A340,Sources!$F:$F,0)),NOT(ISERROR(MATCH(F340,Sources!$G:$G,0)))),5*D340+3*E340,\"\")),\"\")","v":""},138]
["UTOPIA ISLAND",{"$f":"IFERROR(VLOOKUP(A341,Sheet2!$B$2:$C$18,2,0),\"\")","v":"Utopia"},"2018-08-23",2,1,"HURGADA",138,null,{"$f":"IFERROR(VALUE(IF(ISERROR(MATCH(A341,Sources!$B:$B,0)),IF(ISERROR(MATCH(F341,Sources!$C:$C,0)),\"\",5*D341+3*E341),IF(AND(NOT(ISERROR(MATCH(A341,Sources!$D:$D,0))),NOT(ISERROR(MATCH(F341,Sources!$E:$E,0)))),5*D341+3*E341,\"\"))&IF(AND(ISERROR(MATCH(A341,Sources!$F:$F,0)),NOT(ISERROR(MATCH(F341,Sources!$G:$G,0)))),5*D341+3*E341,\"\")),\"\")","v":""},138]
["UTOPIA ISLAND",{"$f":"IFERROR(VLOOKUP(A342,Sheet2!$B$2:$C$18,2,0),\"\")","v":"Utopia"},"2018-08-23",2,1,"HURGADA",138,null,{"$f":"IFERROR(VALUE(IF(ISERROR(MATCH(A342,Sources!$B:$B,0)),IF(ISERROR(MATCH(F342,Sources!$C:$C,0)),\"\",5*D342+3*E342),IF(AND(NOT(ISERROR(MATCH(A342,Sources!$D:$D,0))),NOT(ISERROR(MATCH(F342,Sources!$E:$E,0)))),5*D342+3*E342,\"\"))&IF(AND(ISERROR(MATCH(A342,Sources!$F:$F,0)),NOT(ISERROR(MATCH(F342,Sources!$G:$G,0)))),5*D342+3*E342,\"\")),\"\")","v":""},138]
["UTOPIA ISLAND",{"$f":"IFERROR(VLOOKUP(A343,Sheet2!$B$2:$C$18,2,0),\"\")","v":"Utopia"},"2018-08-23",3,0,"HURGADA",165,null,{"$f":"IFERROR(VALUE(IF(ISERROR(MATCH(A343,Sources!$B:$B,0)),IF(ISERROR(MATCH(F343,Sources!$C:$C,0)),\"\",5*D343+3*E343),IF(AND(NOT(ISERROR(MATCH(A343,Sources!$D:$D,0))),NOT(ISERROR(MATCH(F343,Sources!$E:$E,0)))),5*D343+3*E343,\"\"))&IF(AND(ISERROR(MATCH(A343,Sources!$F:$F,0)),NOT(ISERROR(MATCH(F343,Sources!$G:$G,0)))),5*D343+3*E343,\"\")),\"\")","v":""},165]
["UTOPIA ISLAND",{"$f":"IFERROR(VLOOKUP(A344,Sheet2!$B$2:$C$18,2,0),\"\")","v":"Utopia"},"2018-08-23",2,0,"MAKADI BAY",110,null,{"$f":"IFERROR(VALUE(IF(ISERROR(MATCH(A344,Sources!$B:$B,0)),IF(ISERROR(MATCH(F344,Sources!$C:$C,0)),\"\",5*D344+3*E344),IF(AND(NOT(ISERROR(MATCH(A344,Sources!$D:$D,0))),NOT(ISERROR(MATCH(F344,Sources!$E:$E,0)))),5*D344+3*E344,\"\"))&IF(AND(ISERROR(MATCH(A344,Sources!$F:$F,0)),NOT(ISERROR(MATCH(F344,Sources!$G:$G,0)))),5*D344+3*E344,\"\")),\"\")","v":""},110]
["UTOPIA ISLAND",{"$f":"IFERROR(VLOOKUP(A345,Sheet2!$B$2:$C$18,2,0),\"\")","v":"Utopia"},"2018-08-23",3,0,"MAKADI BAY",165,null,{"$f":"IFERROR(VALUE(IF(ISERROR(MATCH(A345,Sources!$B:$B,0)),IF(ISERROR(MATCH(F345,Sources!$C:$C,0)),\"\",5*D345+3*E345),IF(AND(NOT(ISERROR(MATCH(A345,Sources!$D:$D,0))),NOT(ISERROR(MATCH(F345,Sources!$E:$E,0)))),5*D345+3*E345,\"\"))&IF(AND(ISERROR(MATCH(A345,Sources!$F:$F,0)),NOT(ISERROR(MATCH(F345,Sources!$G:$G,0)))),5*D345+3*E345,\"\")),\"\")","v":""},165]
["UTOPIA ISLAND",{"$f":"IFERROR(VLOOKUP(A346,Sheet2!$B$2:$C$18,2,0),\"\")","v":"Utopia"},"2018-08-23",2,1,"HURGADA",138,null,{"$f":"IFERROR(VALUE(IF(ISERROR(MATCH(A346,Sources!$B:$B,0)),IF(ISERROR(MATCH(F346,Sources!$C:$C,0)),\"\",5*D346+3*E346),IF(AND(NOT(ISERROR(MATCH(A346,Sources!$D:$D,0))),NOT(ISERROR(MATCH(F346,Sources!$E:$E,0)))),5*D346+3*E346,\"\"))&IF(AND(ISERROR(MATCH(A346,Sources!$F:$F,0)),NOT(ISERROR(MATCH(F346,Sources!$G:$G,0)))),5*D346+3*E346,\"\")),\"\")","v":""},138]
["UTOPIA ISLAND",{"$f":"IFERROR(VLOOKUP(A347,Sheet2!$B$2:$C$18,2,0),\"\")","v":"Utopia"},"2018-08-23",2,0,"HURGADA",110,null,{"$f":"IFERROR(VALUE(IF(ISERROR(MATCH(A347,Sources!$B:$B,0)),IF(ISERROR(MATCH(F347,Sources!$C:$C,0)),\"\",5*D347+3*E347),IF(AND(NOT(ISERROR(MATCH(A347,Sources!$D:$D,0))),NOT(ISERROR(MATCH(F347,Sources!$E:$E,0)))),5*D347+3*E347,\"\"))&IF(AND(ISERROR(MATCH(A347,Sources!$F:$F,0)),NOT(ISERROR(MATCH(F347,Sources!$G:$G,0)))),5*D347+3*E347,\"\")),\"\")","v":""},110]
["ASPENDOS TURKISH BATH","Aspendos Turkish Bath","2018-08-23",1,0,"HURGADA",50,null,{"$f":"IFERROR(VALUE(IF(ISERROR(MATCH(A348,Sources!$B:$B,0)),IF(ISERROR(MATCH(F348,Sources!$C:$C,0)),\"\",5*D348+3*E348),IF(AND(NOT(ISERROR(MATCH(A348,Sources!$D:$D,0))),NOT(ISERROR(MATCH(F348,Sources!$E:$E,0)))),5*D348+3*E348,\"\"))&IF(AND(ISERROR(MATCH(A348,Sources!$F:$F,0)),NOT(ISERROR(MATCH(F348,Sources!$G:$G,0)))),5*D348+3*E348,\"\")),\"\")","v":""},50]
["MOTO2",{"$f":"IFERROR(VLOOKUP(A349,Sheet2!$B$2:$C$18,2,0),\"\")","v":"Moto 2"},"2018-08-24",2,0,"MAKADI BAY",100,null,{"$f":"IFERROR(VALUE(IF(ISERROR(MATCH(A349,Sources!$B:$B,0)),IF(ISERROR(MATCH(F349,Sources!$C:$C,0)),\"\",5*D349+3*E349),IF(AND(NOT(ISERROR(MATCH(A349,Sources!$D:$D,0))),NOT(ISERROR(MATCH(F349,Sources!$E:$E,0)))),5*D349+3*E349,\"\"))&IF(AND(ISERROR(MATCH(A349,Sources!$F:$F,0)),NOT(ISERROR(MATCH(F349,Sources!$G:$G,0)))),5*D349+3*E349,\"\")),\"\")","v":10},90]
["SEA TRIP",{"$f":"IFERROR(VLOOKUP(A350,Sheet2!$B$2:$C$18,2,0),\"\")","v":"Sea Trip"},"2018-08-24",1,0,"MAKADI BAY",45,null,{"$f":"IFERROR(VALUE(IF(ISERROR(MATCH(A350,Sources!$B:$B,0)),IF(ISERROR(MATCH(F350,Sources!$C:$C,0)),\"\",5*D350+3*E350),IF(AND(NOT(ISERROR(MATCH(A350,Sources!$D:$D,0))),NOT(ISERROR(MATCH(F350,Sources!$E:$E,0)))),5*D350+3*E350,\"\"))&IF(AND(ISERROR(MATCH(A350,Sources!$F:$F,0)),NOT(ISERROR(MATCH(F350,Sources!$G:$G,0)))),5*D350+3*E350,\"\")),\"\")","v":5},40]
["MOTO2",{"$f":"IFERROR(VLOOKUP(A351,Sheet2!$B$2:$C$18,2,0),\"\")","v":"Moto 2"},"2018-08-24",2,0,"HURGADA",90,null,{"$f":"IFERROR(VALUE(IF(ISERROR(MATCH(A351,Sources!$B:$B,0)),IF(ISERROR(MATCH(F351,Sources!$C:$C,0)),\"\",5*D351+3*E351),IF(AND(NOT(ISERROR(MATCH(A351,Sources!$D:$D,0))),NOT(ISERROR(MATCH(F351,Sources!$E:$E,0)))),5*D351+3*E351,\"\"))&IF(AND(ISERROR(MATCH(A351,Sources!$F:$F,0)),NOT(ISERROR(MATCH(F351,Sources!$G:$G,0)))),5*D351+3*E351,\"\")),\"\")","v":""},90]
["MOTO2",{"$f":"IFERROR(VLOOKUP(A352,Sheet2!$B$2:$C$18,2,0),\"\")","v":"Moto 2"},"2018-08-24",2,0,"MAKADI BAY",100,null,{"$f":"IFERROR(VALUE(IF(ISERROR(MATCH(A352,Sources!$B:$B,0)),IF(ISERROR(MATCH(F352,Sources!$C:$C,0)),\"\",5*D352+3*E352),IF(AND(NOT(ISERROR(MATCH(A352,Sources!$D:$D,0))),NOT(ISERROR(MATCH(F352,Sources!$E:$E,0)))),5*D352+3*E352,\"\"))&IF(AND(ISERROR(MATCH(A352,Sources!$F:$F,0)),NOT(ISERROR(MATCH(F352,Sources!$G:$G,0)))),5*D352+3*E352,\"\")),\"\")","v":10},90]
["PRIVATE BOAT FISHING",{"$f":"IFERROR(VLOOKUP(A353,Sheet2!$B$2:$C$18,2,0),\"\")","v":"Private Boat Fishing"},"2018-08-24",3,1,"HURGADA",450,null,{"$f":"IFERROR(VALUE(IF(ISERROR(MATCH(A353,Sources!$B:$B,0)),IF(ISERROR(MATCH(F353,Sources!$C:$C,0)),\"\",5*D353+3*E353),IF(AND(NOT(ISERROR(MATCH(A353,Sources!$D:$D,0))),NOT(ISERROR(MATCH(F353,Sources!$E:$E,0)))),5*D353+3*E353,\"\"))&IF(AND(ISERROR(MATCH(A353,Sources!$F:$F,0)),NOT(ISERROR(MATCH(F353,Sources!$G:$G,0)))),5*D353+3*E353,\"\")),\"\")","v":""},450]
["ASPENDOS TURKISH BATH","Aspendos Turkish Bath","2018-08-24",1,0,"HURGADA",50,null,{"$f":"IFERROR(VALUE(IF(ISERROR(MATCH(A354,Sources!$B:$B,0)),IF(ISERROR(MATCH(F354,Sources!$C:$C,0)),\"\",5*D354+3*E354),IF(AND(NOT(ISERROR(MATCH(A354,Sources!$D:$D,0))),NOT(ISERROR(MATCH(F354,Sources!$E:$E,0)))),5*D354+3*E354,\"\"))&IF(AND(ISERROR(MATCH(A354,Sources!$F:$F,0)),NOT(ISERROR(MATCH(F354,Sources!$G:$G,0)))),5*D354+3*E354,\"\")),\"\")","v":""},50]
["ASPENDOS TURKISH BATH","Aspendos Turkish Bath","2018-08-24",1,0,"HURGADA",35,null,{"$f":"IFERROR(VALUE(IF(ISERROR(MATCH(A355,Sources!$B:$B,0)),IF(ISERROR(MATCH(F355,Sources!$C:$C,0)),\"\",5*D355+3*E355),IF(AND(NOT(ISERROR(MATCH(A355,Sources!$D:$D,0))),NOT(ISERROR(MATCH(F355,Sources!$E:$E,0)))),5*D355+3*E355,\"\"))&IF(AND(ISERROR(MATCH(A355,Sources!$F:$F,0)),NOT(ISERROR(MATCH(F355,Sources!$G:$G,0)))),5*D355+3*E355,\"\")),\"\")","v":""},35]
["ASPENDOS TURKISH BATH","Aspendos Turkish Bath","2018-08-24",2,0,"MAKADI BAY",130,null,{"$f":"IFERROR(VALUE(IF(ISERROR(MATCH(A356,Sources!$B:$B,0)),IF(ISERROR(MATCH(F356,Sources!$C:$C,0)),\"\",5*D356+3*E356),IF(AND(NOT(ISERROR(MATCH(A356,Sources!$D:$D,0))),NOT(ISERROR(MATCH(F356,Sources!$E:$E,0)))),5*D356+3*E356,\"\"))&IF(AND(ISERROR(MATCH(A356,Sources!$F:$F,0)),NOT(ISERROR(MATCH(F356,Sources!$G:$G,0)))),5*D356+3*E356,\"\")),\"\")","v":10},120]
["GRAND AQUARIUM",{"$f":"IFERROR(VLOOKUP(A357,Sheet2!$B$2:$C$18,2,0),\"\")","v":"Grand Aquarium"},"2018-08-25",3,0,"HURGADA",120,null,{"$f":"IFERROR(VALUE(IF(ISERROR(MATCH(A357,Sources!$B:$B,0)),IF(ISERROR(MATCH(F357,Sources!$C:$C,0)),\"\",5*D357+3*E357),IF(AND(NOT(ISERROR(MATCH(A357,Sources!$D:$D,0))),NOT(ISERROR(MATCH(F357,Sources!$E:$E,0)))),5*D357+3*E357,\"\"))&IF(AND(ISERROR(MATCH(A357,Sources!$F:$F,0)),NOT(ISERROR(MATCH(F357,Sources!$G:$G,0)))),5*D357+3*E357,\"\")),\"\")","v":""},120]
["SEA TRIP",{"$f":"IFERROR(VLOOKUP(A358,Sheet2!$B$2:$C$18,2,0),\"\")","v":"Sea Trip"},"2018-08-25",2,0,"HURGADA",80,null,{"$f":"IFERROR(VALUE(IF(ISERROR(MATCH(A358,Sources!$B:$B,0)),IF(ISERROR(MATCH(F358,Sources!$C:$C,0)),\"\",5*D358+3*E358),IF(AND(NOT(ISERROR(MATCH(A358,Sources!$D:$D,0))),NOT(ISERROR(MATCH(F358,Sources!$E:$E,0)))),5*D358+3*E358,\"\"))&IF(AND(ISERROR(MATCH(A358,Sources!$F:$F,0)),NOT(ISERROR(MATCH(F358,Sources!$G:$G,0)))),5*D358+3*E358,\"\")),\"\")","v":""},80]
["CAIRO OVERDAY",{"$f":"IFERROR(VLOOKUP(A359,Sheet2!$B$2:$C$18,2,0),\"\")","v":"Cairo"},"2018-08-25",1,0,"MAKADI BAY",115,null,{"$f":"IFERROR(VALUE(IF(ISERROR(MATCH(A359,Sources!$B:$B,0)),IF(ISERROR(MATCH(F359,Sources!$C:$C,0)),\"\",5*D359+3*E359),IF(AND(NOT(ISERROR(MATCH(A359,Sources!$D:$D,0))),NOT(ISERROR(MATCH(F359,Sources!$E:$E,0)))),5*D359+3*E359,\"\"))&IF(AND(ISERROR(MATCH(A359,Sources!$F:$F,0)),NOT(ISERROR(MATCH(F359,Sources!$G:$G,0)))),5*D359+3*E359,\"\")),\"\")","v":5},110]
["OVER DAY LUXORQUEEN VALLY",{"$f":"IFERROR(VLOOKUP(A360,Sheet2!$B$2:$C$18,2,0),\"\")","v":"LUXOR 2"},"2018-08-25",1,1,"HURGADA",135,"belarus",{"$f":"IFERROR(VALUE(IF(ISERROR(MATCH(A360,Sources!$B:$B,0)),IF(ISERROR(MATCH(F360,Sources!$C:$C,0)),\"\",5*D360+3*E360),IF(AND(NOT(ISERROR(MATCH(A360,Sources!$D:$D,0))),NOT(ISERROR(MATCH(F360,Sources!$E:$E,0)))),5*D360+3*E360,\"\"))&IF(AND(ISERROR(MATCH(A360,Sources!$F:$F,0)),NOT(ISERROR(MATCH(F360,Sources!$G:$G,0)))),5*D360+3*E360,\"\")),\"\")","v":""},135]
["OVER DAY LUXORQUEEN VALLY",{"$f":"IFERROR(VLOOKUP(A361,Sheet2!$B$2:$C$18,2,0),\"\")","v":"LUXOR 2"},"2018-08-25",2,0,"HURGADA",180,"belarus",{"$f":"IFERROR(VALUE(IF(ISERROR(MATCH(A361,Sources!$B:$B,0)),IF(ISERROR(MATCH(F361,Sources!$C:$C,0)),\"\",5*D361+3*E361),IF(AND(NOT(ISERROR(MATCH(A361,Sources!$D:$D,0))),NOT(ISERROR(MATCH(F361,Sources!$E:$E,0)))),5*D361+3*E361,\"\"))&IF(AND(ISERROR(MATCH(A361,Sources!$F:$F,0)),NOT(ISERROR(MATCH(F361,Sources!$G:$G,0)))),5*D361+3*E361,\"\")),\"\")","v":""},180]
["CAIRO OVERDAY",{"$f":"IFERROR(VLOOKUP(A362,Sheet2!$B$2:$C$18,2,0),\"\")","v":"Cairo"},"2018-08-25",2,0,"MAKADI BAY",230,null,{"$f":"IFERROR(VALUE(IF(ISERROR(MATCH(A362,Sources!$B:$B,0)),IF(ISERROR(MATCH(F362,Sources!$C:$C,0)),\"\",5*D362+3*E362),IF(AND(NOT(ISERROR(MATCH(A362,Sources!$D:$D,0))),NOT(ISERROR(MATCH(F362,Sources!$E:$E,0)))),5*D362+3*E362,\"\"))&IF(AND(ISERROR(MATCH(A362,Sources!$F:$F,0)),NOT(ISERROR(MATCH(F362,Sources!$G:$G,0)))),5*D362+3*E362,\"\")),\"\")","v":10},220]
["GRAND AQUARIUM",{"$f":"IFERROR(VLOOKUP(A363,Sheet2!$B$2:$C$18,2,0),\"\")","v":"Grand Aquarium"},"2018-08-25",3,1,"HURGADA",140,null,{"$f":"IFERROR(VALUE(IF(ISERROR(MATCH(A363,Sources!$B:$B,0)),IF(ISERROR(MATCH(F363,Sources!$C:$C,0)),\"\",5*D363+3*E363),IF(AND(NOT(ISERROR(MATCH(A363,Sources!$D:$D,0))),NOT(ISERROR(MATCH(F363,Sources!$E:$E,0)))),5*D363+3*E363,\"\"))&IF(AND(ISERROR(MATCH(A363,Sources!$F:$F,0)),NOT(ISERROR(MATCH(F363,Sources!$G:$G,0)))),5*D363+3*E363,\"\")),\"\")","v":""},140]
["OVER DAY LUXORQUEEN VALLY",{"$f":"IFERROR(VLOOKUP(A364,Sheet2!$B$2:$C$18,2,0),\"\")","v":"LUXOR 2"},"2018-08-25",2,0,"HURGADA",180,"Belarus",{"$f":"IFERROR(VALUE(IF(ISERROR(MATCH(A364,Sources!$B:$B,0)),IF(ISERROR(MATCH(F364,Sources!$C:$C,0)),\"\",5*D364+3*E364),IF(AND(NOT(ISERROR(MATCH(A364,Sources!$D:$D,0))),NOT(ISERROR(MATCH(F364,Sources!$E:$E,0)))),5*D364+3*E364,\"\"))&IF(AND(ISERROR(MATCH(A364,Sources!$F:$F,0)),NOT(ISERROR(MATCH(F364,Sources!$G:$G,0)))),5*D364+3*E364,\"\")),\"\")","v":""},180]
["OVER DAY LUXORQUEEN VALLY",{"$f":"IFERROR(VLOOKUP(A365,Sheet2!$B$2:$C$18,2,0),\"\")","v":"LUXOR 2"},"2018-08-25",2,0,"HURGADA",180,"ukraine",{"$f":"IFERROR(VALUE(IF(ISERROR(MATCH(A365,Sources!$B:$B,0)),IF(ISERROR(MATCH(F365,Sources!$C:$C,0)),\"\",5*D365+3*E365),IF(AND(NOT(ISERROR(MATCH(A365,Sources!$D:$D,0))),NOT(ISERROR(MATCH(F365,Sources!$E:$E,0)))),5*D365+3*E365,\"\"))&IF(AND(ISERROR(MATCH(A365,Sources!$F:$F,0)),NOT(ISERROR(MATCH(F365,Sources!$G:$G,0)))),5*D365+3*E365,\"\")),\"\")","v":""},180]
["GRAND AQUARIUM",{"$f":"IFERROR(VLOOKUP(A366,Sheet2!$B$2:$C$18,2,0),\"\")","v":"Grand Aquarium"},"2018-08-25",2,0,"HURGADA",80,null,{"$f":"IFERROR(VALUE(IF(ISERROR(MATCH(A366,Sources!$B:$B,0)),IF(ISERROR(MATCH(F366,Sources!$C:$C,0)),\"\",5*D366+3*E366),IF(AND(NOT(ISERROR(MATCH(A366,Sources!$D:$D,0))),NOT(ISERROR(MATCH(F366,Sources!$E:$E,0)))),5*D366+3*E366,\"\"))&IF(AND(ISERROR(MATCH(A366,Sources!$F:$F,0)),NOT(ISERROR(MATCH(F366,Sources!$G:$G,0)))),5*D366+3*E366,\"\")),\"\")","v":""},80]
["ASPENDOS TURKISH BATH","Aspendos Turkish Bath","2018-08-25",2,0,"HURGADA",70,null,{"$f":"IFERROR(VALUE(IF(ISERROR(MATCH(A367,Sources!$B:$B,0)),IF(ISERROR(MATCH(F367,Sources!$C:$C,0)),\"\",5*D367+3*E367),IF(AND(NOT(ISERROR(MATCH(A367,Sources!$D:$D,0))),NOT(ISERROR(MATCH(F367,Sources!$E:$E,0)))),5*D367+3*E367,\"\"))&IF(AND(ISERROR(MATCH(A367,Sources!$F:$F,0)),NOT(ISERROR(MATCH(F367,Sources!$G:$G,0)))),5*D367+3*E367,\"\")),\"\")","v":""},70]
["OVER DAY LUXORQUEEN VALLY",{"$f":"IFERROR(VLOOKUP(A368,Sheet2!$B$2:$C$18,2,0),\"\")","v":"LUXOR 2"},"2018-08-25",2,0,"HURGADA",180,"belarus",{"$f":"IFERROR(VALUE(IF(ISERROR(MATCH(A368,Sources!$B:$B,0)),IF(ISERROR(MATCH(F368,Sources!$C:$C,0)),\"\",5*D368+3*E368),IF(AND(NOT(ISERROR(MATCH(A368,Sources!$D:$D,0))),NOT(ISERROR(MATCH(F368,Sources!$E:$E,0)))),5*D368+3*E368,\"\"))&IF(AND(ISERROR(MATCH(A368,Sources!$F:$F,0)),NOT(ISERROR(MATCH(F368,Sources!$G:$G,0)))),5*D368+3*E368,\"\")),\"\")","v":""},180]
["GRAND AQUARIUM",{"$f":"IFERROR(VLOOKUP(A369,Sheet2!$B$2:$C$18,2,0),\"\")","v":"Grand Aquarium"},"2018-08-25",2,0,"HURGADA",80,null,{"$f":"IFERROR(VALUE(IF(ISERROR(MATCH(A369,Sources!$B:$B,0)),IF(ISERROR(MATCH(F369,Sources!$C:$C,0)),\"\",5*D369+3*E369),IF(AND(NOT(ISERROR(MATCH(A369,Sources!$D:$D,0))),NOT(ISERROR(MATCH(F369,Sources!$E:$E,0)))),5*D369+3*E369,\"\"))&IF(AND(ISERROR(MATCH(A369,Sources!$F:$F,0)),NOT(ISERROR(MATCH(F369,Sources!$G:$G,0)))),5*D369+3*E369,\"\")),\"\")","v":""},80]
["OVER DAY LUXORQUEEN VALLY",{"$f":"IFERROR(VLOOKUP(A370,Sheet2!$B$2:$C$18,2,0),\"\")","v":"LUXOR 2"},"2018-08-25",2,0,"HURGADA",180,"ukraine",{"$f":"IFERROR(VALUE(IF(ISERROR(MATCH(A370,Sources!$B:$B,0)),IF(ISERROR(MATCH(F370,Sources!$C:$C,0)),\"\",5*D370+3*E370),IF(AND(NOT(ISERROR(MATCH(A370,Sources!$D:$D,0))),NOT(ISERROR(MATCH(F370,Sources!$E:$E,0)))),5*D370+3*E370,\"\"))&IF(AND(ISERROR(MATCH(A370,Sources!$F:$F,0)),NOT(ISERROR(MATCH(F370,Sources!$G:$G,0)))),5*D370+3*E370,\"\")),\"\")","v":""},180]
["CAIRO OVERDAY",{"$f":"IFERROR(VLOOKUP(A371,Sheet2!$B$2:$C$18,2,0),\"\")","v":"Cairo"},"2018-08-25",2,0,"HURGADA",220,"ukraine",{"$f":"IFERROR(VALUE(IF(ISERROR(MATCH(A371,Sources!$B:$B,0)),IF(ISERROR(MATCH(F371,Sources!$C:$C,0)),\"\",5*D371+3*E371),IF(AND(NOT(ISERROR(MATCH(A371,Sources!$D:$D,0))),NOT(ISERROR(MATCH(F371,Sources!$E:$E,0)))),5*D371+3*E371,\"\"))&IF(AND(ISERROR(MATCH(A371,Sources!$F:$F,0)),NOT(ISERROR(MATCH(F371,Sources!$G:$G,0)))),5*D371+3*E371,\"\")),\"\")","v":""},220]
["GRAND AQUARIUM",{"$f":"IFERROR(VLOOKUP(A372,Sheet2!$B$2:$C$18,2,0),\"\")","v":"Grand Aquarium"},"2018-08-25",2,0,"HURGADA",80,null,{"$f":"IFERROR(VALUE(IF(ISERROR(MATCH(A372,Sources!$B:$B,0)),IF(ISERROR(MATCH(F372,Sources!$C:$C,0)),\"\",5*D372+3*E372),IF(AND(NOT(ISERROR(MATCH(A372,Sources!$D:$D,0))),NOT(ISERROR(MATCH(F372,Sources!$E:$E,0)))),5*D372+3*E372,\"\"))&IF(AND(ISERROR(MATCH(A372,Sources!$F:$F,0)),NOT(ISERROR(MATCH(F372,Sources!$G:$G,0)))),5*D372+3*E372,\"\")),\"\")","v":""},80]
["CAIRO OVERDAY",{"$f":"IFERROR(VLOOKUP(A373,Sheet2!$B$2:$C$18,2,0),\"\")","v":"Cairo"},"2018-08-25",2,0,"MAKADI BAY",230,null,{"$f":"IFERROR(VALUE(IF(ISERROR(MATCH(A373,Sources!$B:$B,0)),IF(ISERROR(MATCH(F373,Sources!$C:$C,0)),\"\",5*D373+3*E373),IF(AND(NOT(ISERROR(MATCH(A373,Sources!$D:$D,0))),NOT(ISERROR(MATCH(F373,Sources!$E:$E,0)))),5*D373+3*E373,\"\"))&IF(AND(ISERROR(MATCH(A373,Sources!$F:$F,0)),NOT(ISERROR(MATCH(F373,Sources!$G:$G,0)))),5*D373+3*E373,\"\")),\"\")","v":10},220]
["CAIRO OVERDAY",{"$f":"IFERROR(VLOOKUP(A374,Sheet2!$B$2:$C$18,2,0),\"\")","v":"Cairo"},"2018-08-25",2,0,"MAKADI BAY",230,null,{"$f":"IFERROR(VALUE(IF(ISERROR(MATCH(A374,Sources!$B:$B,0)),IF(ISERROR(MATCH(F374,Sources!$C:$C,0)),\"\",5*D374+3*E374),IF(AND(NOT(ISERROR(MATCH(A374,Sources!$D:$D,0))),NOT(ISERROR(MATCH(F374,Sources!$E:$E,0)))),5*D374+3*E374,\"\"))&IF(AND(ISERROR(MATCH(A374,Sources!$F:$F,0)),NOT(ISERROR(MATCH(F374,Sources!$G:$G,0)))),5*D374+3*E374,\"\")),\"\")","v":10},220]
["CAIRO OVERDAY",{"$f":"IFERROR(VLOOKUP(A375,Sheet2!$B$2:$C$18,2,0),\"\")","v":"Cairo"},"2018-08-25",2,0,"MAKADI BAY",230,null,{"$f":"IFERROR(VALUE(IF(ISERROR(MATCH(A375,Sources!$B:$B,0)),IF(ISERROR(MATCH(F375,Sources!$C:$C,0)),\"\",5*D375+3*E375),IF(AND(NOT(ISERROR(MATCH(A375,Sources!$D:$D,0))),NOT(ISERROR(MATCH(F375,Sources!$E:$E,0)))),5*D375+3*E375,\"\"))&IF(AND(ISERROR(MATCH(A375,Sources!$F:$F,0)),NOT(ISERROR(MATCH(F375,Sources!$G:$G,0)))),5*D375+3*E375,\"\")),\"\")","v":10},220]
["GRAND AQUARIUM",{"$f":"IFERROR(VLOOKUP(A376,Sheet2!$B$2:$C$18,2,0),\"\")","v":"Grand Aquarium"},"2018-08-25",2,0,"MAKADI BAY",90,null,{"$f":"IFERROR(VALUE(IF(ISERROR(MATCH(A376,Sources!$B:$B,0)),IF(ISERROR(MATCH(F376,Sources!$C:$C,0)),\"\",5*D376+3*E376),IF(AND(NOT(ISERROR(MATCH(A376,Sources!$D:$D,0))),NOT(ISERROR(MATCH(F376,Sources!$E:$E,0)))),5*D376+3*E376,\"\"))&IF(AND(ISERROR(MATCH(A376,Sources!$F:$F,0)),NOT(ISERROR(MATCH(F376,Sources!$G:$G,0)))),5*D376+3*E376,\"\")),\"\")","v":10},80]
["MOTO2",{"$f":"IFERROR(VLOOKUP(A377,Sheet2!$B$2:$C$18,2,0),\"\")","v":"Moto 2"},"2018-08-26",2,0,"MAKADI BAY",100,null,{"$f":"IFERROR(VALUE(IF(ISERROR(MATCH(A377,Sources!$B:$B,0)),IF(ISERROR(MATCH(F377,Sources!$C:$C,0)),\"\",5*D377+3*E377),IF(AND(NOT(ISERROR(MATCH(A377,Sources!$D:$D,0))),NOT(ISERROR(MATCH(F377,Sources!$E:$E,0)))),5*D377+3*E377,\"\"))&IF(AND(ISERROR(MATCH(A377,Sources!$F:$F,0)),NOT(ISERROR(MATCH(F377,Sources!$G:$G,0)))),5*D377+3*E377,\"\")),\"\")","v":10},90]
["RUSALKA  ( MERMAID )",{"$f":"IFERROR(VLOOKUP(A378,Sheet2!$B$2:$C$18,2,0),\"\")","v":"Rusalka (Mermaid)"},"2018-08-26",1,0,"HURGADA",40,null,{"$f":"IFERROR(VALUE(IF(ISERROR(MATCH(A378,Sources!$B:$B,0)),IF(ISERROR(MATCH(F378,Sources!$C:$C,0)),\"\",5*D378+3*E378),IF(AND(NOT(ISERROR(MATCH(A378,Sources!$D:$D,0))),NOT(ISERROR(MATCH(F378,Sources!$E:$E,0)))),5*D378+3*E378,\"\"))&IF(AND(ISERROR(MATCH(A378,Sources!$F:$F,0)),NOT(ISERROR(MATCH(F378,Sources!$G:$G,0)))),5*D378+3*E378,\"\")),\"\")","v":""},40]
["UTOPIA ISLAND",{"$f":"IFERROR(VLOOKUP(A379,Sheet2!$B$2:$C$18,2,0),\"\")","v":"Utopia"},"2018-08-26",6,0,"HURGADA",313,"17 $ DISCOUNT",{"$f":"IFERROR(VALUE(IF(ISERROR(MATCH(A379,Sources!$B:$B,0)),IF(ISERROR(MATCH(F379,Sources!$C:$C,0)),\"\",5*D379+3*E379),IF(AND(NOT(ISERROR(MATCH(A379,Sources!$D:$D,0))),NOT(ISERROR(MATCH(F379,Sources!$E:$E,0)))),5*D379+3*E379,\"\"))&IF(AND(ISERROR(MATCH(A379,Sources!$F:$F,0)),NOT(ISERROR(MATCH(F379,Sources!$G:$G,0)))),5*D379+3*E379,\"\")),\"\")","v":""},313]
["UTOPIA ISLAND",{"$f":"IFERROR(VLOOKUP(A380,Sheet2!$B$2:$C$18,2,0),\"\")","v":"Utopia"},"2018-08-26",3,0,"HURGADA",165,null,{"$f":"IFERROR(VALUE(IF(ISERROR(MATCH(A380,Sources!$B:$B,0)),IF(ISERROR(MATCH(F380,Sources!$C:$C,0)),\"\",5*D380+3*E380),IF(AND(NOT(ISERROR(MATCH(A380,Sources!$D:$D,0))),NOT(ISERROR(MATCH(F380,Sources!$E:$E,0)))),5*D380+3*E380,\"\"))&IF(AND(ISERROR(MATCH(A380,Sources!$F:$F,0)),NOT(ISERROR(MATCH(F380,Sources!$G:$G,0)))),5*D380+3*E380,\"\")),\"\")","v":""},165]
["MOTO2",{"$f":"IFERROR(VLOOKUP(A381,Sheet2!$B$2:$C$18,2,0),\"\")","v":"Moto 2"},"2018-08-26",1,0,"HURGADA",45,null,{"$f":"IFERROR(VALUE(IF(ISERROR(MATCH(A381,Sources!$B:$B,0)),IF(ISERROR(MATCH(F381,Sources!$C:$C,0)),\"\",5*D381+3*E381),IF(AND(NOT(ISERROR(MATCH(A381,Sources!$D:$D,0))),NOT(ISERROR(MATCH(F381,Sources!$E:$E,0)))),5*D381+3*E381,\"\"))&IF(AND(ISERROR(MATCH(A381,Sources!$F:$F,0)),NOT(ISERROR(MATCH(F381,Sources!$G:$G,0)))),5*D381+3*E381,\"\")),\"\")","v":""},45]
["MOTO 1 HOUR",{"$f":"IFERROR(VLOOKUP(A382,Sheet2!$B$2:$C$18,2,0),\"\")","v":"Moto 1 Hour"},"2018-08-26",1,1,"HURGADA",60,null,{"$f":"IFERROR(VALUE(IF(ISERROR(MATCH(A382,Sources!$B:$B,0)),IF(ISERROR(MATCH(F382,Sources!$C:$C,0)),\"\",5*D382+3*E382),IF(AND(NOT(ISERROR(MATCH(A382,Sources!$D:$D,0))),NOT(ISERROR(MATCH(F382,Sources!$E:$E,0)))),5*D382+3*E382,\"\"))&IF(AND(ISERROR(MATCH(A382,Sources!$F:$F,0)),NOT(ISERROR(MATCH(F382,Sources!$G:$G,0)))),5*D382+3*E382,\"\")),\"\")","v":""},60]
["MOTO2",{"$f":"IFERROR(VLOOKUP(A383,Sheet2!$B$2:$C$18,2,0),\"\")","v":"Moto 2"},"2018-08-26",2,0,"HURGADA",90,null,{"$f":"IFERROR(VALUE(IF(ISERROR(MATCH(A383,Sources!$B:$B,0)),IF(ISERROR(MATCH(F383,Sources!$C:$C,0)),\"\",5*D383+3*E383),IF(AND(NOT(ISERROR(MATCH(A383,Sources!$D:$D,0))),NOT(ISERROR(MATCH(F383,Sources!$E:$E,0)))),5*D383+3*E383,\"\"))&IF(AND(ISERROR(MATCH(A383,Sources!$F:$F,0)),NOT(ISERROR(MATCH(F383,Sources!$G:$G,0)))),5*D383+3*E383,\"\")),\"\")","v":""},90]
["UTOPIA ISLAND",{"$f":"IFERROR(VLOOKUP(A384,Sheet2!$B$2:$C$18,2,0),\"\")","v":"Utopia"},"2018-08-26",4,0,"HURGADA",220,null,{"$f":"IFERROR(VALUE(IF(ISERROR(MATCH(A384,Sources!$B:$B,0)),IF(ISERROR(MATCH(F384,Sources!$C:$C,0)),\"\",5*D384+3*E384),IF(AND(NOT(ISERROR(MATCH(A384,Sources!$D:$D,0))),NOT(ISERROR(MATCH(F384,Sources!$E:$E,0)))),5*D384+3*E384,\"\"))&IF(AND(ISERROR(MATCH(A384,Sources!$F:$F,0)),NOT(ISERROR(MATCH(F384,Sources!$G:$G,0)))),5*D384+3*E384,\"\")),\"\")","v":""},220]
["UTOPIA ISLAND",{"$f":"IFERROR(VLOOKUP(A385,Sheet2!$B$2:$C$18,2,0),\"\")","v":"Utopia"},"2018-08-26",2,0,"HURGADA",110,null,{"$f":"IFERROR(VALUE(IF(ISERROR(MATCH(A385,Sources!$B:$B,0)),IF(ISERROR(MATCH(F385,Sources!$C:$C,0)),\"\",5*D385+3*E385),IF(AND(NOT(ISERROR(MATCH(A385,Sources!$D:$D,0))),NOT(ISERROR(MATCH(F385,Sources!$E:$E,0)))),5*D385+3*E385,\"\"))&IF(AND(ISERROR(MATCH(A385,Sources!$F:$F,0)),NOT(ISERROR(MATCH(F385,Sources!$G:$G,0)))),5*D385+3*E385,\"\")),\"\")","v":""},110]
["UTOPIA ISLAND",{"$f":"IFERROR(VLOOKUP(A386,Sheet2!$B$2:$C$18,2,0),\"\")","v":"Utopia"},"2018-08-26",2,0,"HURGADA",110,null,{"$f":"IFERROR(VALUE(IF(ISERROR(MATCH(A386,Sources!$B:$B,0)),IF(ISERROR(MATCH(F386,Sources!$C:$C,0)),\"\",5*D386+3*E386),IF(AND(NOT(ISERROR(MATCH(A386,Sources!$D:$D,0))),NOT(ISERROR(MATCH(F386,Sources!$E:$E,0)))),5*D386+3*E386,\"\"))&IF(AND(ISERROR(MATCH(A386,Sources!$F:$F,0)),NOT(ISERROR(MATCH(F386,Sources!$G:$G,0)))),5*D386+3*E386,\"\")),\"\")","v":""},110]
["UTOPIA ISLAND",{"$f":"IFERROR(VLOOKUP(A387,Sheet2!$B$2:$C$18,2,0),\"\")","v":"Utopia"},"2018-08-26",2,0,"HURGADA",110,null,{"$f":"IFERROR(VALUE(IF(ISERROR(MATCH(A387,Sources!$B:$B,0)),IF(ISERROR(MATCH(F387,Sources!$C:$C,0)),\"\",5*D387+3*E387),IF(AND(NOT(ISERROR(MATCH(A387,Sources!$D:$D,0))),NOT(ISERROR(MATCH(F387,Sources!$E:$E,0)))),5*D387+3*E387,\"\"))&IF(AND(ISERROR(MATCH(A387,Sources!$F:$F,0)),NOT(ISERROR(MATCH(F387,Sources!$G:$G,0)))),5*D387+3*E387,\"\")),\"\")","v":""},{"$f":"IF(I387=\"\",G387,(G387-I387))","v":110}]
["UTOPIA ISLAND",{"$f":"IFERROR(VLOOKUP(A388,Sheet2!$B$2:$C$18,2,0),\"\")","v":"Utopia"},"2018-08-26",2,0,"HURGADA",110,null,{"$f":"IFERROR(VALUE(IF(ISERROR(MATCH(A388,Sources!$B:$B,0)),IF(ISERROR(MATCH(F388,Sources!$C:$C,0)),\"\",5*D388+3*E388),IF(AND(NOT(ISERROR(MATCH(A388,Sources!$D:$D,0))),NOT(ISERROR(MATCH(F388,Sources!$E:$E,0)))),5*D388+3*E388,\"\"))&IF(AND(ISERROR(MATCH(A388,Sources!$F:$F,0)),NOT(ISERROR(MATCH(F388,Sources!$G:$G,0)))),5*D388+3*E388,\"\")),\"\")","v":""},110]
["UTOPIA ISLAND",{"$f":"IFERROR(VLOOKUP(A389,Sheet2!$B$2:$C$18,2,0),\"\")","v":"Utopia"},"2018-08-26",2,0,"MAKADI BAY",104,"6 $ DISCOUNT- WITH TICKET NO. 501883",{"$f":"IFERROR(VALUE(IF(ISERROR(MATCH(A389,Sources!$B:$B,0)),IF(ISERROR(MATCH(F389,Sources!$C:$C,0)),\"\",5*D389+3*E389),IF(AND(NOT(ISERROR(MATCH(A389,Sources!$D:$D,0))),NOT(ISERROR(MATCH(F389,Sources!$E:$E,0)))),5*D389+3*E389,\"\"))&IF(AND(ISERROR(MATCH(A389,Sources!$F:$F,0)),NOT(ISERROR(MATCH(F389,Sources!$G:$G,0)))),5*D389+3*E389,\"\")),\"\")","v":""},104]
["UTOPIA ISLAND",{"$f":"IFERROR(VLOOKUP(A390,Sheet2!$B$2:$C$18,2,0),\"\")","v":"Utopia"},"2018-08-26",3,1,"MAKADI BAY",184,"9 $ DISCOUNT-WITH TICKET NO. 501882",{"$f":"IFERROR(VALUE(IF(ISERROR(MATCH(A390,Sources!$B:$B,0)),IF(ISERROR(MATCH(F390,Sources!$C:$C,0)),\"\",5*D390+3*E390),IF(AND(NOT(ISERROR(MATCH(A390,Sources!$D:$D,0))),NOT(ISERROR(MATCH(F390,Sources!$E:$E,0)))),5*D390+3*E390,\"\"))&IF(AND(ISERROR(MATCH(A390,Sources!$F:$F,0)),NOT(ISERROR(MATCH(F390,Sources!$G:$G,0)))),5*D390+3*E390,\"\")),\"\")","v":""},184]
["UTOPIA ISLAND",{"$f":"IFERROR(VLOOKUP(A391,Sheet2!$B$2:$C$18,2,0),\"\")","v":"Utopia"},"2018-08-26",4,0,"MAKADI BAY",220,null,{"$f":"IFERROR(VALUE(IF(ISERROR(MATCH(A391,Sources!$B:$B,0)),IF(ISERROR(MATCH(F391,Sources!$C:$C,0)),\"\",5*D391+3*E391),IF(AND(NOT(ISERROR(MATCH(A391,Sources!$D:$D,0))),NOT(ISERROR(MATCH(F391,Sources!$E:$E,0)))),5*D391+3*E391,\"\"))&IF(AND(ISERROR(MATCH(A391,Sources!$F:$F,0)),NOT(ISERROR(MATCH(F391,Sources!$G:$G,0)))),5*D391+3*E391,\"\")),\"\")","v":""},220]
["UTOPIA ISLAND",{"$f":"IFERROR(VLOOKUP(A392,Sheet2!$B$2:$C$18,2,0),\"\")","v":"Utopia"},"2018-08-26",2,0,"MAKADI BAY",110,null,{"$f":"IFERROR(VALUE(IF(ISERROR(MATCH(A392,Sources!$B:$B,0)),IF(ISERROR(MATCH(F392,Sources!$C:$C,0)),\"\",5*D392+3*E392),IF(AND(NOT(ISERROR(MATCH(A392,Sources!$D:$D,0))),NOT(ISERROR(MATCH(F392,Sources!$E:$E,0)))),5*D392+3*E392,\"\"))&IF(AND(ISERROR(MATCH(A392,Sources!$F:$F,0)),NOT(ISERROR(MATCH(F392,Sources!$G:$G,0)))),5*D392+3*E392,\"\")),\"\")","v":""},110]
["UTOPIA ISLAND",{"$f":"IFERROR(VLOOKUP(A393,Sheet2!$B$2:$C$18,2,0),\"\")","v":"Utopia"},"2018-08-26",2,0,"MAKADI BAY",110,null,{"$f":"IFERROR(VALUE(IF(ISERROR(MATCH(A393,Sources!$B:$B,0)),IF(ISERROR(MATCH(F393,Sources!$C:$C,0)),\"\",5*D393+3*E393),IF(AND(NOT(ISERROR(MATCH(A393,Sources!$D:$D,0))),NOT(ISERROR(MATCH(F393,Sources!$E:$E,0)))),5*D393+3*E393,\"\"))&IF(AND(ISERROR(MATCH(A393,Sources!$F:$F,0)),NOT(ISERROR(MATCH(F393,Sources!$G:$G,0)))),5*D393+3*E393,\"\")),\"\")","v":""},110]
["UTOPIA ISLAND",{"$f":"IFERROR(VLOOKUP(A394,Sheet2!$B$2:$C$18,2,0),\"\")","v":"Utopia"},"2018-08-26",3,0,"MAKADI BAY",157,"8 $ DISCOUNT-WITH TICKET NO. 501897",{"$f":"IFERROR(VALUE(IF(ISERROR(MATCH(A394,Sources!$B:$B,0)),IF(ISERROR(MATCH(F394,Sources!$C:$C,0)),\"\",5*D394+3*E394),IF(AND(NOT(ISERROR(MATCH(A394,Sources!$D:$D,0))),NOT(ISERROR(MATCH(F394,Sources!$E:$E,0)))),5*D394+3*E394,\"\"))&IF(AND(ISERROR(MATCH(A394,Sources!$F:$F,0)),NOT(ISERROR(MATCH(F394,Sources!$G:$G,0)))),5*D394+3*E394,\"\")),\"\")","v":""},157]
["UTOPIA ISLAND",{"$f":"IFERROR(VLOOKUP(A395,Sheet2!$B$2:$C$18,2,0),\"\")","v":"Utopia"},"2018-08-26",2,0,"MAKADI BAY",104,"6 $ DISCOUNT-WITH TICKET NO. 501896",{"$f":"IFERROR(VALUE(IF(ISERROR(MATCH(A395,Sources!$B:$B,0)),IF(ISERROR(MATCH(F395,Sources!$C:$C,0)),\"\",5*D395+3*E395),IF(AND(NOT(ISERROR(MATCH(A395,Sources!$D:$D,0))),NOT(ISERROR(MATCH(F395,Sources!$E:$E,0)))),5*D395+3*E395,\"\"))&IF(AND(ISERROR(MATCH(A395,Sources!$F:$F,0)),NOT(ISERROR(MATCH(F395,Sources!$G:$G,0)))),5*D395+3*E395,\"\")),\"\")","v":""},104]
["RUSALKA  ( MERMAID )",{"$f":"IFERROR(VLOOKUP(A396,Sheet2!$B$2:$C$18,2,0),\"\")","v":"Rusalka (Mermaid)"},"2018-08-26",2,0,"SAFAGA",90,null,{"$f":"IFERROR(VALUE(IF(ISERROR(MATCH(A396,Sources!$B:$B,0)),IF(ISERROR(MATCH(F396,Sources!$C:$C,0)),\"\",5*D396+3*E396),IF(AND(NOT(ISERROR(MATCH(A396,Sources!$D:$D,0))),NOT(ISERROR(MATCH(F396,Sources!$E:$E,0)))),5*D396+3*E396,\"\"))&IF(AND(ISERROR(MATCH(A396,Sources!$F:$F,0)),NOT(ISERROR(MATCH(F396,Sources!$G:$G,0)))),5*D396+3*E396,\"\")),\"\")","v":10},80]
["UTOPIA ISLAND",{"$f":"IFERROR(VLOOKUP(A397,Sheet2!$B$2:$C$18,2,0),\"\")","v":"Utopia"},"2018-08-26",4,0,"MAKADI BAY",220,null,{"$f":"IFERROR(VALUE(IF(ISERROR(MATCH(A397,Sources!$B:$B,0)),IF(ISERROR(MATCH(F397,Sources!$C:$C,0)),\"\",5*D397+3*E397),IF(AND(NOT(ISERROR(MATCH(A397,Sources!$D:$D,0))),NOT(ISERROR(MATCH(F397,Sources!$E:$E,0)))),5*D397+3*E397,\"\"))&IF(AND(ISERROR(MATCH(A397,Sources!$F:$F,0)),NOT(ISERROR(MATCH(F397,Sources!$G:$G,0)))),5*D397+3*E397,\"\")),\"\")","v":""},220]
["UTOPIA ISLAND",{"$f":"IFERROR(VLOOKUP(A398,Sheet2!$B$2:$C$18,2,0),\"\")","v":"Utopia"},"2018-08-26",2,0,"HURGADA",110,null,{"$f":"IFERROR(VALUE(IF(ISERROR(MATCH(A398,Sources!$B:$B,0)),IF(ISERROR(MATCH(F398,Sources!$C:$C,0)),\"\",5*D398+3*E398),IF(AND(NOT(ISERROR(MATCH(A398,Sources!$D:$D,0))),NOT(ISERROR(MATCH(F398,Sources!$E:$E,0)))),5*D398+3*E398,\"\"))&IF(AND(ISERROR(MATCH(A398,Sources!$F:$F,0)),NOT(ISERROR(MATCH(F398,Sources!$G:$G,0)))),5*D398+3*E398,\"\")),\"\")","v":""},110]
["SUBMARINE",{"$f":"IFERROR(VLOOKUP(A399,Sheet2!$B$2:$C$18,2,0),\"\")","v":"Submarine"},"2018-08-27",2,0,"MAKADI BAY",126,null,{"$f":"IFERROR(VALUE(IF(ISERROR(MATCH(A399,Sources!$B:$B,0)),IF(ISERROR(MATCH(F399,Sources!$C:$C,0)),\"\",5*D399+3*E399),IF(AND(NOT(ISERROR(MATCH(A399,Sources!$D:$D,0))),NOT(ISERROR(MATCH(F399,Sources!$E:$E,0)))),5*D399+3*E399,\"\"))&IF(AND(ISERROR(MATCH(A399,Sources!$F:$F,0)),NOT(ISERROR(MATCH(F399,Sources!$G:$G,0)))),5*D399+3*E399,\"\")),\"\")","v":10},116]
["MOTO2",{"$f":"IFERROR(VLOOKUP(A400,Sheet2!$B$2:$C$18,2,0),\"\")","v":"Moto 2"},"2018-08-27",2,0,"MAKADI BAY",80,"20 $ DISCOUNT",{"$f":"IFERROR(VALUE(IF(ISERROR(MATCH(A400,Sources!$B:$B,0)),IF(ISERROR(MATCH(F400,Sources!$C:$C,0)),\"\",5*D400+3*E400),IF(AND(NOT(ISERROR(MATCH(A400,Sources!$D:$D,0))),NOT(ISERROR(MATCH(F400,Sources!$E:$E,0)))),5*D400+3*E400,\"\"))&IF(AND(ISERROR(MATCH(A400,Sources!$F:$F,0)),NOT(ISERROR(MATCH(F400,Sources!$G:$G,0)))),5*D400+3*E400,\"\")),\"\")","v":10},70]
["MOTO2",{"$f":"IFERROR(VLOOKUP(A401,Sheet2!$B$2:$C$18,2,0),\"\")","v":"Moto 2"},"2018-08-27",2,0,"MAKADI BAY",80,"20 $ DISCOUNT",{"$f":"IFERROR(VALUE(IF(ISERROR(MATCH(A401,Sources!$B:$B,0)),IF(ISERROR(MATCH(F401,Sources!$C:$C,0)),\"\",5*D401+3*E401),IF(AND(NOT(ISERROR(MATCH(A401,Sources!$D:$D,0))),NOT(ISERROR(MATCH(F401,Sources!$E:$E,0)))),5*D401+3*E401,\"\"))&IF(AND(ISERROR(MATCH(A401,Sources!$F:$F,0)),NOT(ISERROR(MATCH(F401,Sources!$G:$G,0)))),5*D401+3*E401,\"\")),\"\")","v":10},70]
["RUSALKA  ( MERMAID )",{"$f":"IFERROR(VLOOKUP(A402,Sheet2!$B$2:$C$18,2,0),\"\")","v":"Rusalka (Mermaid)"},"2018-08-27",1,0,"HURGADA",40,null,{"$f":"IFERROR(VALUE(IF(ISERROR(MATCH(A402,Sources!$B:$B,0)),IF(ISERROR(MATCH(F402,Sources!$C:$C,0)),\"\",5*D402+3*E402),IF(AND(NOT(ISERROR(MATCH(A402,Sources!$D:$D,0))),NOT(ISERROR(MATCH(F402,Sources!$E:$E,0)))),5*D402+3*E402,\"\"))&IF(AND(ISERROR(MATCH(A402,Sources!$F:$F,0)),NOT(ISERROR(MATCH(F402,Sources!$G:$G,0)))),5*D402+3*E402,\"\")),\"\")","v":""},40]
["GRAND AQUARIUM",{"$f":"IFERROR(VLOOKUP(A403,Sheet2!$B$2:$C$18,2,0),\"\")","v":"Grand Aquarium"},"2018-08-28",2,0,"HURGADA",80,null,{"$f":"IFERROR(VALUE(IF(ISERROR(MATCH(A403,Sources!$B:$B,0)),IF(ISERROR(MATCH(F403,Sources!$C:$C,0)),\"\",5*D403+3*E403),IF(AND(NOT(ISERROR(MATCH(A403,Sources!$D:$D,0))),NOT(ISERROR(MATCH(F403,Sources!$E:$E,0)))),5*D403+3*E403,\"\"))&IF(AND(ISERROR(MATCH(A403,Sources!$F:$F,0)),NOT(ISERROR(MATCH(F403,Sources!$G:$G,0)))),5*D403+3*E403,\"\")),\"\")","v":""},80]
["UTOPIA ISLAND",{"$f":"IFERROR(VLOOKUP(A404,Sheet2!$B$2:$C$18,2,0),\"\")","v":"Utopia"},"2018-08-28",5,2,"HURGADA",314,"17 $ DISCOUNT",{"$f":"IFERROR(VALUE(IF(ISERROR(MATCH(A404,Sources!$B:$B,0)),IF(ISERROR(MATCH(F404,Sources!$C:$C,0)),\"\",5*D404+3*E404),IF(AND(NOT(ISERROR(MATCH(A404,Sources!$D:$D,0))),NOT(ISERROR(MATCH(F404,Sources!$E:$E,0)))),5*D404+3*E404,\"\"))&IF(AND(ISERROR(MATCH(A404,Sources!$F:$F,0)),NOT(ISERROR(MATCH(F404,Sources!$G:$G,0)))),5*D404+3*E404,\"\")),\"\")","v":""},314]
["UTOPIA ISLAND",{"$f":"IFERROR(VLOOKUP(A405,Sheet2!$B$2:$C$18,2,0),\"\")","v":"Utopia"},"2018-08-28",7,2,"HURGADA",419,"22 $ DISCOUNT",{"$f":"IFERROR(VALUE(IF(ISERROR(MATCH(A405,Sources!$B:$B,0)),IF(ISERROR(MATCH(F405,Sources!$C:$C,0)),\"\",5*D405+3*E405),IF(AND(NOT(ISERROR(MATCH(A405,Sources!$D:$D,0))),NOT(ISERROR(MATCH(F405,Sources!$E:$E,0)))),5*D405+3*E405,\"\"))&IF(AND(ISERROR(MATCH(A405,Sources!$F:$F,0)),NOT(ISERROR(MATCH(F405,Sources!$G:$G,0)))),5*D405+3*E405,\"\")),\"\")","v":""},419]
["UTOPIA ISLAND",{"$f":"IFERROR(VLOOKUP(A406,Sheet2!$B$2:$C$18,2,0),\"\")","v":"Utopia"},"2018-08-28",6,0,"HURGADA",313,"17 $ DISCOUNT",{"$f":"IFERROR(VALUE(IF(ISERROR(MATCH(A406,Sources!$B:$B,0)),IF(ISERROR(MATCH(F406,Sources!$C:$C,0)),\"\",5*D406+3*E406),IF(AND(NOT(ISERROR(MATCH(A406,Sources!$D:$D,0))),NOT(ISERROR(MATCH(F406,Sources!$E:$E,0)))),5*D406+3*E406,\"\"))&IF(AND(ISERROR(MATCH(A406,Sources!$F:$F,0)),NOT(ISERROR(MATCH(F406,Sources!$G:$G,0)))),5*D406+3*E406,\"\")),\"\")","v":""},313]
["MOTO2",{"$f":"IFERROR(VLOOKUP(A407,Sheet2!$B$2:$C$18,2,0),\"\")","v":"Moto 2"},"2018-08-28",4,0,"HURGADA",180,null,{"$f":"IFERROR(VALUE(IF(ISERROR(MATCH(A407,Sources!$B:$B,0)),IF(ISERROR(MATCH(F407,Sources!$C:$C,0)),\"\",5*D407+3*E407),IF(AND(NOT(ISERROR(MATCH(A407,Sources!$D:$D,0))),NOT(ISERROR(MATCH(F407,Sources!$E:$E,0)))),5*D407+3*E407,\"\"))&IF(AND(ISERROR(MATCH(A407,Sources!$F:$F,0)),NOT(ISERROR(MATCH(F407,Sources!$G:$G,0)))),5*D407+3*E407,\"\")),\"\")","v":""},180]
["UTOPIA ISLAND",{"$f":"IFERROR(VLOOKUP(A408,Sheet2!$B$2:$C$18,2,0),\"\")","v":"Utopia"},"2018-08-28",2,0,"HURGADA",110,null,{"$f":"IFERROR(VALUE(IF(ISERROR(MATCH(A408,Sources!$B:$B,0)),IF(ISERROR(MATCH(F408,Sources!$C:$C,0)),\"\",5*D408+3*E408),IF(AND(NOT(ISERROR(MATCH(A408,Sources!$D:$D,0))),NOT(ISERROR(MATCH(F408,Sources!$E:$E,0)))),5*D408+3*E408,\"\"))&IF(AND(ISERROR(MATCH(A408,Sources!$F:$F,0)),NOT(ISERROR(MATCH(F408,Sources!$G:$G,0)))),5*D408+3*E408,\"\")),\"\")","v":""},110]
["OVER DAY LUXORQUEEN VALLY",{"$f":"IFERROR(VLOOKUP(A409,Sheet2!$B$2:$C$18,2,0),\"\")","v":"LUXOR 2"},"2018-08-28",2,0,"HURGADA",180,"german,ukraine",{"$f":"IFERROR(VALUE(IF(ISERROR(MATCH(A409,Sources!$B:$B,0)),IF(ISERROR(MATCH(F409,Sources!$C:$C,0)),\"\",5*D409+3*E409),IF(AND(NOT(ISERROR(MATCH(A409,Sources!$D:$D,0))),NOT(ISERROR(MATCH(F409,Sources!$E:$E,0)))),5*D409+3*E409,\"\"))&IF(AND(ISERROR(MATCH(A409,Sources!$F:$F,0)),NOT(ISERROR(MATCH(F409,Sources!$G:$G,0)))),5*D409+3*E409,\"\")),\"\")","v":""},180]
["OVER DAY LUXORQUEEN VALLY",{"$f":"IFERROR(VLOOKUP(A410,Sheet2!$B$2:$C$18,2,0),\"\")","v":"LUXOR 2"},"2018-08-28",2,0,"HURGADA",180,"ukraine",{"$f":"IFERROR(VALUE(IF(ISERROR(MATCH(A410,Sources!$B:$B,0)),IF(ISERROR(MATCH(F410,Sources!$C:$C,0)),\"\",5*D410+3*E410),IF(AND(NOT(ISERROR(MATCH(A410,Sources!$D:$D,0))),NOT(ISERROR(MATCH(F410,Sources!$E:$E,0)))),5*D410+3*E410,\"\"))&IF(AND(ISERROR(MATCH(A410,Sources!$F:$F,0)),NOT(ISERROR(MATCH(F410,Sources!$G:$G,0)))),5*D410+3*E410,\"\")),\"\")","v":""},180]
["OVER DAY LUXORQUEEN VALLY",{"$f":"IFERROR(VLOOKUP(A411,Sheet2!$B$2:$C$18,2,0),\"\")","v":"LUXOR 2"},"2018-08-28",2,0,"HURGADA",180,"ukraine",{"$f":"IFERROR(VALUE(IF(ISERROR(MATCH(A411,Sources!$B:$B,0)),IF(ISERROR(MATCH(F411,Sources!$C:$C,0)),\"\",5*D411+3*E411),IF(AND(NOT(ISERROR(MATCH(A411,Sources!$D:$D,0))),NOT(ISERROR(MATCH(F411,Sources!$E:$E,0)))),5*D411+3*E411,\"\"))&IF(AND(ISERROR(MATCH(A411,Sources!$F:$F,0)),NOT(ISERROR(MATCH(F411,Sources!$G:$G,0)))),5*D411+3*E411,\"\")),\"\")","v":""},180]
["UTOPIA ISLAND",{"$f":"IFERROR(VLOOKUP(A412,Sheet2!$B$2:$C$18,2,0),\"\")","v":"Utopia"},"2018-08-28",2,0,"MAKADI BAY",110,"from 26.08.18",{"$f":"IFERROR(VALUE(IF(ISERROR(MATCH(A412,Sources!$B:$B,0)),IF(ISERROR(MATCH(F412,Sources!$C:$C,0)),\"\",5*D412+3*E412),IF(AND(NOT(ISERROR(MATCH(A412,Sources!$D:$D,0))),NOT(ISERROR(MATCH(F412,Sources!$E:$E,0)))),5*D412+3*E412,\"\"))&IF(AND(ISERROR(MATCH(A412,Sources!$F:$F,0)),NOT(ISERROR(MATCH(F412,Sources!$G:$G,0)))),5*D412+3*E412,\"\")),\"\")","v":""},110]
["INTRO DIVING",{"$f":"IFERROR(VLOOKUP(A413,Sheet2!$B$2:$C$18,2,0),\"\")","v":"Diving"},"2018-08-28",2,0,"MAKADI BAY",140,null,{"$f":"IFERROR(VALUE(IF(ISERROR(MATCH(A413,Sources!$B:$B,0)),IF(ISERROR(MATCH(F413,Sources!$C:$C,0)),\"\",5*D413+3*E413),IF(AND(NOT(ISERROR(MATCH(A413,Sources!$D:$D,0))),NOT(ISERROR(MATCH(F413,Sources!$E:$E,0)))),5*D413+3*E413,\"\"))&IF(AND(ISERROR(MATCH(A413,Sources!$F:$F,0)),NOT(ISERROR(MATCH(F413,Sources!$G:$G,0)))),5*D413+3*E413,\"\")),\"\")","v":10},130]
["INTRO DIVING",{"$f":"IFERROR(VLOOKUP(A414,Sheet2!$B$2:$C$18,2,0),\"\")","v":"Diving"},"2018-08-28",2,0,"MAKADI BAY",140,null,{"$f":"IFERROR(VALUE(IF(ISERROR(MATCH(A414,Sources!$B:$B,0)),IF(ISERROR(MATCH(F414,Sources!$C:$C,0)),\"\",5*D414+3*E414),IF(AND(NOT(ISERROR(MATCH(A414,Sources!$D:$D,0))),NOT(ISERROR(MATCH(F414,Sources!$E:$E,0)))),5*D414+3*E414,\"\"))&IF(AND(ISERROR(MATCH(A414,Sources!$F:$F,0)),NOT(ISERROR(MATCH(F414,Sources!$G:$G,0)))),5*D414+3*E414,\"\")),\"\")","v":10},130]
["UTOPIA ISLAND",{"$f":"IFERROR(VLOOKUP(A415,Sheet2!$B$2:$C$18,2,0),\"\")","v":"Utopia"},"2018-08-28",2,1,"MAKADI BAY",138,null,{"$f":"IFERROR(VALUE(IF(ISERROR(MATCH(A415,Sources!$B:$B,0)),IF(ISERROR(MATCH(F415,Sources!$C:$C,0)),\"\",5*D415+3*E415),IF(AND(NOT(ISERROR(MATCH(A415,Sources!$D:$D,0))),NOT(ISERROR(MATCH(F415,Sources!$E:$E,0)))),5*D415+3*E415,\"\"))&IF(AND(ISERROR(MATCH(A415,Sources!$F:$F,0)),NOT(ISERROR(MATCH(F415,Sources!$G:$G,0)))),5*D415+3*E415,\"\")),\"\")","v":""},138]
["UTOPIA ISLAND",{"$f":"IFERROR(VLOOKUP(A416,Sheet2!$B$2:$C$18,2,0),\"\")","v":"Utopia"},"2018-08-28",2,1,"HURGADA",138,null,{"$f":"IFERROR(VALUE(IF(ISERROR(MATCH(A416,Sources!$B:$B,0)),IF(ISERROR(MATCH(F416,Sources!$C:$C,0)),\"\",5*D416+3*E416),IF(AND(NOT(ISERROR(MATCH(A416,Sources!$D:$D,0))),NOT(ISERROR(MATCH(F416,Sources!$E:$E,0)))),5*D416+3*E416,\"\"))&IF(AND(ISERROR(MATCH(A416,Sources!$F:$F,0)),NOT(ISERROR(MATCH(F416,Sources!$G:$G,0)))),5*D416+3*E416,\"\")),\"\")","v":""},138]
["UTOPIA ISLAND",{"$f":"IFERROR(VLOOKUP(A417,Sheet2!$B$2:$C$18,2,0),\"\")","v":"Utopia"},"2018-08-28",2,0,"MAKADI BAY",110,null,{"$f":"IFERROR(VALUE(IF(ISERROR(MATCH(A417,Sources!$B:$B,0)),IF(ISERROR(MATCH(F417,Sources!$C:$C,0)),\"\",5*D417+3*E417),IF(AND(NOT(ISERROR(MATCH(A417,Sources!$D:$D,0))),NOT(ISERROR(MATCH(F417,Sources!$E:$E,0)))),5*D417+3*E417,\"\"))&IF(AND(ISERROR(MATCH(A417,Sources!$F:$F,0)),NOT(ISERROR(MATCH(F417,Sources!$G:$G,0)))),5*D417+3*E417,\"\")),\"\")","v":""},110]
["UTOPIA ISLAND",{"$f":"IFERROR(VLOOKUP(A418,Sheet2!$B$2:$C$18,2,0),\"\")","v":"Utopia"},"2018-08-28",1,1,"MAKADI BAY",83,null,{"$f":"IFERROR(VALUE(IF(ISERROR(MATCH(A418,Sources!$B:$B,0)),IF(ISERROR(MATCH(F418,Sources!$C:$C,0)),\"\",5*D418+3*E418),IF(AND(NOT(ISERROR(MATCH(A418,Sources!$D:$D,0))),NOT(ISERROR(MATCH(F418,Sources!$E:$E,0)))),5*D418+3*E418,\"\"))&IF(AND(ISERROR(MATCH(A418,Sources!$F:$F,0)),NOT(ISERROR(MATCH(F418,Sources!$G:$G,0)))),5*D418+3*E418,\"\")),\"\")","v":""},83]
["OVER DAY LUXORQUEEN VALLY",{"$f":"IFERROR(VLOOKUP(A419,Sheet2!$B$2:$C$18,2,0),\"\")","v":"LUXOR 2"},"2018-08-28",2,0,"HURGADA",180,"ukraine",{"$f":"IFERROR(VALUE(IF(ISERROR(MATCH(A419,Sources!$B:$B,0)),IF(ISERROR(MATCH(F419,Sources!$C:$C,0)),\"\",5*D419+3*E419),IF(AND(NOT(ISERROR(MATCH(A419,Sources!$D:$D,0))),NOT(ISERROR(MATCH(F419,Sources!$E:$E,0)))),5*D419+3*E419,\"\"))&IF(AND(ISERROR(MATCH(A419,Sources!$F:$F,0)),NOT(ISERROR(MATCH(F419,Sources!$G:$G,0)))),5*D419+3*E419,\"\")),\"\")","v":""},180]
["OVER DAY LUXORQUEEN VALLY",{"$f":"IFERROR(VLOOKUP(A420,Sheet2!$B$2:$C$18,2,0),\"\")","v":"LUXOR 2"},"2018-08-28",2,0,"HURGADA",180,"ukraine",{"$f":"IFERROR(VALUE(IF(ISERROR(MATCH(A420,Sources!$B:$B,0)),IF(ISERROR(MATCH(F420,Sources!$C:$C,0)),\"\",5*D420+3*E420),IF(AND(NOT(ISERROR(MATCH(A420,Sources!$D:$D,0))),NOT(ISERROR(MATCH(F420,Sources!$E:$E,0)))),5*D420+3*E420,\"\"))&IF(AND(ISERROR(MATCH(A420,Sources!$F:$F,0)),NOT(ISERROR(MATCH(F420,Sources!$G:$G,0)))),5*D420+3*E420,\"\")),\"\")","v":""},180]
["UTOPIA ISLAND",{"$f":"IFERROR(VLOOKUP(A421,Sheet2!$B$2:$C$18,2,0),\"\")","v":"Utopia"},"2018-08-28",3,1,"HURGADA",193,null,{"$f":"IFERROR(VALUE(IF(ISERROR(MATCH(A421,Sources!$B:$B,0)),IF(ISERROR(MATCH(F421,Sources!$C:$C,0)),\"\",5*D421+3*E421),IF(AND(NOT(ISERROR(MATCH(A421,Sources!$D:$D,0))),NOT(ISERROR(MATCH(F421,Sources!$E:$E,0)))),5*D421+3*E421,\"\"))&IF(AND(ISERROR(MATCH(A421,Sources!$F:$F,0)),NOT(ISERROR(MATCH(F421,Sources!$G:$G,0)))),5*D421+3*E421,\"\")),\"\")","v":""},193]
["MOTO2",{"$f":"IFERROR(VLOOKUP(A422,Sheet2!$B$2:$C$18,2,0),\"\")","v":"Moto 2"},"2018-08-28",2,0,"HURGADA",90,null,{"$f":"IFERROR(VALUE(IF(ISERROR(MATCH(A422,Sources!$B:$B,0)),IF(ISERROR(MATCH(F422,Sources!$C:$C,0)),\"\",5*D422+3*E422),IF(AND(NOT(ISERROR(MATCH(A422,Sources!$D:$D,0))),NOT(ISERROR(MATCH(F422,Sources!$E:$E,0)))),5*D422+3*E422,\"\"))&IF(AND(ISERROR(MATCH(A422,Sources!$F:$F,0)),NOT(ISERROR(MATCH(F422,Sources!$G:$G,0)))),5*D422+3*E422,\"\")),\"\")","v":""},90]
["GRAND AQUARIUM",{"$f":"IFERROR(VLOOKUP(A423,Sheet2!$B$2:$C$18,2,0),\"\")","v":"Grand Aquarium"},"2018-08-28",3,0,"HURGADA",120,null,{"$f":"IFERROR(VALUE(IF(ISERROR(MATCH(A423,Sources!$B:$B,0)),IF(ISERROR(MATCH(F423,Sources!$C:$C,0)),\"\",5*D423+3*E423),IF(AND(NOT(ISERROR(MATCH(A423,Sources!$D:$D,0))),NOT(ISERROR(MATCH(F423,Sources!$E:$E,0)))),5*D423+3*E423,\"\"))&IF(AND(ISERROR(MATCH(A423,Sources!$F:$F,0)),NOT(ISERROR(MATCH(F423,Sources!$G:$G,0)))),5*D423+3*E423,\"\")),\"\")","v":""},120]
["OVER DAY LUXORQUEEN VALLY",{"$f":"IFERROR(VLOOKUP(A424,Sheet2!$B$2:$C$18,2,0),\"\")","v":"LUXOR 2"},"2018-08-28",2,1,"HURGADA",225,"ukraine",{"$f":"IFERROR(VALUE(IF(ISERROR(MATCH(A424,Sources!$B:$B,0)),IF(ISERROR(MATCH(F424,Sources!$C:$C,0)),\"\",5*D424+3*E424),IF(AND(NOT(ISERROR(MATCH(A424,Sources!$D:$D,0))),NOT(ISERROR(MATCH(F424,Sources!$E:$E,0)))),5*D424+3*E424,\"\"))&IF(AND(ISERROR(MATCH(A424,Sources!$F:$F,0)),NOT(ISERROR(MATCH(F424,Sources!$G:$G,0)))),5*D424+3*E424,\"\")),\"\")","v":""},225]
["GRAND AQUARIUM",{"$f":"IFERROR(VLOOKUP(A425,Sheet2!$B$2:$C$18,2,0),\"\")","v":"Grand Aquarium"},"2018-08-28",1,0,"HURGADA",40,null,{"$f":"IFERROR(VALUE(IF(ISERROR(MATCH(A425,Sources!$B:$B,0)),IF(ISERROR(MATCH(F425,Sources!$C:$C,0)),\"\",5*D425+3*E425),IF(AND(NOT(ISERROR(MATCH(A425,Sources!$D:$D,0))),NOT(ISERROR(MATCH(F425,Sources!$E:$E,0)))),5*D425+3*E425,\"\"))&IF(AND(ISERROR(MATCH(A425,Sources!$F:$F,0)),NOT(ISERROR(MATCH(F425,Sources!$G:$G,0)))),5*D425+3*E425,\"\")),\"\")","v":""},40]
["OVER DAY LUXORQUEEN VALLY",{"$f":"IFERROR(VLOOKUP(A426,Sheet2!$B$2:$C$18,2,0),\"\")","v":"LUXOR 2"},"2018-08-28",1,0,"MAKADI BAY",90,null,{"$f":"IFERROR(VALUE(IF(ISERROR(MATCH(A426,Sources!$B:$B,0)),IF(ISERROR(MATCH(F426,Sources!$C:$C,0)),\"\",5*D426+3*E426),IF(AND(NOT(ISERROR(MATCH(A426,Sources!$D:$D,0))),NOT(ISERROR(MATCH(F426,Sources!$E:$E,0)))),5*D426+3*E426,\"\"))&IF(AND(ISERROR(MATCH(A426,Sources!$F:$F,0)),NOT(ISERROR(MATCH(F426,Sources!$G:$G,0)))),5*D426+3*E426,\"\")),\"\")","v":""},90]
["OVER DAY LUXORQUEEN VALLY",{"$f":"IFERROR(VLOOKUP(A427,Sheet2!$B$2:$C$18,2,0),\"\")","v":"LUXOR 2"},"2018-08-28",2,1,"HURGADA",225,"belarus",{"$f":"IFERROR(VALUE(IF(ISERROR(MATCH(A427,Sources!$B:$B,0)),IF(ISERROR(MATCH(F427,Sources!$C:$C,0)),\"\",5*D427+3*E427),IF(AND(NOT(ISERROR(MATCH(A427,Sources!$D:$D,0))),NOT(ISERROR(MATCH(F427,Sources!$E:$E,0)))),5*D427+3*E427,\"\"))&IF(AND(ISERROR(MATCH(A427,Sources!$F:$F,0)),NOT(ISERROR(MATCH(F427,Sources!$G:$G,0)))),5*D427+3*E427,\"\")),\"\")","v":""},225]
["OVER DAY LUXORQUEEN VALLY",{"$f":"IFERROR(VLOOKUP(A428,Sheet2!$B$2:$C$18,2,0),\"\")","v":"LUXOR 2"},"2018-08-28",2,0,"HURGADA",180,"ukraine",{"$f":"IFERROR(VALUE(IF(ISERROR(MATCH(A428,Sources!$B:$B,0)),IF(ISERROR(MATCH(F428,Sources!$C:$C,0)),\"\",5*D428+3*E428),IF(AND(NOT(ISERROR(MATCH(A428,Sources!$D:$D,0))),NOT(ISERROR(MATCH(F428,Sources!$E:$E,0)))),5*D428+3*E428,\"\"))&IF(AND(ISERROR(MATCH(A428,Sources!$F:$F,0)),NOT(ISERROR(MATCH(F428,Sources!$G:$G,0)))),5*D428+3*E428,\"\")),\"\")","v":""},180]
["MOTO 1 HOUR",{"$f":"IFERROR(VLOOKUP(A429,Sheet2!$B$2:$C$18,2,0),\"\")","v":"Moto 1 Hour"},"2018-08-29",2,0,"HURGADA",80,null,{"$f":"IFERROR(VALUE(IF(ISERROR(MATCH(A429,Sources!$B:$B,0)),IF(ISERROR(MATCH(F429,Sources!$C:$C,0)),\"\",5*D429+3*E429),IF(AND(NOT(ISERROR(MATCH(A429,Sources!$D:$D,0))),NOT(ISERROR(MATCH(F429,Sources!$E:$E,0)))),5*D429+3*E429,\"\"))&IF(AND(ISERROR(MATCH(A429,Sources!$F:$F,0)),NOT(ISERROR(MATCH(F429,Sources!$G:$G,0)))),5*D429+3*E429,\"\")),\"\")","v":""},80]
["MOTO2",{"$f":"IFERROR(VLOOKUP(A430,Sheet2!$B$2:$C$18,2,0),\"\")","v":"Moto 2"},"2018-08-29",3,0,"HURGADA",135,null,{"$f":"IFERROR(VALUE(IF(ISERROR(MATCH(A430,Sources!$B:$B,0)),IF(ISERROR(MATCH(F430,Sources!$C:$C,0)),\"\",5*D430+3*E430),IF(AND(NOT(ISERROR(MATCH(A430,Sources!$D:$D,0))),NOT(ISERROR(MATCH(F430,Sources!$E:$E,0)))),5*D430+3*E430,\"\"))&IF(AND(ISERROR(MATCH(A430,Sources!$F:$F,0)),NOT(ISERROR(MATCH(F430,Sources!$G:$G,0)))),5*D430+3*E430,\"\")),\"\")","v":""},135]
["MOTO2",{"$f":"IFERROR(VLOOKUP(A431,Sheet2!$B$2:$C$18,2,0),\"\")","v":"Moto 2"},"2018-08-29",2,1,"HURGADA",113,null,{"$f":"IFERROR(VALUE(IF(ISERROR(MATCH(A431,Sources!$B:$B,0)),IF(ISERROR(MATCH(F431,Sources!$C:$C,0)),\"\",5*D431+3*E431),IF(AND(NOT(ISERROR(MATCH(A431,Sources!$D:$D,0))),NOT(ISERROR(MATCH(F431,Sources!$E:$E,0)))),5*D431+3*E431,\"\"))&IF(AND(ISERROR(MATCH(A431,Sources!$F:$F,0)),NOT(ISERROR(MATCH(F431,Sources!$G:$G,0)))),5*D431+3*E431,\"\")),\"\")","v":""},113]
["INTRO DIVING",{"$f":"IFERROR(VLOOKUP(A432,Sheet2!$B$2:$C$18,2,0),\"\")","v":"Diving"},"2018-08-29",1,0,"HURGADA",65,null,{"$f":"IFERROR(VALUE(IF(ISERROR(MATCH(A432,Sources!$B:$B,0)),IF(ISERROR(MATCH(F432,Sources!$C:$C,0)),\"\",5*D432+3*E432),IF(AND(NOT(ISERROR(MATCH(A432,Sources!$D:$D,0))),NOT(ISERROR(MATCH(F432,Sources!$E:$E,0)))),5*D432+3*E432,\"\"))&IF(AND(ISERROR(MATCH(A432,Sources!$F:$F,0)),NOT(ISERROR(MATCH(F432,Sources!$G:$G,0)))),5*D432+3*E432,\"\")),\"\")","v":""},65]
["SNORKELING ON DIVING BOAT",{"$f":"IFERROR(VLOOKUP(A433,Sheet2!$B$2:$C$18,2,0),\"\")","v":"Snorkling"},"2018-08-29",1,0,"HURGADA",40,null,{"$f":"IFERROR(VALUE(IF(ISERROR(MATCH(A433,Sources!$B:$B,0)),IF(ISERROR(MATCH(F433,Sources!$C:$C,0)),\"\",5*D433+3*E433),IF(AND(NOT(ISERROR(MATCH(A433,Sources!$D:$D,0))),NOT(ISERROR(MATCH(F433,Sources!$E:$E,0)))),5*D433+3*E433,\"\"))&IF(AND(ISERROR(MATCH(A433,Sources!$F:$F,0)),NOT(ISERROR(MATCH(F433,Sources!$G:$G,0)))),5*D433+3*E433,\"\")),\"\")","v":""},40]
["MOTO2",{"$f":"IFERROR(VLOOKUP(A434,Sheet2!$B$2:$C$18,2,0),\"\")","v":"Moto 2"},"2018-08-29",3,0,"HURGADA",135,null,{"$f":"IFERROR(VALUE(IF(ISERROR(MATCH(A434,Sources!$B:$B,0)),IF(ISERROR(MATCH(F434,Sources!$C:$C,0)),\"\",5*D434+3*E434),IF(AND(NOT(ISERROR(MATCH(A434,Sources!$D:$D,0))),NOT(ISERROR(MATCH(F434,Sources!$E:$E,0)))),5*D434+3*E434,\"\"))&IF(AND(ISERROR(MATCH(A434,Sources!$F:$F,0)),NOT(ISERROR(MATCH(F434,Sources!$G:$G,0)))),5*D434+3*E434,\"\")),\"\")","v":""},135]
["UTOPIA ISLAND",{"$f":"IFERROR(VLOOKUP(A435,Sheet2!$B$2:$C$18,2,0),\"\")","v":"Utopia"},"2018-08-30",2,0,"HURGADA",110,"from 28.08",{"$f":"IFERROR(VALUE(IF(ISERROR(MATCH(A435,Sources!$B:$B,0)),IF(ISERROR(MATCH(F435,Sources!$C:$C,0)),\"\",5*D435+3*E435),IF(AND(NOT(ISERROR(MATCH(A435,Sources!$D:$D,0))),NOT(ISERROR(MATCH(F435,Sources!$E:$E,0)))),5*D435+3*E435,\"\"))&IF(AND(ISERROR(MATCH(A435,Sources!$F:$F,0)),NOT(ISERROR(MATCH(F435,Sources!$G:$G,0)))),5*D435+3*E435,\"\")),\"\")","v":""},110]
["GRAND AQUARIUM",{"$f":"IFERROR(VLOOKUP(A436,Sheet2!$B$2:$C$18,2,0),\"\")","v":"Grand Aquarium"},"2018-08-30",2,0,"HURGADA",90,null,{"$f":"IFERROR(VALUE(IF(ISERROR(MATCH(A436,Sources!$B:$B,0)),IF(ISERROR(MATCH(F436,Sources!$C:$C,0)),\"\",5*D436+3*E436),IF(AND(NOT(ISERROR(MATCH(A436,Sources!$D:$D,0))),NOT(ISERROR(MATCH(F436,Sources!$E:$E,0)))),5*D436+3*E436,\"\"))&IF(AND(ISERROR(MATCH(A436,Sources!$F:$F,0)),NOT(ISERROR(MATCH(F436,Sources!$G:$G,0)))),5*D436+3*E436,\"\")),\"\")","v":""},90]
["UTOPIA ISLAND",{"$f":"IFERROR(VLOOKUP(A437,Sheet2!$B$2:$C$18,2,0),\"\")","v":"Utopia"},"2018-08-30",2,0,"HURGADA",110,null,{"$f":"IFERROR(VALUE(IF(ISERROR(MATCH(A437,Sources!$B:$B,0)),IF(ISERROR(MATCH(F437,Sources!$C:$C,0)),\"\",5*D437+3*E437),IF(AND(NOT(ISERROR(MATCH(A437,Sources!$D:$D,0))),NOT(ISERROR(MATCH(F437,Sources!$E:$E,0)))),5*D437+3*E437,\"\"))&IF(AND(ISERROR(MATCH(A437,Sources!$F:$F,0)),NOT(ISERROR(MATCH(F437,Sources!$G:$G,0)))),5*D437+3*E437,\"\")),\"\")","v":""},110]
["UTOPIA ISLAND",{"$f":"IFERROR(VLOOKUP(A438,Sheet2!$B$2:$C$18,2,0),\"\")","v":"Utopia"},"2018-08-30",3,0,"HURGADA",165,null,{"$f":"IFERROR(VALUE(IF(ISERROR(MATCH(A438,Sources!$B:$B,0)),IF(ISERROR(MATCH(F438,Sources!$C:$C,0)),\"\",5*D438+3*E438),IF(AND(NOT(ISERROR(MATCH(A438,Sources!$D:$D,0))),NOT(ISERROR(MATCH(F438,Sources!$E:$E,0)))),5*D438+3*E438,\"\"))&IF(AND(ISERROR(MATCH(A438,Sources!$F:$F,0)),NOT(ISERROR(MATCH(F438,Sources!$G:$G,0)))),5*D438+3*E438,\"\")),\"\")","v":""},165]
["UTOPIA ISLAND",{"$f":"IFERROR(VLOOKUP(A439,Sheet2!$B$2:$C$18,2,0),\"\")","v":"Utopia"},"2018-08-30",3,1,"HURGADA",193,null,{"$f":"IFERROR(VALUE(IF(ISERROR(MATCH(A439,Sources!$B:$B,0)),IF(ISERROR(MATCH(F439,Sources!$C:$C,0)),\"\",5*D439+3*E439),IF(AND(NOT(ISERROR(MATCH(A439,Sources!$D:$D,0))),NOT(ISERROR(MATCH(F439,Sources!$E:$E,0)))),5*D439+3*E439,\"\"))&IF(AND(ISERROR(MATCH(A439,Sources!$F:$F,0)),NOT(ISERROR(MATCH(F439,Sources!$G:$G,0)))),5*D439+3*E439,\"\")),\"\")","v":""},193]
["UTOPIA ISLAND",{"$f":"IFERROR(VLOOKUP(A440,Sheet2!$B$2:$C$18,2,0),\"\")","v":"Utopia"},"2018-08-30",1,1,"HURGADA",83,null,{"$f":"IFERROR(VALUE(IF(ISERROR(MATCH(A440,Sources!$B:$B,0)),IF(ISERROR(MATCH(F440,Sources!$C:$C,0)),\"\",5*D440+3*E440),IF(AND(NOT(ISERROR(MATCH(A440,Sources!$D:$D,0))),NOT(ISERROR(MATCH(F440,Sources!$E:$E,0)))),5*D440+3*E440,\"\"))&IF(AND(ISERROR(MATCH(A440,Sources!$F:$F,0)),NOT(ISERROR(MATCH(F440,Sources!$G:$G,0)))),5*D440+3*E440,\"\")),\"\")","v":""},83]
["UTOPIA ISLAND",{"$f":"IFERROR(VLOOKUP(A441,Sheet2!$B$2:$C$18,2,0),\"\")","v":"Utopia"},"2018-08-30",2,0,"HURGADA",110,null,{"$f":"IFERROR(VALUE(IF(ISERROR(MATCH(A441,Sources!$B:$B,0)),IF(ISERROR(MATCH(F441,Sources!$C:$C,0)),\"\",5*D441+3*E441),IF(AND(NOT(ISERROR(MATCH(A441,Sources!$D:$D,0))),NOT(ISERROR(MATCH(F441,Sources!$E:$E,0)))),5*D441+3*E441,\"\"))&IF(AND(ISERROR(MATCH(A441,Sources!$F:$F,0)),NOT(ISERROR(MATCH(F441,Sources!$G:$G,0)))),5*D441+3*E441,\"\")),\"\")","v":""},110]
["UTOPIA ISLAND",{"$f":"IFERROR(VLOOKUP(A442,Sheet2!$B$2:$C$18,2,0),\"\")","v":"Utopia"},"2018-08-30",2,0,"HURGADA",110,null,{"$f":"IFERROR(VALUE(IF(ISERROR(MATCH(A442,Sources!$B:$B,0)),IF(ISERROR(MATCH(F442,Sources!$C:$C,0)),\"\",5*D442+3*E442),IF(AND(NOT(ISERROR(MATCH(A442,Sources!$D:$D,0))),NOT(ISERROR(MATCH(F442,Sources!$E:$E,0)))),5*D442+3*E442,\"\"))&IF(AND(ISERROR(MATCH(A442,Sources!$F:$F,0)),NOT(ISERROR(MATCH(F442,Sources!$G:$G,0)))),5*D442+3*E442,\"\")),\"\")","v":""},110]
["UTOPIA ISLAND",{"$f":"IFERROR(VLOOKUP(A443,Sheet2!$B$2:$C$18,2,0),\"\")","v":"Utopia"},"2018-08-30",2,0,"HURGADA",110,null,{"$f":"IFERROR(VALUE(IF(ISERROR(MATCH(A443,Sources!$B:$B,0)),IF(ISERROR(MATCH(F443,Sources!$C:$C,0)),\"\",5*D443+3*E443),IF(AND(NOT(ISERROR(MATCH(A443,Sources!$D:$D,0))),NOT(ISERROR(MATCH(F443,Sources!$E:$E,0)))),5*D443+3*E443,\"\"))&IF(AND(ISERROR(MATCH(A443,Sources!$F:$F,0)),NOT(ISERROR(MATCH(F443,Sources!$G:$G,0)))),5*D443+3*E443,\"\")),\"\")","v":""},110]
["UTOPIA ISLAND",{"$f":"IFERROR(VLOOKUP(A444,Sheet2!$B$2:$C$18,2,0),\"\")","v":"Utopia"},"2018-08-30",3,0,"HURGADA",165,null,{"$f":"IFERROR(VALUE(IF(ISERROR(MATCH(A444,Sources!$B:$B,0)),IF(ISERROR(MATCH(F444,Sources!$C:$C,0)),\"\",5*D444+3*E444),IF(AND(NOT(ISERROR(MATCH(A444,Sources!$D:$D,0))),NOT(ISERROR(MATCH(F444,Sources!$E:$E,0)))),5*D444+3*E444,\"\"))&IF(AND(ISERROR(MATCH(A444,Sources!$F:$F,0)),NOT(ISERROR(MATCH(F444,Sources!$G:$G,0)))),5*D444+3*E444,\"\")),\"\")","v":""},165]

{"sheet":"Excurcion","index":2,"n_rows":82,"n_cols":11,"rows_kept":82,"cut":false,"hidden":false,"merged":[[0,11,3,22],[2,9,3,9],[2,4,3,4],[2,0,3,0],[2,1,3,1],[2,2,2,3],[2,5,3,5],[2,7,3,7],[2,8,3,8],[2,6,3,6]]}
[526,"  01/08/2018  till  31/08/2018",{"$f":"SUMPRODUCT((Data!$C:$C=A1)*(Data!$B:$B=B1)*(Data!$D:$D))","v":{"$error":"#VALUE!"}},{"$f":"SUMPRODUCT((Data!$C:$C=A1)*(Data!$B:$B=B1)*(Data!$E:$E))","v":{"$error":"#VALUE!"}}]
[null,{"$f":"INDIRECT(\"Data!B\"&MATCH(A5,Data!$C$2:$C$188,0)&\":B100000\")","v":"Moto 2"},{"$f":"SUBTOTAL(9,C5:C81)","v":363},{"$f":"SUBTOTAL(9,D5:D81)","v":49},null,null,null,{"$f":"SUBTOTAL(9,H5:H81)","v":{"$error":"#N/A"}}]
["Date","Ex",null,null,"Price","ch","Plus","Total","TRANSFER","dis"]
[null,null,"Adl","Chd"]
["2018-08-01",{"$f":"IFERROR(INDEX(INDIRECT(\"Data!B\"&MATCH(A5,Data!$C$2:$C$100000,0)+1&\":B100000\"),SMALL(IF((A5=INDIRECT(\"Data!C\"&MATCH(A5,Data!$C$2:$C$100000,0)+1&\":C100000\"))*(MATCH(INDIRECT(\"Data!B\"&MATCH(A5,Data!$C$2:$C$100000,0)+1&\":B100000\")&\"\",INDIRECT(\"Data!B\"&MATCH(A5,Data!$C$2:$C$100000,0)+1&\":B100000\")&\"\",0)=(ROW(INDIRECT(\"Data!B\"&MATCH(A5,Data!$C$2:$C$100000,0)+1&\":B100000\"))-MATCH(A5,Data!$C$2:$C$100000,0))),ROW(INDIRECT(\"Data!B\"&MATCH(A5,Data!$C$2:$C$100000,0)+1&\":B100000\"))-MATCH(A5,Data!$C$2:$C$100000,0),\"\"),COUNTIF($A$5:A5,A5))),\"\")","v":"Moto 2"},{"$f":"SUMIFS(Data!$D:$D,Data!$C:$C,A5,Data!$B:$B,B5)","v":4},{"$f":"SUMIFS(Data!$E:$E,Data!$C:$C,A5,Data!$B:$B,B5)","v":0},{"$f":"IF(AND(B5=\"Grand Aquarium\",WEEKDAY(A5)=3),40,IF(AND(B5=\"Grand Aquarium\",WEEKDAY(A5)=7),40,VLOOKUP(B5,Price!$A$6:$C$216,2,0)))","v":45},{"$f":"IF(AND(B5=\"Grand Aquarium\",WEEKDAY(A5)=3),20,IF(AND(B5=\"Grand Aquarium\",WEEKDAY(A5)=7),20,VLOOKUP(B5,Price!$A$6:$C$216,3,0)))","v":23},{"$f":"IF(SUMIFS(Data!$J:$J,Data!$C:$C,A5,Data!$B:$B,B5)>H5,SUMIFS(Data!$J:$J,Data!$C:$C,A5,Data!$B:$B,B5)-H5,\"\")","v":0},{"$f":"(C5*E5)+(D5*F5)+G5","v":180},{"$f":"SUMPRODUCT((Data!$C:$C=A5)*(Data!$B:$B=B5),(Data!$I:$I))","v":0},{"$f":"IF(SUMIFS(Data!$J:$J,Data!$C:$C,A5,Data!$B:$B,B5)<H5,H5-SUMIFS(Data!$J:$J,Data!$C:$C,A5,Data!$B:$B,B5),\"\")","v":0}]
["2018-08-01",{"$f":"IFERROR(INDEX(INDIRECT(\"Data!B\"&MATCH(A6,Data!$C$2:$C$100000,0)+1&\":B100000\"),SMALL(IF((A6=INDIRECT(\"Data!C\"&MATCH(A6,Data!$C$2:$C$100000,0)+1&\":C100000\"))*(MATCH(INDIRECT(\"Data!B\"&MATCH(A6,Data!$C$2:$C$100000,0)+1&\":B100000\")&\"\",INDIRECT(\"Data!B\"&MATCH(A6,Data!$C$2:$C$100000,0)+1&\":B100000\")&\"\",0)=(ROW(INDIRECT(\"Data!B\"&MATCH(A6,Data!$C$2:$C$100000,0)+1&\":B100000\"))-MATCH(A6,Data!$C$2:$C$100000,0))),ROW(INDIRECT(\"Data!B\"&MATCH(A6,Data!$C$2:$C$100000,0)+1&\":B100000\"))-MATCH(A6,Data!$C$2:$C$100000,0),\"\"),COUNTIF($A$5:A6,A6))),\"\")","v":"Moto 1 Hour"},{"$f":"SUMIFS(Data!$D:$D,Data!$C:$C,A6,Data!$B:$B,B6)","v":1},{"$f":"SUMIFS(Data!$E:$E,Data!$C:$C,A6,Data!$B:$B,B6)","v":1},{"$f":"IF(AND(B6=\"Grand Aquarium\",WEEKDAY(A6)=3),40,IF(AND(B6=\"Grand Aquarium\",WEEKDAY(A6)=7),40,VLOOKUP(B6,Price!$A$6:$C$216,2,0)))","v":40},{"$f":"IF(AND(B6=\"Grand Aquarium\",WEEKDAY(A6)=3),20,IF(AND(B6=\"Grand Aquarium\",WEEKDAY(A6)=7),20,VLOOKUP(B6,Price!$A$6:$C$216,3,0)))","v":20},{"$f":"IF(SUMIFS(Data!$J:$J,Data!$C:$C,A6,Data!$B:$B,B6)>H6,SUMIFS(Data!$J:$J,Data!$C:$C,A6,Data!$B:$B,B6)-H6,\"\")","v":0},{"$f":"(C6*E6)+(D6*F6)+G6","v":180},{"$f":"SUMPRODUCT((Data!$C:$C=A6)*(Data!$B:$B=B6),(Data!$I:$I))","v":0},{"$f":"IF(SUMIFS(Data!$J:$J,Data!$C:$C,A6,Data!$B:$B,B6)<H6,H6-SUMIFS(Data!$J:$J,Data!$C:$C,A6,Data!$B:$B,B6),\"\")","v":0}]
["2018-08-01",{"$f":"IFERROR(INDEX(INDIRECT(\"Data!B\"&MATCH(A7,Data!$C$2:$C$100000,0)+1&\":B100000\"),SMALL(IF((A7=INDIRECT(\"Data!C\"&MATCH(A7,Data!$C$2:$C$100000,0)+1&\":C100000\"))*(MATCH(INDIRECT(\"Data!B\"&MATCH(A7,Data!$C$2:$C$100000,0)+1&\":B100000\")&\"\",INDIRECT(\"Data!B\"&MATCH(A7,Data!$C$2:$C$100000,0)+1&\":B100000\")&\"\",0)=(ROW(INDIRECT(\"Data!B\"&MATCH(A7,Data!$C$2:$C$100000,0)+1&\":B100000\"))-MATCH(A7,Data!$C$2:$C$100000,0))),ROW(INDIRECT(\"Data!B\"&MATCH(A7,Data!$C$2:$C$100000,0)+1&\":B100000\"))-MATCH(A7,Data!$C$2:$C$100000,0),\"\"),COUNTIF($A$5:A7,A7))),\"\")","v":"LUXOR 2"},{"$f":"SUMIFS(Data!$D:$D,Data!$C:$C,A7,Data!$B:$B,B7)","v":11},{"$f":"SUMIFS(Data!$E:$E,Data!$C:$C,A7,Data!$B:$B,B7)","v":2},{"$f":"IF(AND(B7=\"Grand Aquarium\",WEEKDAY(A7)=3),40,IF(AND(B7=\"Grand Aquarium\",WEEKDAY(A7)=7),40,VLOOKUP(B7,Price!$A$6:$C$216,2,0)))","v":90},{"$f":"IF(AND(B7=\"Grand Aquarium\",WEEKDAY(A7)=3),20,IF(AND(B7=\"Grand Aquarium\",WEEKDAY(A7)=7),20,VLOOKUP(B7,Price!$A$6:$C$216,3,0)))","v":45},{"$f":"IF(SUMIFS(Data!$J:$J,Data!$C:$C,A7,Data!$B:$B,B7)>H7,SUMIFS(Data!$J:$J,Data!$C:$C,A7,Data!$B:$B,B7)-H7,\"\")","v":0},180,{"$f":"SUMPRODUCT((Data!$C:$C=A7)*(Data!$B:$B=B7),(Data!$I:$I))","v":0},{"$f":"IF(SUMIFS(Data!$J:$J,Data!$C:$C,A7,Data!$B:$B,B7)<H7,H7-SUMIFS(Data!$J:$J,Data!$C:$C,A7,Data!$B:$B,B7),\"\")","v":0}]
[null,{"$f":"IFERROR(INDEX(INDIRECT(\"Data!B\"&MATCH(A8,Data!$C$2:$C$100000,0)+1&\":B100000\"),SMALL(IF((A8=INDIRECT(\"Data!C\"&MATCH(A8,Data!$C$2:$C$100000,0)+1&\":C100000\"))*(MATCH(INDIRECT(\"Data!B\"&MATCH(A8,Data!$C$2:$C$100000,0)+1&\":B100000\")&\"\",INDIRECT(\"Data!B\"&MATCH(A8,Data!$C$2:$C$100000,0)+1&\":B100000\")&\"\",0)=(ROW(INDIRECT(\"Data!B\"&MATCH(A8,Data!$C$2:$C$100000,0)+1&\":B100000\"))-MATCH(A8,Data!$C$2:$C$100000,0))),ROW(INDIRECT(\"Data!B\"&MATCH(A8,Data!$C$2:$C$100000,0)+1&\":B100000\"))-MATCH(A8,Data!$C$2:$C$100000,0),\"\"),COUNTIF($A$5:A8,A8))),\"\")","v":""},{"$f":"SUMIFS(Data!$D:$D,Data!$C:$C,A8,Data!$B:$B,B8)","v":0},{"$f":"SUMIFS(Data!$E:$E,Data!$C:$C,A8,Data!$B:$B,B8)","v":0},null,null,{"$f":"IF(SUMIFS(Data!$J:$J,Data!$C:$C,A8,Data!$B:$B,B8)>H8,SUMIFS(Data!$J:$J,Data!$C:$C,A8,Data!$B:$B,B8)-H8,\"\")","v":0},180,{"$f":"SUMPRODUCT((Data!$C:$C=A8)*(Data!$B:$B=B8),(Data!$I:$I))","v":0},{"$f":"IF(SUMIFS(Data!$J:$J,Data!$C:$C,A8,Data!$B:$B,B8)<H8,H8-SUMIFS(Data!$J:$J,Data!$C:$C,A8,Data!$B:$B,B8),\"\")","v":0},{"$f":"SUM(H5:H7)","v":0}]
["2018-08-02",{"$f":"IFERROR(INDEX(INDIRECT(\"Data!B\"&MATCH(A9,Data!$C$2:$C$100000,0)+1&\":B100000\"),SMALL(IF((A9=INDIRECT(\"Data!C\"&MATCH(A9,Data!$C$2:$C$100000,0)+1&\":C100000\"))*(MATCH(INDIRECT(\"Data!B\"&MATCH(A9,Data!$C$2:$C$100000,0)+1&\":B100000\")&\"\",INDIRECT(\"Data!B\"&MATCH(A9,Data!$C$2:$C$100000,0)+1&\":B100000\")&\"\",0)=(ROW(INDIRECT(\"Data!B\"&MATCH(A9,Data!$C$2:$C$100000,0)+1&\":B100000\"))-MATCH(A9,Data!$C$2:$C$100000,0))),ROW(INDIRECT(\"Data!B\"&MATCH(A9,Data!$C$2:$C$100000,0)+1&\":B100000\"))-MATCH(A9,Data!$C$2:$C$100000,0),\"\"),COUNTIF($A$5:A9,A9))),\"\")","v":"Rusalka (Mermaid)"},{"$f":"SUMIFS(Data!$D:$D,Data!$C:$C,A9,Data!$B:$B,B9)","v":1},{"$f":"SUMIFS(Data!$E:$E,Data!$C:$C,A9,Data!$B:$B,B9)","v":0},{"$f":"IF(AND(B9=\"Grand Aquarium\",WEEKDAY(A9)=3),40,IF(AND(B9=\"Grand Aquarium\",WEEKDAY(A9)=7),40,VLOOKUP(B9,Price!$A$6:$C$216,2,0)))","v":40},{"$f":"IF(AND(B9=\"Grand Aquarium\",WEEKDAY(A9)=3),20,IF(AND(B9=\"Grand Aquarium\",WEEKDAY(A9)=7),20,VLOOKUP(B9,Price!$A$6:$C$216,3,0)))","v":20},{"$f":"IF(SUMIFS(Data!$J:$J,Data!$C:$C,A9,Data!$B:$B,B9)>H9,SUMIFS(Data!$J:$J,Data!$C:$C,A9,Data!$B:$B,B9)-H9,\"\")","v":0},180,{"$f":"SUMPRODUCT((Data!$C:$C=A9)*(Data!$B:$B=B9),(Data!$I:$I))","v":0},{"$f":"IF(SUMIFS(Data!$J:$J,Data!$C:$C,A9,Data!$B:$B,B9)<H9,H9-SUMIFS(Data!$J:$J,Data!$C:$C,A9,Data!$B:$B,B9),\"\")","v":0}]
["2018-08-02",{"$f":"IFERROR(INDEX(INDIRECT(\"Data!B\"&MATCH(A10,Data!$C$2:$C$100000,0)+1&\":B100000\"),SMALL(IF((A10=INDIRECT(\"Data!C\"&MATCH(A10,Data!$C$2:$C$100000,0)+1&\":C100000\"))*(MATCH(INDIRECT(\"Data!B\"&MATCH(A10,Data!$C$2:$C$100000,0)+1&\":B100000\")&\"\",INDIRECT(\"Data!B\"&MATCH(A10,Data!$C$2:$C$100000,0)+1&\":B100000\")&\"\",0)=(ROW(INDIRECT(\"Data!B\"&MATCH(A10,Data!$C$2:$C$100000,0)+1&\":B100000\"))-MATCH(A10,Data!$C$2:$C$100000,0))),ROW(INDIRECT(\"Data!B\"&MATCH(A10,Data!$C$2:$C$100000,0)+1&\":B100000\"))-MATCH(A10,Data!$C$2:$C$100000,0),\"\"),COUNTIF($A$5:A10,A10))),\"\")","v":"Utopia"},{"$f":"SUMIFS(Data!$D:$D,Data!$C:$C,A10,Data!$B:$B,B10)","v":38},{"$f":"SUMIFS(Data!$E:$E,Data!$C:$C,A10,Data!$B:$B,B10)","v":9},{"$f":"IF(AND(B10=\"Grand Aquarium\",WEEKDAY(A10)=3),40,IF(AND(B10=\"Grand Aquarium\",WEEKDAY(A10)=7),40,VLOOKUP(B10,Price!$A$6:$C$216,2,0)))","v":55},{"$f":"IF(AND(B10=\"Grand Aquarium\",WEEKDAY(A10)=3),20,IF(AND(B10=\"Grand Aquarium\",WEEKDAY(A10)=7),20,VLOOKUP(B10,Price!$A$6:$C$216,3,0)))","v":28},{"$f":"IF(SUMIFS(Data!$J:$J,Data!$C:$C,A10,Data!$B:$B,B10)>H10,SUMIFS(Data!$J:$J,Data!$C:$C,A10,Data!$B:$B,B10)-H10,\"\")","v":0},180,{"$f":"SUMPRODUCT((Data!$C:$C=A10)*(Data!$B:$B=B10),(Data!$I:$I))","v":0},{"$f":"IF(SUMIFS(Data!$J:$J,Data!$C:$C,A10,Data!$B:$B,B10)<H10,H10-SUMIFS(Data!$J:$J,Data!$C:$C,A10,Data!$B:$B,B10),\"\")","v":0}]
["2018-08-02",{"$f":"IFERROR(INDEX(INDIRECT(\"Data!B\"&MATCH(A11,Data!$C$2:$C$100000,0)+1&\":B100000\"),SMALL(IF((A11=INDIRECT(\"Data!C\"&MATCH(A11,Data!$C$2:$C$100000,0)+1&\":C100000\"))*(MATCH(INDIRECT(\"Data!B\"&MATCH(A11,Data!$C$2:$C$100000,0)+1&\":B100000\")&\"\",INDIRECT(\"Data!B\"&MATCH(A11,Data!$C$2:$C$100000,0)+1&\":B100000\")&\"\",0)=(ROW(INDIRECT(\"Data!B\"&MATCH(A11,Data!$C$2:$C$100000,0)+1&\":B100000\"))-MATCH(A11,Data!$C$2:$C$100000,0))),ROW(INDIRECT(\"Data!B\"&MATCH(A11,Data!$C$2:$C$100000,0)+1&\":B100000\"))-MATCH(A11,Data!$C$2:$C$100000,0),\"\"),COUNTIF($A$5:A11,A11))),\"\")","v":"Sea Trip"},{"$f":"SUMIFS(Data!$D:$D,Data!$C:$C,A11,Data!$B:$B,B11)","v":2},{"$f":"SUMIFS(Data!$E:$E,Data!$C:$C,A11,Data!$B:$B,B11)","v":0},{"$f":"IF(AND(B11=\"Grand Aquarium\",WEEKDAY(A11)=3),40,IF(AND(B11=\"Grand Aquarium\",WEEKDAY(A11)=7),40,VLOOKUP(B11,Price!$A$6:$C$216,2,0)))","v":40},{"$f":"IF(AND(B11=\"Grand Aquarium\",WEEKDAY(A11)=3),20,IF(AND(B11=\"Grand Aquarium\",WEEKDAY(A11)=7),20,VLOOKUP(B11,Price!$A$6:$C$216,3,0)))","v":20},{"$f":"IF(SUMIFS(Data!$J:$J,Data!$C:$C,A11,Data!$B:$B,B11)>H11,SUMIFS(Data!$J:$J,Data!$C:$C,A11,Data!$B:$B,B11)-H11,\"\")","v":0},180,{"$f":"SUMPRODUCT((Data!$C:$C=A11)*(Data!$B:$B=B11),(Data!$I:$I))","v":0},{"$f":"IF(SUMIFS(Data!$J:$J,Data!$C:$C,A11,Data!$B:$B,B11)<H11,H11-SUMIFS(Data!$J:$J,Data!$C:$C,A11,Data!$B:$B,B11),\"\")","v":0}]
[null,{"$f":"IFERROR(INDEX(INDIRECT(\"Data!B\"&MATCH(A12,Data!$C$2:$C$100000,0)+1&\":B100000\"),SMALL(IF((A12=INDIRECT(\"Data!C\"&MATCH(A12,Data!$C$2:$C$100000,0)+1&\":C100000\"))*(MATCH(INDIRECT(\"Data!B\"&MATCH(A12,Data!$C$2:$C$100000,0)+1&\":B100000\")&\"\",INDIRECT(\"Data!B\"&MATCH(A12,Data!$C$2:$C$100000,0)+1&\":B100000\")&\"\",0)=(ROW(INDIRECT(\"Data!B\"&MATCH(A12,Data!$C$2:$C$100000,0)+1&\":B100000\"))-MATCH(A12,Data!$C$2:$C$100000,0))),ROW(INDIRECT(\"Data!B\"&MATCH(A12,Data!$C$2:$C$100000,0)+1&\":B100000\"))-MATCH(A12,Data!$C$2:$C$100000,0),\"\"),COUNTIF($A$5:A12,A12))),\"\")","v":""},{"$f":"SUMIFS(Data!$D:$D,Data!$C:$C,A12,Data!$B:$B,B12)","v":0},{"$f":"SUMIFS(Data!$E:$E,Data!$C:$C,A12,Data!$B:$B,B12)","v":0},null,null,{"$f":"IF(SUMIFS(Data!$J:$J,Data!$C:$C,A12,Data!$B:$B,B12)>H12,SUMIFS(Data!$J:$J,Data!$C:$C,A12,Data!$B:$B,B12)-H12,\"\")","v":0},180,{"$f":"SUMPRODUCT((Data!$C:$C=A12)*(Data!$B:$B=B12),(Data!$I:$I))","v":0},{"$f":"IF(SUMIFS(Data!$J:$J,Data!$C:$C,A12,Data!$B:$B,B12)<H12,H12-SUMIFS(Data!$J:$J,Data!$C:$C,A12,Data!$B:$B,B12),\"\")","v":0},{"$f":"SUM(H9:H11)","v":2462}]
["2018-08-03",{"$f":"IFERROR(INDEX(INDIRECT(\"Data!B\"&MATCH(A13,Data!$C$2:$C$100000,0)+1&\":B100000\"),SMALL(IF((A13=INDIRECT(\"Data!C\"&MATCH(A13,Data!$C$2:$C$100000,0)+1&\":C100000\"))*(MATCH(INDIRECT(\"Data!B\"&MATCH(A13,Data!$C$2:$C$100000,0)+1&\":B100000\")&\"\",INDIRECT(\"Data!B\"&MATCH(A13,Data!$C$2:$C$100000,0)+1&\":B100000\")&\"\",0)=(ROW(INDIRECT(\"Data!B\"&MATCH(A13,Data!$C$2:$C$100000,0)+1&\":B100000\"))-MATCH(A13,Data!$C$2:$C$100000,0))),ROW(INDIRECT(\"Data!B\"&MATCH(A13,Data!$C$2:$C$100000,0)+1&\":B100000\"))-MATCH(A13,Data!$C$2:$C$100000,0),\"\"),COUNTIF($A$5:A13,A13))),\"\")","v":"Moto 2"},{"$f":"SUMIFS(Data!$D:$D,Data!$C:$C,A13,Data!$B:$B,B13)","v":6},{"$f":"SUMIFS(Data!$E:$E,Data!$C:$C,A13,Data!$B:$B,B13)","v":3},{"$f":"IF(AND(B13=\"Grand Aquarium\",WEEKDAY(A13)=3),40,IF(AND(B13=\"Grand Aquarium\",WEEKDAY(A13)=7),40,VLOOKUP(B13,Price!$A$6:$C$216,2,0)))","v":45},{"$f":"IF(AND(B13=\"Grand Aquarium\",WEEKDAY(A13)=3),20,IF(AND(B13=\"Grand Aquarium\",WEEKDAY(A13)=7),20,VLOOKUP(B13,Price!$A$6:$C$216,3,0)))","v":23},{"$f":"IF(SUMIFS(Data!$J:$J,Data!$C:$C,A13,Data!$B:$B,B13)>H13,SUMIFS(Data!$J:$J,Data!$C:$C,A13,Data!$B:$B,B13)-H13,\"\")","v":0},180,{"$f":"SUMPRODUCT((Data!$C:$C=A13)*(Data!$B:$B=B13),(Data!$I:$I))","v":0},{"$f":"IF(SUMIFS(Data!$J:$J,Data!$C:$C,A13,Data!$B:$B,B13)<H13,H13-SUMIFS(Data!$J:$J,Data!$C:$C,A13,Data!$B:$B,B13),\"\")","v":0}]
[null,{"$f":"IFERROR(INDEX(INDIRECT(\"Data!B\"&MATCH(A14,Data!$C$2:$C$100000,0)+1&\":B100000\"),SMALL(IF((A14=INDIRECT(\"Data!C\"&MATCH(A14,Data!$C$2:$C$100000,0)+1&\":C100000\"))*(MATCH(INDIRECT(\"Data!B\"&MATCH(A14,Data!$C$2:$C$100000,0)+1&\":B100000\")&\"\",INDIRECT(\"Data!B\"&MATCH(A14,Data!$C$2:$C$100000,0)+1&\":B100000\")&\"\",0)=(ROW(INDIRECT(\"Data!B\"&MATCH(A14,Data!$C$2:$C$100000,0)+1&\":B100000\"))-MATCH(A14,Data!$C$2:$C$100000,0))),ROW(INDIRECT(\"Data!B\"&MATCH(A14,Data!$C$2:$C$100000,0)+1&\":B100000\"))-MATCH(A14,Data!$C$2:$C$100000,0),\"\"),COUNTIF($A$5:A14,A14))),\"\")","v":""},{"$f":"SUMIFS(Data!$D:$D,Data!$C:$C,A14,Data!$B:$B,B14)","v":0},{"$f":"SUMIFS(Data!$E:$E,Data!$C:$C,A14,Data!$B:$B,B14)","v":0},null,null,{"$f":"IF(SUMIFS(Data!$J:$J,Data!$C:$C,A14,Data!$B:$B,B14)>H14,SUMIFS(Data!$J:$J,Data!$C:$C,A14,Data!$B:$B,B14)-H14,\"\")","v":0},180,{"$f":"SUMPRODUCT((Data!$C:$C=A14)*(Data!$B:$B=B14),(Data!$I:$I))","v":0},{"$f":"IF(SUMIFS(Data!$J:$J,Data!$C:$C,A14,Data!$B:$B,B14)<H14,H14-SUMIFS(Data!$J:$J,Data!$C:$C,A14,Data!$B:$B,B14),\"\")","v":0},{"$f":"SUM(H13:H13)","v":339}]
["2018-08-04",{"$f":"IFERROR(INDEX(INDIRECT(\"Data!B\"&MATCH(A15,Data!$C$2:$C$100000,0)+1&\":B100000\"),SMALL(IF((A15=INDIRECT(\"Data!C\"&MATCH(A15,Data!$C$2:$C$100000,0)+1&\":C100000\"))*(MATCH(INDIRECT(\"Data!B\"&MATCH(A15,Data!$C$2:$C$100000,0)+1&\":B100000\")&\"\",INDIRECT(\"Data!B\"&MATCH(A15,Data!$C$2:$C$100000,0)+1&\":B100000\")&\"\",0)=(ROW(INDIRECT(\"Data!B\"&MATCH(A15,Data!$C$2:$C$100000,0)+1&\":B100000\"))-MATCH(A15,Data!$C$2:$C$100000,0))),ROW(INDIRECT(\"Data!B\"&MATCH(A15,Data!$C$2:$C$100000,0)+1&\":B100000\"))-MATCH(A15,Data!$C$2:$C$100000,0),\"\"),COUNTIF($A$5:A15,A15))),\"\")","v":"Moto 2"},{"$f":"SUMIFS(Data!$D:$D,Data!$C:$C,A15,Data!$B:$B,B15)","v":13},{"$f":"SUMIFS(Data!$E:$E,Data!$C:$C,A15,Data!$B:$B,B15)","v":0},{"$f":"IF(AND(B15=\"Grand Aquarium\",WEEKDAY(A15)=3),40,IF(AND(B15=\"Grand Aquarium\",WEEKDAY(A15)=7),40,VLOOKUP(B15,Price!$A$6:$C$216,2,0)))","v":45},{"$f":"IF(AND(B15=\"Grand Aquarium\",WEEKDAY(A15)=3),20,IF(AND(B15=\"Grand Aquarium\",WEEKDAY(A15)=7),20,VLOOKUP(B15,Price!$A$6:$C$216,3,0)))","v":23},{"$f":"IF(SUMIFS(Data!$J:$J,Data!$C:$C,A15,Data!$B:$B,B15)>H15,SUMIFS(Data!$J:$J,Data!$C:$C,A15,Data!$B:$B,B15)-H15,\"\")","v":0},180,{"$f":"SUMPRODUCT((Data!$C:$C=A15)*(Data!$B:$B=B15),(Data!$I:$I))","v":25},{"$f":"IF(SUMIFS(Data!$J:$J,Data!$C:$C,A15,Data!$B:$B,B15)<H15,H15-SUMIFS(Data!$J:$J,Data!$C:$C,A15,Data!$B:$B,B15),\"\")","v":0}]
["2018-08-04",{"$f":"IFERROR(INDEX(INDIRECT(\"Data!B\"&MATCH(A16,Data!$C$2:$C$100000,0)+1&\":B100000\"),SMALL(IF((A16=INDIRECT(\"Data!C\"&MATCH(A16,Data!$C$2:$C$100000,0)+1&\":C100000\"))*(MATCH(INDIRECT(\"Data!B\"&MATCH(A16,Data!$C$2:$C$100000,0)+1&\":B100000\")&\"\",INDIRECT(\"Data!B\"&MATCH(A16,Data!$C$2:$C$100000,0)+1&\":B100000\")&\"\",0)=(ROW(INDIRECT(\"Data!B\"&MATCH(A16,Data!$C$2:$C$100000,0)+1&\":B100000\"))-MATCH(A16,Data!$C$2:$C$100000,0))),ROW(INDIRECT(\"Data!B\"&MATCH(A16,Data!$C$2:$C$100000,0)+1&\":B100000\"))-MATCH(A16,Data!$C$2:$C$100000,0),\"\"),COUNTIF($A$5:A16,A16))),\"\")","v":"Grand Aquarium"},{"$f":"SUMIFS(Data!$D:$D,Data!$C:$C,A16,Data!$B:$B,B16)","v":16},{"$f":"SUMIFS(Data!$E:$E,Data!$C:$C,A16,Data!$B:$B,B16)","v":5},{"$f":"IF(AND(B16=\"Grand Aquarium\",WEEKDAY(A16)=3),40,IF(AND(B16=\"Grand Aquarium\",WEEKDAY(A16)=7),40,VLOOKUP(B16,Price!$A$6:$C$216,2,0)))","v":40},{"$f":"IF(AND(B16=\"Grand Aquarium\",WEEKDAY(A16)=3),20,IF(AND(B16=\"Grand Aquarium\",WEEKDAY(A16)=7),20,VLOOKUP(B16,Price!$A$6:$C$216,3,0)))","v":20},{"$f":"IF(SUMIFS(Data!$J:$J,Data!$C:$C,A16,Data!$B:$B,B16)>H16,SUMIFS(Data!$J:$J,Data!$C:$C,A16,Data!$B:$B,B16)-H16,\"\")","v":0},180,{"$f":"SUMPRODUCT((Data!$C:$C=A16)*(Data!$B:$B=B16),(Data!$I:$I))","v":13},{"$f":"IF(SUMIFS(Data!$J:$J,Data!$C:$C,A16,Data!$B:$B,B16)<H16,H16-SUMIFS(Data!$J:$J,Data!$C:$C,A16,Data!$B:$B,B16),\"\")","v":0}]
["2018-08-04",{"$f":"IFERROR(INDEX(INDIRECT(\"Data!B\"&MATCH(A17,Data!$C$2:$C$100000,0)+1&\":B100000\"),SMALL(IF((A17=INDIRECT(\"Data!C\"&MATCH(A17,Data!$C$2:$C$100000,0)+1&\":C100000\"))*(MATCH(INDIRECT(\"Data!B\"&MATCH(A17,Data!$C$2:$C$100000,0)+1&\":B100000\")&\"\",INDIRECT(\"Data!B\"&MATCH(A17,Data!$C$2:$C$100000,0)+1&\":B100000\")&\"\",0)=(ROW(INDIRECT(\"Data!B\"&MATCH(A17,Data!$C$2:$C$100000,0)+1&\":B100000\"))-MATCH(A17,Data!$C$2:$C$100000,0))),ROW(INDIRECT(\"Data!B\"&MATCH(A17,Data!$C$2:$C$100000,0)+1&\":B100000\"))-MATCH(A17,Data!$C$2:$C$100000,0),\"\"),COUNTIF($A$5:A17,A17))),\"\")","v":"Moto 1 Hour"},{"$f":"SUMIFS(Data!$D:$D,Data!$C:$C,A17,Data!$B:$B,B17)","v":1},{"$f":"SUMIFS(Data!$E:$E,Data!$C:$C,A17,Data!$B:$B,B17)","v":0},{"$f":"IF(AND(B17=\"Grand Aquarium\",WEEKDAY(A17)=3),40,IF(AND(B17=\"Grand Aquarium\",WEEKDAY(A17)=7),40,VLOOKUP(B17,Price!$A$6:$C$216,2,0)))","v":40},{"$f":"IF(AND(B17=\"Grand Aquarium\",WEEKDAY(A17)=3),20,IF(AND(B17=\"Grand Aquarium\",WEEKDAY(A17)=7),20,VLOOKUP(B17,Price!$A$6:$C$216,3,0)))","v":20},{"$f":"IF(SUMIFS(Data!$J:$J,Data!$C:$C,A17,Data!$B:$B,B17)>H17,SUMIFS(Data!$J:$J,Data!$C:$C,A17,Data!$B:$B,B17)-H17,\"\")","v":0},180,{"$f":"SUMPRODUCT((Data!$C:$C=A17)*(Data!$B:$B=B17),(Data!$I:$I))","v":0},{"$f":"IF(SUMIFS(Data!$J:$J,Data!$C:$C,A17,Data!$B:$B,B17)<H17,H17-SUMIFS(Data!$J:$J,Data!$C:$C,A17,Data!$B:$B,B17),\"\")","v":0}]
[null,{"$f":"IFERROR(INDEX(INDIRECT(\"Data!B\"&MATCH(A18,Data!$C$2:$C$100000,0)+1&\":B100000\"),SMALL(IF((A18=INDIRECT(\"Data!C\"&MATCH(A18,Data!$C$2:$C$100000,0)+1&\":C100000\"))*(MATCH(INDIRECT(\"Data!B\"&MATCH(A18,Data!$C$2:$C$100000,0)+1&\":B100000\")&\"\",INDIRECT(\"Data!B\"&MATCH(A18,Data!$C$2:$C$100000,0)+1&\":B100000\")&\"\",0)=(ROW(INDIRECT(\"Data!B\"&MATCH(A18,Data!$C$2:$C$100000,0)+1&\":B100000\"))-MATCH(A18,Data!$C$2:$C$100000,0))),ROW(INDIRECT(\"Data!B\"&MATCH(A18,Data!$C$2:$C$100000,0)+1&\":B100000\"))-MATCH(A18,Data!$C$2:$C$100000,0),\"\"),COUNTIF($A$5:A18,A18))),\"\")","v":""},{"$f":"SUMIFS(Data!$D:$D,Data!$C:$C,A18,Data!$B:$B,B18)","v":0},{"$f":"SUMIFS(Data!$E:$E,Data!$C:$C,A18,Data!$B:$B,B18)","v":0},null,null,{"$f":"IF(SUMIFS(Data!$J:$J,Data!$C:$C,A18,Data!$B:$B,B18)>H18,SUMIFS(Data!$J:$J,Data!$C:$C,A18,Data!$B:$B,B18)-H18,\"\")","v":0},180,{"$f":"SUMPRODUCT((Data!$C:$C=A18)*(Data!$B:$B=B18),(Data!$I:$I))","v":0},{"$f":"IF(SUMIFS(Data!$J:$J,Data!$C:$C,A18,Data!$B:$B,B18)<H18,H18-SUMIFS(Data!$J:$J,Data!$C:$C,A18,Data!$B:$B,B18),\"\")","v":0},{"$f":"SUM(H15:H17)","v":1365}]
["2018-08-05",{"$f":"IFERROR(INDEX(INDIRECT(\"Data!B\"&MATCH(A19,Data!$C$2:$C$100000,0)+1&\":B100000\"),SMALL(IF((A19=INDIRECT(\"Data!C\"&MATCH(A19,Data!$C$2:$C$100000,0)+1&\":C100000\"))*(MATCH(INDIRECT(\"Data!B\"&MATCH(A19,Data!$C$2:$C$100000,0)+1&\":B100000\")&\"\",INDIRECT(\"Data!B\"&MATCH(A19,Data!$C$2:$C$100000,0)+1&\":B100000\")&\"\",0)=(ROW(INDIRECT(\"Data!B\"&MATCH(A19,Data!$C$2:$C$100000,0)+1&\":B100000\"))-MATCH(A19,Data!$C$2:$C$100000,0))),ROW(INDIRECT(\"Data!B\"&MATCH(A19,Data!$C$2:$C$100000,0)+1&\":B100000\"))-MATCH(A19,Data!$C$2:$C$100000,0),\"\"),COUNTIF($A$5:A19,A19))),\"\")","v":"Utopia"},{"$f":"SUMIFS(Data!$D:$D,Data!$C:$C,A19,Data!$B:$B,B19)","v":47},{"$f":"SUMIFS(Data!$E:$E,Data!$C:$C,A19,Data!$B:$B,B19)","v":12},{"$f":"IF(AND(B19=\"Grand Aquarium\",WEEKDAY(A19)=3),40,IF(AND(B19=\"Grand Aquarium\",WEEKDAY(A19)=7),40,VLOOKUP(B19,Price!$A$6:$C$216,2,0)))","v":55},{"$f":"IF(AND(B19=\"Grand Aquarium\",WEEKDAY(A19)=3),20,IF(AND(B19=\"Grand Aquarium\",WEEKDAY(A19)=7),20,VLOOKUP(B19,Price!$A$6:$C$216,3,0)))","v":28},{"$f":"IF(SUMIFS(Data!$J:$J,Data!$C:$C,A19,Data!$B:$B,B19)>H19,SUMIFS(Data!$J:$J,Data!$C:$C,A19,Data!$B:$B,B19)-H19,\"\")","v":0},180,{"$f":"SUMPRODUCT((Data!$C:$C=A19)*(Data!$B:$B=B19),(Data!$I:$I))","v":0},{"$f":"IF(SUMIFS(Data!$J:$J,Data!$C:$C,A19,Data!$B:$B,B19)<H19,H19-SUMIFS(Data!$J:$J,Data!$C:$C,A19,Data!$B:$B,B19),\"\")","v":0}]
["2018-08-05",{"$f":"IFERROR(INDEX(INDIRECT(\"Data!B\"&MATCH(A20,Data!$C$2:$C$100000,0)+1&\":B100000\"),SMALL(IF((A20=INDIRECT(\"Data!C\"&MATCH(A20,Data!$C$2:$C$100000,0)+1&\":C100000\"))*(MATCH(INDIRECT(\"Data!B\"&MATCH(A20,Data!$C$2:$C$100000,0)+1&\":B100000\")&\"\",INDIRECT(\"Data!B\"&MATCH(A20,Data!$C$2:$C$100000,0)+1&\":B100000\")&\"\",0)=(ROW(INDIRECT(\"Data!B\"&MATCH(A20,Data!$C$2:$C$100000,0)+1&\":B100000\"))-MATCH(A20,Data!$C$2:$C$100000,0))),ROW(INDIRECT(\"Data!B\"&MATCH(A20,Data!$C$2:$C$100000,0)+1&\":B100000\"))-MATCH(A20,Data!$C$2:$C$100000,0),\"\"),COUNTIF($A$5:A20,A20))),\"\")","v":"Dolphin world show"},{"$f":"SUMIFS(Data!$D:$D,Data!$C:$C,A20,Data!$B:$B,B20)","v":2},{"$f":"SUMIFS(Data!$E:$E,Data!$C:$C,A20,Data!$B:$B,B20)","v":0},{"$f":"IF(AND(B20=\"Grand Aquarium\",WEEKDAY(A20)=3),40,IF(AND(B20=\"Grand Aquarium\",WEEKDAY(A20)=7),40,VLOOKUP(B20,Price!$A$6:$C$216,2,0)))","v":40},{"$f":"IF(AND(B20=\"Grand Aquarium\",WEEKDAY(A20)=3),20,IF(AND(B20=\"Grand Aquarium\",WEEKDAY(A20)=7),20,VLOOKUP(B20,Price!$A$6:$C$216,3,0)))","v":20},{"$f":"IF(SUMIFS(Data!$J:$J,Data!$C:$C,A20,Data!$B:$B,B20)>H20,SUMIFS(Data!$J:$J,Data!$C:$C,A20,Data!$B:$B,B20)-H20,\"\")","v":0},180,{"$f":"SUMPRODUCT((Data!$C:$C=A20)*(Data!$B:$B=B20),(Data!$I:$I))","v":0},{"$f":"IF(SUMIFS(Data!$J:$J,Data!$C:$C,A20,Data!$B:$B,B20)<H20,H20-SUMIFS(Data!$J:$J,Data!$C:$C,A20,Data!$B:$B,B20),\"\")","v":0}]
[null,{"$f":"IFERROR(INDEX(INDIRECT(\"Data!B\"&MATCH(A21,Data!$C$2:$C$100000,0)+1&\":B100000\"),SMALL(IF((A21=INDIRECT(\"Data!C\"&MATCH(A21,Data!$C$2:$C$100000,0)+1&\":C100000\"))*(MATCH(INDIRECT(\"Data!B\"&MATCH(A21,Data!$C$2:$C$100000,0)+1&\":B100000\")&\"\",INDIRECT(\"Data!B\"&MATCH(A21,Data!$C$2:$C$100000,0)+1&\":B100000\")&\"\",0)=(ROW(INDIRECT(\"Data!B\"&MATCH(A21,Data!$C$2:$C$100000,0)+1&\":B100000\"))-MATCH(A21,Data!$C$2:$C$100000,0))),ROW(INDIRECT(\"Data!B\"&MATCH(A21,Data!$C$2:$C$100000,0)+1&\":B100000\"))-MATCH(A21,Data!$C$2:$C$100000,0),\"\"),COUNTIF($A$5:A21,A21))),\"\")","v":""},{"$f":"SUMIFS(Data!$D:$D,Data!$C:$C,A21,Data!$B:$B,B21)","v":0},{"$f":"SUMIFS(Data!$E:$E,Data!$C:$C,A21,Data!$B:$B,B21)","v":0},null,null,{"$f":"IF(SUMIFS(Data!$J:$J,Data!$C:$C,A21,Data!$B:$B,B21)>H21,SUMIFS(Data!$J:$J,Data!$C:$C,A21,Data!$B:$B,B21)-H21,\"\")","v":0},180,{"$f":"SUMPRODUCT((Data!$C:$C=A21)*(Data!$B:$B=B21),(Data!$I:$I))","v":0},{"$f":"IF(SUMIFS(Data!$J:$J,Data!$C:$C,A21,Data!$B:$B,B21)<H21,H21-SUMIFS(Data!$J:$J,Data!$C:$C,A21,Data!$B:$B,B21),\"\")","v":0},{"$f":"SUM(H19:H20)","v":3001}]
["2018-08-06",{"$f":"IFERROR(INDEX(INDIRECT(\"Data!B\"&MATCH(A22,Data!$C$2:$C$100000,0)+1&\":B100000\"),SMALL(IF((A22=INDIRECT(\"Data!C\"&MATCH(A22,Data!$C$2:$C$100000,0)+1&\":C100000\"))*(MATCH(INDIRECT(\"Data!B\"&MATCH(A22,Data!$C$2:$C$100000,0)+1&\":B100000\")&\"\",INDIRECT(\"Data!B\"&MATCH(A22,Data!$C$2:$C$100000,0)+1&\":B100000\")&\"\",0)=(ROW(INDIRECT(\"Data!B\"&MATCH(A22,Data!$C$2:$C$100000,0)+1&\":B100000\"))-MATCH(A22,Data!$C$2:$C$100000,0))),ROW(INDIRECT(\"Data!B\"&MATCH(A22,Data!$C$2:$C$100000,0)+1&\":B100000\"))-MATCH(A22,Data!$C$2:$C$100000,0),\"\"),COUNTIF($A$5:A22,A22))),\"\")","v":"Rusalka (Mermaid)"},{"$f":"SUMIFS(Data!$D:$D,Data!$C:$C,A22,Data!$B:$B,B22)","v":4},{"$f":"SUMIFS(Data!$E:$E,Data!$C:$C,A22,Data!$B:$B,B22)","v":0},{"$f":"IF(AND(B22=\"Grand Aquarium\",WEEKDAY(A22)=3),40,IF(AND(B22=\"Grand Aquarium\",WEEKDAY(A22)=7),40,VLOOKUP(B22,Price!$A$6:$C$216,2,0)))","v":40},{"$f":"IF(AND(B22=\"Grand Aquarium\",WEEKDAY(A22)=3),20,IF(AND(B22=\"Grand Aquarium\",WEEKDAY(A22)=7),20,VLOOKUP(B22,Price!$A$6:$C$216,3,0)))","v":20},{"$f":"IF(SUMIFS(Data!$J:$J,Data!$C:$C,A22,Data!$B:$B,B22)>H22,SUMIFS(Data!$J:$J,Data!$C:$C,A22,Data!$B:$B,B22)-H22,\"\")","v":0},180,{"$f":"SUMPRODUCT((Data!$C:$C=A22)*(Data!$B:$B=B22),(Data!$I:$I))","v":0},{"$f":"IF(SUMIFS(Data!$J:$J,Data!$C:$C,A22,Data!$B:$B,B22)<H22,H22-SUMIFS(Data!$J:$J,Data!$C:$C,A22,Data!$B:$B,B22),\"\")","v":0}]
["2018-08-06",{"$f":"IFERROR(INDEX(INDIRECT(\"Data!B\"&MATCH(A23,Data!$C$2:$C$100000,0)+1&\":B100000\"),SMALL(IF((A23=INDIRECT(\"Data!C\"&MATCH(A23,Data!$C$2:$C$100000,0)+1&\":C100000\"))*(MATCH(INDIRECT(\"Data!B\"&MATCH(A23,Data!$C$2:$C$100000,0)+1&\":B100000\")&\"\",INDIRECT(\"Data!B\"&MATCH(A23,Data!$C$2:$C$100000,0)+1&\":B100000\")&\"\",0)=(ROW(INDIRECT(\"Data!B\"&MATCH(A23,Data!$C$2:$C$100000,0)+1&\":B100000\"))-MATCH(A23,Data!$C$2:$C$100000,0))),ROW(INDIRECT(\"Data!B\"&MATCH(A23,Data!$C$2:$C$100000,0)+1&\":B100000\"))-MATCH(A23,Data!$C$2:$C$100000,0),\"\"),COUNTIF($A$5:A23,A23))),\"\")","v":"Moto 2"},{"$f":"SUMIFS(Data!$D:$D,Data!$C:$C,A23,Data!$B:$B,B23)","v":2},{"$f":"SUMIFS(Data!$E:$E,Data!$C:$C,A23,Data!$B:$B,B23)","v":0},{"$f":"IF(AND(B23=\"Grand Aquarium\",WEEKDAY(A23)=3),40,IF(AND(B23=\"Grand Aquarium\",WEEKDAY(A23)=7),40,VLOOKUP(B23,Price!$A$6:$C$216,2,0)))","v":45},{"$f":"IF(AND(B23=\"Grand Aquarium\",WEEKDAY(A23)=3),20,IF(AND(B23=\"Grand Aquarium\",WEEKDAY(A23)=7),20,VLOOKUP(B23,Price!$A$6:$C$216,3,0)))","v":23},{"$f":"IF(SUMIFS(Data!$J:$J,Data!$C:$C,A23,Data!$B:$B,B23)>H23,SUMIFS(Data!$J:$J,Data!$C:$C,A23,Data!$B:$B,B23)-H23,\"\")","v":0},180,{"$f":"SUMPRODUCT((Data!$C:$C=A23)*(Data!$B:$B=B23),(Data!$I:$I))","v":0},{"$f":"IF(SUMIFS(Data!$J:$J,Data!$C:$C,A23,Data!$B:$B,B23)<H23,H23-SUMIFS(Data!$J:$J,Data!$C:$C,A23,Data!$B:$B,B23),\"\")","v":0}]
[null,{"$f":"IFERROR(INDEX(INDIRECT(\"Data!B\"&MATCH(A24,Data!$C$2:$C$100000,0)+1&\":B100000\"),SMALL(IF((A24=INDIRECT(\"Data!C\"&MATCH(A24,Data!$C$2:$C$100000,0)+1&\":C100000\"))*(MATCH(INDIRECT(\"Data!B\"&MATCH(A24,Data!$C$2:$C$100000,0)+1&\":B100000\")&\"\",INDIRECT(\"Data!B\"&MATCH(A24,Data!$C$2:$C$100000,0)+1&\":B100000\")&\"\",0)=(ROW(INDIRECT(\"Data!B\"&MATCH(A24,Data!$C$2:$C$100000,0)+1&\":B100000\"))-MATCH(A24,Data!$C$2:$C$100000,0))),ROW(INDIRECT(\"Data!B\"&MATCH(A24,Data!$C$2:$C$100000,0)+1&\":B100000\"))-MATCH(A24,Data!$C$2:$C$100000,0),\"\"),COUNTIF($A$5:A24,A24))),\"\")","v":""},{"$f":"SUMIFS(Data!$D:$D,Data!$C:$C,A24,Data!$B:$B,B24)","v":0},{"$f":"SUMIFS(Data!$E:$E,Data!$C:$C,A24,Data!$B:$B,B24)","v":0},null,null,{"$f":"IF(SUMIFS(Data!$J:$J,Data!$C:$C,A24,Data!$B:$B,B24)>H24,SUMIFS(Data!$J:$J,Data!$C:$C,A24,Data!$B:$B,B24)-H24,\"\")","v":0},180,{"$f":"SUMPRODUCT((Data!$C:$C=A24)*(Data!$B:$B=B24),(Data!$I:$I))","v":0},{"$f":"IF(SUMIFS(Data!$J:$J,Data!$C:$C,A24,Data!$B:$B,B24)<H24,H24-SUMIFS(Data!$J:$J,Data!$C:$C,A24,Data!$B:$B,B24),\"\")","v":0},{"$f":"SUM(H22:H23)","v":250}]
["2018-08-07",{"$f":"IFERROR(INDEX(INDIRECT(\"Data!B\"&MATCH(A25,Data!$C$2:$C$100000,0)+1&\":B100000\"),SMALL(IF((A25=INDIRECT(\"Data!C\"&MATCH(A25,Data!$C$2:$C$100000,0)+1&\":C100000\"))*(MATCH(INDIRECT(\"Data!B\"&MATCH(A25,Data!$C$2:$C$100000,0)+1&\":B100000\")&\"\",INDIRECT(\"Data!B\"&MATCH(A25,Data!$C$2:$C$100000,0)+1&\":B100000\")&\"\",0)=(ROW(INDIRECT(\"Data!B\"&MATCH(A25,Data!$C$2:$C$100000,0)+1&\":B100000\"))-MATCH(A25,Data!$C$2:$C$100000,0))),ROW(INDIRECT(\"Data!B\"&MATCH(A25,Data!$C$2:$C$100000,0)+1&\":B100000\"))-MATCH(A25,Data!$C$2:$C$100000,0),\"\"),COUNTIF($A$5:A25,A25))),\"\")","v":"Utopia"},{"$f":"SUMIFS(Data!$D:$D,Data!$C:$C,A25,Data!$B:$B,B25)","v":26},{"$f":"SUMIFS(Data!$E:$E,Data!$C:$C,A25,Data!$B:$B,B25)","v":4},{"$f":"IF(AND(B25=\"Grand Aquarium\",WEEKDAY(A25)=3),40,IF(AND(B25=\"Grand Aquarium\",WEEKDAY(A25)=7),40,VLOOKUP(B25,Price!$A$6:$C$216,2,0)))","v":55},{"$f":"IF(AND(B25=\"Grand Aquarium\",WEEKDAY(A25)=3),20,IF(AND(B25=\"Grand Aquarium\",WEEKDAY(A25)=7),20,VLOOKUP(B25,Price!$A$6:$C$216,3,0)))","v":28},{"$f":"IF(SUMIFS(Data!$J:$J,Data!$C:$C,A25,Data!$B:$B,B25)>H25,SUMIFS(Data!$J:$J,Data!$C:$C,A25,Data!$B:$B,B25)-H25,\"\")","v":0},180,{"$f":"SUMPRODUCT((Data!$C:$C=A25)*(Data!$B:$B=B25),(Data!$I:$I))","v":0},{"$f":"IF(SUMIFS(Data!$J:$J,Data!$C:$C,A25,Data!$B:$B,B25)<H25,H25-SUMIFS(Data!$J:$J,Data!$C:$C,A25,Data!$B:$B,B25),\"\")","v":0}]
["2018-08-07",{"$f":"IFERROR(INDEX(INDIRECT(\"Data!B\"&MATCH(A26,Data!$C$2:$C$100000,0)+1&\":B100000\"),SMALL(IF((A26=INDIRECT(\"Data!C\"&MATCH(A26,Data!$C$2:$C$100000,0)+1&\":C100000\"))*(MATCH(INDIRECT(\"Data!B\"&MATCH(A26,Data!$C$2:$C$100000,0)+1&\":B100000\")&\"\",INDIRECT(\"Data!B\"&MATCH(A26,Data!$C$2:$C$100000,0)+1&\":B100000\")&\"\",0)=(ROW(INDIRECT(\"Data!B\"&MATCH(A26,Data!$C$2:$C$100000,0)+1&\":B100000\"))-MATCH(A26,Data!$C$2:$C$100000,0))),ROW(INDIRECT(\"Data!B\"&MATCH(A26,Data!$C$2:$C$100000,0)+1&\":B100000\"))-MATCH(A26,Data!$C$2:$C$100000,0),\"\"),COUNTIF($A$5:A26,A26))),\"\")","v":"LUXOR 2"},{"$f":"SUMIFS(Data!$D:$D,Data!$C:$C,A26,Data!$B:$B,B26)","v":11},{"$f":"SUMIFS(Data!$E:$E,Data!$C:$C,A26,Data!$B:$B,B26)","v":0},{"$f":"IF(AND(B26=\"Grand Aquarium\",WEEKDAY(A26)=3),40,IF(AND(B26=\"Grand Aquarium\",WEEKDAY(A26)=7),40,VLOOKUP(B26,Price!$A$6:$C$216,2,0)))","v":90},{"$f":"IF(AND(B26=\"Grand Aquarium\",WEEKDAY(A26)=3),20,IF(AND(B26=\"Grand Aquarium\",WEEKDAY(A26)=7),20,VLOOKUP(B26,Price!$A$6:$C$216,3,0)))","v":45},{"$f":"IF(SUMIFS(Data!$J:$J,Data!$C:$C,A26,Data!$B:$B,B26)>H26,SUMIFS(Data!$J:$J,Data!$C:$C,A26,Data!$B:$B,B26)-H26,\"\")","v":0},180,{"$f":"SUMPRODUCT((Data!$C:$C=A26)*(Data!$B:$B=B26),(Data!$I:$I))","v":0},{"$f":"IF(SUMIFS(Data!$J:$J,Data!$C:$C,A26,Data!$B:$B,B26)<H26,H26-SUMIFS(Data!$J:$J,Data!$C:$C,A26,Data!$B:$B,B26),\"\")","v":0}]
["2018-08-07",{"$f":"IFERROR(INDEX(INDIRECT(\"Data!B\"&MATCH(A27,Data!$C$2:$C$100000,0)+1&\":B100000\"),SMALL(IF((A27=INDIRECT(\"Data!C\"&MATCH(A27,Data!$C$2:$C$100000,0)+1&\":C100000\"))*(MATCH(INDIRECT(\"Data!B\"&MATCH(A27,Data!$C$2:$C$100000,0)+1&\":B100000\")&\"\",INDIRECT(\"Data!B\"&MATCH(A27,Data!$C$2:$C$100000,0)+1&\":B100000\")&\"\",0)=(ROW(INDIRECT(\"Data!B\"&MATCH(A27,Data!$C$2:$C$100000,0)+1&\":B100000\"))-MATCH(A27,Data!$C$2:$C$100000,0))),ROW(INDIRECT(\"Data!B\"&MATCH(A27,Data!$C$2:$C$100000,0)+1&\":B100000\"))-MATCH(A27,Data!$C$2:$C$100000,0),\"\"),COUNTIF($A$5:A27,A27))),\"\")","v":"Dolphin world show"},{"$f":"SUMIFS(Data!$D:$D,Data!$C:$C,A27,Data!$B:$B,B27)","v":2},{"$f":"SUMIFS(Data!$E:$E,Data!$C:$C,A27,Data!$B:$B,B27)","v":1},{"$f":"IF(AND(B27=\"Grand Aquarium\",WEEKDAY(A27)=3),40,IF(AND(B27=\"Grand Aquarium\",WEEKDAY(A27)=7),40,VLOOKUP(B27,Price!$A$6:$C$216,2,0)))","v":40},{"$f":"IF(AND(B27=\"Grand Aquarium\",WEEKDAY(A27)=3),20,IF(AND(B27=\"Grand Aquarium\",WEEKDAY(A27)=7),20,VLOOKUP(B27,Price!$A$6:$C$216,3,0)))","v":20},{"$f":"IF(SUMIFS(Data!$J:$J,Data!$C:$C,A27,Data!$B:$B,B27)>H27,SUMIFS(Data!$J:$J,Data!$C:$C,A27,Data!$B:$B,B27)-H27,\"\")","v":0},180,{"$f":"SUMPRODUCT((Data!$C:$C=A27)*(Data!$B:$B=B27),(Data!$I:$I))","v":0},{"$f":"IF(SUMIFS(Data!$J:$J,Data!$C:$C,A27,Data!$B:$B,B27)<H27,H27-SUMIFS(Data!$J:$J,Data!$C:$C,A27,Data!$B:$B,B27),\"\")","v":0}]
["2018-08-07",{"$f":"IFERROR(INDEX(INDIRECT(\"Data!B\"&MATCH(A28,Data!$C$2:$C$100000,0)+1&\":B100000\"),SMALL(IF((A28=INDIRECT(\"Data!C\"&MATCH(A28,Data!$C$2:$C$100000,0)+1&\":C100000\"))*(MATCH(INDIRECT(\"Data!B\"&MATCH(A28,Data!$C$2:$C$100000,0)+1&\":B100000\")&\"\",INDIRECT(\"Data!B\"&MATCH(A28,Data!$C$2:$C$100000,0)+1&\":B100000\")&\"\",0)=(ROW(INDIRECT(\"Data!B\"&MATCH(A28,Data!$C$2:$C$100000,0)+1&\":B100000\"))-MATCH(A28,Data!$C$2:$C$100000,0))),ROW(INDIRECT(\"Data!B\"&MATCH(A28,Data!$C$2:$C$100000,0)+1&\":B100000\"))-MATCH(A28,Data!$C$2:$C$100000,0),\"\"),COUNTIF($A$5:A28,A28))),\"\")","v":"Cairo"},{"$f":"SUMIFS(Data!$D:$D,Data!$C:$C,A28,Data!$B:$B,B28)","v":7},{"$f":"SUMIFS(Data!$E:$E,Data!$C:$C,A28,Data!$B:$B,B28)","v":2},{"$f":"IF(AND(B28=\"Grand Aquarium\",WEEKDAY(A28)=3),40,IF(AND(B28=\"Grand Aquarium\",WEEKDAY(A28)=7),40,VLOOKUP(B28,Price!$A$6:$C$216,2,0)))","v":110},{"$f":"IF(AND(B28=\"Grand Aquarium\",WEEKDAY(A28)=3),20,IF(AND(B28=\"Grand Aquarium\",WEEKDAY(A28)=7),20,VLOOKUP(B28,Price!$A$6:$C$216,3,0)))","v":55},{"$f":"IF(SUMIFS(Data!$J:$J,Data!$C:$C,A28,Data!$B:$B,B28)>H28,SUMIFS(Data!$J:$J,Data!$C:$C,A28,Data!$B:$B,B28)-H28,\"\")","v":0},180,{"$f":"SUMPRODUCT((Data!$C:$C=A28)*(Data!$B:$B=B28),(Data!$I:$I))","v":31},{"$f":"IF(SUMIFS(Data!$J:$J,Data!$C:$C,A28,Data!$B:$B,B28)<H28,H28-SUMIFS(Data!$J:$J,Data!$C:$C,A28,Data!$B:$B,B28),\"\")","v":0}]
["2018-08-07",{"$f":"IFERROR(INDEX(INDIRECT(\"Data!B\"&MATCH(A29,Data!$C$2:$C$100000,0)+1&\":B100000\"),SMALL(IF((A29=INDIRECT(\"Data!C\"&MATCH(A29,Data!$C$2:$C$100000,0)+1&\":C100000\"))*(MATCH(INDIRECT(\"Data!B\"&MATCH(A29,Data!$C$2:$C$100000,0)+1&\":B100000\")&\"\",INDIRECT(\"Data!B\"&MATCH(A29,Data!$C$2:$C$100000,0)+1&\":B100000\")&\"\",0)=(ROW(INDIRECT(\"Data!B\"&MATCH(A29,Data!$C$2:$C$100000,0)+1&\":B100000\"))-MATCH(A29,Data!$C$2:$C$100000,0))),ROW(INDIRECT(\"Data!B\"&MATCH(A29,Data!$C$2:$C$100000,0)+1&\":B100000\"))-MATCH(A29,Data!$C$2:$C$100000,0),\"\"),COUNTIF($A$5:A29,A29))),\"\")","v":"Rusalka (Mermaid)"},{"$f":"SUMIFS(Data!$D:$D,Data!$C:$C,A29,Data!$B:$B,B29)","v":4},{"$f":"SUMIFS(Data!$E:$E,Data!$C:$C,A29,Data!$B:$B,B29)","v":0},{"$f":"IF(AND(B29=\"Grand Aquarium\",WEEKDAY(A29)=3),40,IF(AND(B29=\"Grand Aquarium\",WEEKDAY(A29)=7),40,VLOOKUP(B29,Price!$A$6:$C$216,2,0)))","v":40},{"$f":"IF(AND(B29=\"Grand Aquarium\",WEEKDAY(A29)=3),20,IF(AND(B29=\"Grand Aquarium\",WEEKDAY(A29)=7),20,VLOOKUP(B29,Price!$A$6:$C$216,3,0)))","v":20},{"$f":"IF(SUMIFS(Data!$J:$J,Data!$C:$C,A29,Data!$B:$B,B29)>H29,SUMIFS(Data!$J:$J,Data!$C:$C,A29,Data!$B:$B,B29)-H29,\"\")","v":0},180,{"$f":"SUMPRODUCT((Data!$C:$C=A29)*(Data!$B:$B=B29),(Data!$I:$I))","v":0},{"$f":"IF(SUMIFS(Data!$J:$J,Data!$C:$C,A29,Data!$B:$B,B29)<H29,H29-SUMIFS(Data!$J:$J,Data!$C:$C,A29,Data!$B:$B,B29),\"\")","v":0}]
["2018-08-07",{"$f":"IFERROR(INDEX(INDIRECT(\"Data!B\"&MATCH(A30,Data!$C$2:$C$100000,0)+1&\":B100000\"),SMALL(IF((A30=INDIRECT(\"Data!C\"&MATCH(A30,Data!$C$2:$C$100000,0)+1&\":C100000\"))*(MATCH(INDIRECT(\"Data!B\"&MATCH(A30,Data!$C$2:$C$100000,0)+1&\":B100000\")&\"\",INDIRECT(\"Data!B\"&MATCH(A30,Data!$C$2:$C$100000,0)+1&\":B100000\")&\"\",0)=(ROW(INDIRECT(\"Data!B\"&MATCH(A30,Data!$C$2:$C$100000,0)+1&\":B100000\"))-MATCH(A30,Data!$C$2:$C$100000,0))),ROW(INDIRECT(\"Data!B\"&MATCH(A30,Data!$C$2:$C$100000,0)+1&\":B100000\"))-MATCH(A30,Data!$C$2:$C$100000,0),\"\"),COUNTIF($A$5:A30,A30))),\"\")","v":"Grand Aquarium"},{"$f":"SUMIFS(Data!$D:$D,Data!$C:$C,A30,Data!$B:$B,B30)","v":8},{"$f":"SUMIFS(Data!$E:$E,Data!$C:$C,A30,Data!$B:$B,B30)","v":1},{"$f":"IF(AND(B30=\"Grand Aquarium\",WEEKDAY(A30)=3),40,IF(AND(B30=\"Grand Aquarium\",WEEKDAY(A30)=7),40,VLOOKUP(B30,Price!$A$6:$C$216,2,0)))","v":40},{"$f":"IF(AND(B30=\"Grand Aquarium\",WEEKDAY(A30)=3),20,IF(AND(B30=\"Grand Aquarium\",WEEKDAY(A30)=7),20,VLOOKUP(B30,Price!$A$6:$C$216,3,0)))","v":20},{"$f":"IF(SUMIFS(Data!$J:$J,Data!$C:$C,A30,Data!$B:$B,B30)>H30,SUMIFS(Data!$J:$J,Data!$C:$C,A30,Data!$B:$B,B30)-H30,\"\")","v":0},180,{"$f":"SUMPRODUCT((Data!$C:$C=A30)*(Data!$B:$B=B30),(Data!$I:$I))","v":10},{"$f":"IF(SUMIFS(Data!$J:$J,Data!$C:$C,A30,Data!$B:$B,B30)<H30,H30-SUMIFS(Data!$J:$J,Data!$C:$C,A30,Data!$B:$B,B30),\"\")","v":0}]
[null,{"$f":"IFERROR(INDEX(INDIRECT(\"Data!B\"&MATCH(A31,Data!$C$2:$C$100000,0)+1&\":B100000\"),SMALL(IF((A31=INDIRECT(\"Data!C\"&MATCH(A31,Data!$C$2:$C$100000,0)+1&\":C100000\"))*(MATCH(INDIRECT(\"Data!B\"&MATCH(A31,Data!$C$2:$C$100000,0)+1&\":B100000\")&\"\",INDIRECT(\"Data!B\"&MATCH(A31,Data!$C$2:$C$100000,0)+1&\":B100000\")&\"\",0)=(ROW(INDIRECT(\"Data!B\"&MATCH(A31,Data!$C$2:$C$100000,0)+1&\":B100000\"))-MATCH(A31,Data!$C$2:$C$100000,0))),ROW(INDIRECT(\"Data!B\"&MATCH(A31,Data!$C$2:$C$100000,0)+1&\":B100000\"))-MATCH(A31,Data!$C$2:$C$100000,0),\"\"),COUNTIF($A$5:A31,A31))),\"\")","v":""},{"$f":"SUMIFS(Data!$D:$D,Data!$C:$C,A31,Data!$B:$B,B31)","v":0},{"$f":"SUMIFS(Data!$E:$E,Data!$C:$C,A31,Data!$B:$B,B31)","v":0},null,null,{"$f":"IF(SUMIFS(Data!$J:$J,Data!$C:$C,A31,Data!$B:$B,B31)>H31,SUMIFS(Data!$J:$J,Data!$C:$C,A31,Data!$B:$B,B31)-H31,\"\")","v":0},180,{"$f":"SUMPRODUCT((Data!$C:$C=A31)*(Data!$B:$B=B31),(Data!$I:$I))","v":0},{"$f":"IF(SUMIFS(Data!$J:$J,Data!$C:$C,A31,Data!$B:$B,B31)<H31,H31-SUMIFS(Data!$J:$J,Data!$C:$C,A31,Data!$B:$B,B31),\"\")","v":0},{"$f":"SUM(H25:H30)","v":4014}]
["2018-08-08",{"$f":"IFERROR(INDEX(INDIRECT(\"Data!B\"&MATCH(A32,Data!$C$2:$C$100000,0)+1&\":B100000\"),SMALL(IF((A32=INDIRECT(\"Data!C\"&MATCH(A32,Data!$C$2:$C$100000,0)+1&\":C100000\"))*(MATCH(INDIRECT(\"Data!B\"&MATCH(A32,Data!$C$2:$C$100000,0)+1&\":B100000\")&\"\",INDIRECT(\"Data!B\"&MATCH(A32,Data!$C$2:$C$100000,0)+1&\":B100000\")&\"\",0)=(ROW(INDIRECT(\"Data!B\"&MATCH(A32,Data!$C$2:$C$100000,0)+1&\":B100000\"))-MATCH(A32,Data!$C$2:$C$100000,0))),ROW(INDIRECT(\"Data!B\"&MATCH(A32,Data!$C$2:$C$100000,0)+1&\":B100000\"))-MATCH(A32,Data!$C$2:$C$100000,0),\"\"),COUNTIF($A$5:A32,A32))),\"\")","v":"Moto 2"},{"$f":"SUMIFS(Data!$D:$D,Data!$C:$C,A32,Data!$B:$B,B32)","v":13},{"$f":"SUMIFS(Data!$E:$E,Data!$C:$C,A32,Data!$B:$B,B32)","v":0},{"$f":"IF(AND(B32=\"Grand Aquarium\",WEEKDAY(A32)=3),40,IF(AND(B32=\"Grand Aquarium\",WEEKDAY(A32)=7),40,VLOOKUP(B32,Price!$A$6:$C$216,2,0)))","v":45},{"$f":"IF(AND(B32=\"Grand Aquarium\",WEEKDAY(A32)=3),20,IF(AND(B32=\"Grand Aquarium\",WEEKDAY(A32)=7),20,VLOOKUP(B32,Price!$A$6:$C$216,3,0)))","v":23},{"$f":"IF(SUMIFS(Data!$J:$J,Data!$C:$C,A32,Data!$B:$B,B32)>H32,SUMIFS(Data!$J:$J,Data!$C:$C,A32,Data!$B:$B,B32)-H32,\"\")","v":0},180,{"$f":"SUMPRODUCT((Data!$C:$C=A32)*(Data!$B:$B=B32),(Data!$I:$I))","v":40},{"$f":"IF(SUMIFS(Data!$J:$J,Data!$C:$C,A32,Data!$B:$B,B32)<H32,H32-SUMIFS(Data!$J:$J,Data!$C:$C,A32,Data!$B:$B,B32),\"\")","v":0}]
["2018-08-08",{"$f":"IFERROR(INDEX(INDIRECT(\"Data!B\"&MATCH(A33,Data!$C$2:$C$100000,0)+1&\":B100000\"),SMALL(IF((A33=INDIRECT(\"Data!C\"&MATCH(A33,Data!$C$2:$C$100000,0)+1&\":C100000\"))*(MATCH(INDIRECT(\"Data!B\"&MATCH(A33,Data!$C$2:$C$100000,0)+1&\":B100000\")&\"\",INDIRECT(\"Data!B\"&MATCH(A33,Data!$C$2:$C$100000,0)+1&\":B100000\")&\"\",0)=(ROW(INDIRECT(\"Data!B\"&MATCH(A33,Data!$C$2:$C$100000,0)+1&\":B100000\"))-MATCH(A33,Data!$C$2:$C$100000,0))),ROW(INDIRECT(\"Data!B\"&MATCH(A33,Data!$C$2:$C$100000,0)+1&\":B100000\"))-MATCH(A33,Data!$C$2:$C$100000,0),\"\"),COUNTIF($A$5:A33,A33))),\"\")","v":"Diving"},{"$f":"SUMIFS(Data!$D:$D,Data!$C:$C,A33,Data!$B:$B,B33)","v":4},{"$f":"SUMIFS(Data!$E:$E,Data!$C:$C,A33,Data!$B:$B,B33)","v":0},{"$f":"IF(AND(B33=\"Grand Aquarium\",WEEKDAY(A33)=3),40,IF(AND(B33=\"Grand Aquarium\",WEEKDAY(A33)=7),40,VLOOKUP(B33,Price!$A$6:$C$216,2,0)))","v":65},{"$f":"IF(AND(B33=\"Grand Aquarium\",WEEKDAY(A33)=3),20,IF(AND(B33=\"Grand Aquarium\",WEEKDAY(A33)=7),20,VLOOKUP(B33,Price!$A$6:$C$216,3,0)))","v":65},{"$f":"IF(SUMIFS(Data!$J:$J,Data!$C:$C,A33,Data!$B:$B,B33)>H33,SUMIFS(Data!$J:$J,Data!$C:$C,A33,Data!$B:$B,B33)-H33,\"\")","v":0},180,{"$f":"SUMPRODUCT((Data!$C:$C=A33)*(Data!$B:$B=B33),(Data!$I:$I))","v":10},{"$f":"IF(SUMIFS(Data!$J:$J,Data!$C:$C,A33,Data!$B:$B,B33)<H33,H33-SUMIFS(Data!$J:$J,Data!$C:$C,A33,Data!$B:$B,B33),\"\")","v":0}]
["2018-08-08",{"$f":"IFERROR(INDEX(INDIRECT(\"Data!B\"&MATCH(A34,Data!$C$2:$C$100000,0)+1&\":B100000\"),SMALL(IF((A34=INDIRECT(\"Data!C\"&MATCH(A34,Data!$C$2:$C$100000,0)+1&\":C100000\"))*(MATCH(INDIRECT(\"Data!B\"&MATCH(A34,Data!$C$2:$C$100000,0)+1&\":B100000\")&\"\",INDIRECT(\"Data!B\"&MATCH(A34,Data!$C$2:$C$100000,0)+1&\":B100000\")&\"\",0)=(ROW(INDIRECT(\"Data!B\"&MATCH(A34,Data!$C$2:$C$100000,0)+1&\":B100000\"))-MATCH(A34,Data!$C$2:$C$100000,0))),ROW(INDIRECT(\"Data!B\"&MATCH(A34,Data!$C$2:$C$100000,0)+1&\":B100000\"))-MATCH(A34,Data!$C$2:$C$100000,0),\"\"),COUNTIF($A$5:A34,A34))),\"\")","v":"Aspendos Turkish Bath"},{"$f":"SUMIFS(Data!$D:$D,Data!$C:$C,A34,Data!$B:$B,B34)","v":1},{"$f":"SUMIFS(Data!$E:$E,Data!$C:$C,A34,Data!$B:$B,B34)","v":0},{"$f":"IF(AND(B34=\"Grand Aquarium\",WEEKDAY(A34)=3),40,IF(AND(B34=\"Grand Aquarium\",WEEKDAY(A34)=7),40,VLOOKUP(B34,Price!$A$6:$C$216,2,0)))","v":35},{"$f":"IF(AND(B34=\"Grand Aquarium\",WEEKDAY(A34)=3),20,IF(AND(B34=\"Grand Aquarium\",WEEKDAY(A34)=7),20,VLOOKUP(B34,Price!$A$6:$C$216,3,0)))","v":35},{"$f":"IF(SUMIFS(Data!$J:$J,Data!$C:$C,A34,Data!$B:$B,B34)>H34,SUMIFS(Data!$J:$J,Data!$C:$C,A34,Data!$B:$B,B34)-H34,\"\")","v":0},180,{"$f":"SUMPRODUCT((Data!$C:$C=A34)*(Data!$B:$B=B34),(Data!$I:$I))","v":5},{"$f":"IF(SUMIFS(Data!$J:$J,Data!$C:$C,A34,Data!$B:$B,B34)<H34,H34-SUMIFS(Data!$J:$J,Data!$C:$C,A34,Data!$B:$B,B34),\"\")","v":0}]
[null,{"$f":"IFERROR(INDEX(INDIRECT(\"Data!B\"&MATCH(A35,Data!$C$2:$C$100000,0)+1&\":B100000\"),SMALL(IF((A35=INDIRECT(\"Data!C\"&MATCH(A35,Data!$C$2:$C$100000,0)+1&\":C100000\"))*(MATCH(INDIRECT(\"Data!B\"&MATCH(A35,Data!$C$2:$C$100000,0)+1&\":B100000\")&\"\",INDIRECT(\"Data!B\"&MATCH(A35,Data!$C$2:$C$100000,0)+1&\":B100000\")&\"\",0)=(ROW(INDIRECT(\"Data!B\"&MATCH(A35,Data!$C$2:$C$100000,0)+1&\":B100000\"))-MATCH(A35,Data!$C$2:$C$100000,0))),ROW(INDIRECT(\"Data!B\"&MATCH(A35,Data!$C$2:$C$100000,0)+1&\":B100000\"))-MATCH(A35,Data!$C$2:$C$100000,0),\"\"),COUNTIF($A$5:A35,A35))),\"\")","v":""},{"$f":"SUMIFS(Data!$D:$D,Data!$C:$C,A35,Data!$B:$B,B35)","v":0},{"$f":"SUMIFS(Data!$E:$E,Data!$C:$C,A35,Data!$B:$B,B35)","v":0},null,null,{"$f":"IF(SUMIFS(Data!$J:$J,Data!$C:$C,A35,Data!$B:$B,B35)>H35,SUMIFS(Data!$J:$J,Data!$C:$C,A35,Data!$B:$B,B35)-H35,\"\")","v":0},180,{"$f":"SUMPRODUCT((Data!$C:$C=A35)*(Data!$B:$B=B35),(Data!$I:$I))","v":0},{"$f":"IF(SUMIFS(Data!$J:$J,Data!$C:$C,A35,Data!$B:$B,B35)<H35,H35-SUMIFS(Data!$J:$J,Data!$C:$C,A35,Data!$B:$B,B35),\"\")","v":0},{"$f":"SUM(H32:H34)","v":880}]
["2018-08-09",{"$f":"IFERROR(INDEX(INDIRECT(\"Data!B\"&MATCH(A36,Data!$C$2:$C$100000,0)+1&\":B100000\"),SMALL(IF((A36=INDIRECT(\"Data!C\"&MATCH(A36,Data!$C$2:$C$100000,0)+1&\":C100000\"))*(MATCH(INDIRECT(\"Data!B\"&MATCH(A36,Data!$C$2:$C$100000,0)+1&\":B100000\")&\"\",INDIRECT(\"Data!B\"&MATCH(A36,Data!$C$2:$C$100000,0)+1&\":B100000\")&\"\",0)=(ROW(INDIRECT(\"Data!B\"&MATCH(A36,Data!$C$2:$C$100000,0)+1&\":B100000\"))-MATCH(A36,Data!$C$2:$C$100000,0))),ROW(INDIRECT(\"Data!B\"&MATCH(A36,Data!$C$2:$C$100000,0)+1&\":B100000\"))-MATCH(A36,Data!$C$2:$C$100000,0),\"\"),COUNTIF($A$5:A36,A36))),\"\")","v":"Utopia"},{"$f":"SUMIFS(Data!$D:$D,Data!$C:$C,A36,Data!$B:$B,B36)","v":45},{"$f":"SUMIFS(Data!$E:$E,Data!$C:$C,A36,Data!$B:$B,B36)","v":2},{"$f":"IF(AND(B36=\"Grand Aquarium\",WEEKDAY(A36)=3),40,IF(AND(B36=\"Grand Aquarium\",WEEKDAY(A36)=7),40,VLOOKUP(B36,Price!$A$6:$C$216,2,0)))","v":55},{"$f":"IF(AND(B36=\"Grand Aquarium\",WEEKDAY(A36)=3),20,IF(AND(B36=\"Grand Aquarium\",WEEKDAY(A36)=7),20,VLOOKUP(B36,Price!$A$6:$C$216,3,0)))","v":28},{"$f":"IF(SUMIFS(Data!$J:$J,Data!$C:$C,A36,Data!$B:$B,B36)>H36,SUMIFS(Data!$J:$J,Data!$C:$C,A36,Data!$B:$B,B36)-H36,\"\")","v":0},180,{"$f":"SUMPRODUCT((Data!$C:$C=A36)*(Data!$B:$B=B36),(Data!$I:$I))","v":0},{"$f":"IF(SUMIFS(Data!$J:$J,Data!$C:$C,A36,Data!$B:$B,B36)<H36,H36-SUMIFS(Data!$J:$J,Data!$C:$C,A36,Data!$B:$B,B36),\"\")","v":0}]
[null,{"$f":"IFERROR(INDEX(INDIRECT(\"Data!B\"&MATCH(A37,Data!$C$2:$C$100000,0)+1&\":B100000\"),SMALL(IF((A37=INDIRECT(\"Data!C\"&MATCH(A37,Data!$C$2:$C$100000,0)+1&\":C100000\"))*(MATCH(INDIRECT(\"Data!B\"&MATCH(A37,Data!$C$2:$C$100000,0)+1&\":B100000\")&\"\",INDIRECT(\"Data!B\"&MATCH(A37,Data!$C$2:$C$100000,0)+1&\":B100000\")&\"\",0)=(ROW(INDIRECT(\"Data!B\"&MATCH(A37,Data!$C$2:$C$100000,0)+1&\":B100000\"))-MATCH(A37,Data!$C$2:$C$100000,0))),ROW(INDIRECT(\"Data!B\"&MATCH(A37,Data!$C$2:$C$100000,0)+1&\":B100000\"))-MATCH(A37,Data!$C$2:$C$100000,0),\"\"),COUNTIF($A$5:A37,A37))),\"\")","v":""},{"$f":"SUMIFS(Data!$D:$D,Data!$C:$C,A37,Data!$B:$B,B37)","v":0},{"$f":"SUMIFS(Data!$E:$E,Data!$C:$C,A37,Data!$B:$B,B37)","v":0},null,null,{"$f":"IF(SUMIFS(Data!$J:$J,Data!$C:$C,A37,Data!$B:$B,B37)>H37,SUMIFS(Data!$J:$J,Data!$C:$C,A37,Data!$B:$B,B37)-H37,\"\")","v":0},180,{"$f":"SUMPRODUCT((Data!$C:$C=A37)*(Data!$B:$B=B37),(Data!$I:$I))","v":0},{"$f":"IF(SUMIFS(Data!$J:$J,Data!$C:$C,A37,Data!$B:$B,B37)<H37,H37-SUMIFS(Data!$J:$J,Data!$C:$C,A37,Data!$B:$B,B37),\"\")","v":0},{"$f":"SUM(H36:H36)","v":2531}]
["2018-08-10",{"$f":"IFERROR(INDEX(INDIRECT(\"Data!B\"&MATCH(A38,Data!$C$2:$C$100000,0)+1&\":B100000\"),SMALL(IF((A38=INDIRECT(\"Data!C\"&MATCH(A38,Data!$C$2:$C$100000,0)+1&\":C100000\"))*(MATCH(INDIRECT(\"Data!B\"&MATCH(A38,Data!$C$2:$C$100000,0)+1&\":B100000\")&\"\",INDIRECT(\"Data!B\"&MATCH(A38,Data!$C$2:$C$100000,0)+1&\":B100000\")&\"\",0)=(ROW(INDIRECT(\"Data!B\"&MATCH(A38,Data!$C$2:$C$100000,0)+1&\":B100000\"))-MATCH(A38,Data!$C$2:$C$100000,0))),ROW(INDIRECT(\"Data!B\"&MATCH(A38,Data!$C$2:$C$100000,0)+1&\":B100000\"))-MATCH(A38,Data!$C$2:$C$100000,0),\"\"),COUNTIF($A$5:A38,A38))),\"\")","v":"Moto 1 Hour"},{"$f":"SUMIFS(Data!$D:$D,Data!$C:$C,A38,Data!$B:$B,B38)","v":2},{"$f":"SUMIFS(Data!$E:$E,Data!$C:$C,A38,Data!$B:$B,B38)","v":0},{"$f":"IF(AND(B38=\"Grand Aquarium\",WEEKDAY(A38)=3),40,IF(AND(B38=\"Grand Aquarium\",WEEKDAY(A38)=7),40,VLOOKUP(B38,Price!$A$6:$C$216,2,0)))","v":40},{"$f":"IF(AND(B38=\"Grand Aquarium\",WEEKDAY(A38)=3),20,IF(AND(B38=\"Grand Aquarium\",WEEKDAY(A38)=7),20,VLOOKUP(B38,Price!$A$6:$C$216,3,0)))","v":20},{"$f":"IF(SUMIFS(Data!$J:$J,Data!$C:$C,A38,Data!$B:$B,B38)>H38,SUMIFS(Data!$J:$J,Data!$C:$C,A38,Data!$B:$B,B38)-H38,\"\")","v":0},180,{"$f":"SUMPRODUCT((Data!$C:$C=A38)*(Data!$B:$B=B38),(Data!$I:$I))","v":0},{"$f":"IF(SUMIFS(Data!$J:$J,Data!$C:$C,A38,Data!$B:$B,B38)<H38,H38-SUMIFS(Data!$J:$J,Data!$C:$C,A38,Data!$B:$B,B38),\"\")","v":0}]
["2018-08-10",{"$f":"IFERROR(INDEX(INDIRECT(\"Data!B\"&MATCH(A39,Data!$C$2:$C$100000,0)+1&\":B100000\"),SMALL(IF((A39=INDIRECT(\"Data!C\"&MATCH(A39,Data!$C$2:$C$100000,0)+1&\":C100000\"))*(MATCH(INDIRECT(\"Data!B\"&MATCH(A39,Data!$C$2:$C$100000,0)+1&\":B100000\")&\"\",INDIRECT(\"Data!B\"&MATCH(A39,Data!$C$2:$C$100000,0)+1&\":B100000\")&\"\",0)=(ROW(INDIRECT(\"Data!B\"&MATCH(A39,Data!$C$2:$C$100000,0)+1&\":B100000\"))-MATCH(A39,Data!$C$2:$C$100000,0))),ROW(INDIRECT(\"Data!B\"&MATCH(A39,Data!$C$2:$C$100000,0)+1&\":B100000\"))-MATCH(A39,Data!$C$2:$C$100000,0),\"\"),COUNTIF($A$5:A39,A39))),\"\")","v":"Moto 2"},{"$f":"SUMIFS(Data!$D:$D,Data!$C:$C,A39,Data!$B:$B,B39)","v":6},{"$f":"SUMIFS(Data!$E:$E,Data!$C:$C,A39,Data!$B:$B,B39)","v":0},{"$f":"IF(AND(B39=\"Grand Aquarium\",WEEKDAY(A39)=3),40,IF(AND(B39=\"Grand Aquarium\",WEEKDAY(A39)=7),40,VLOOKUP(B39,Price!$A$6:$C$216,2,0)))","v":45},{"$f":"IF(AND(B39=\"Grand Aquarium\",WEEKDAY(A39)=3),20,IF(AND(B39=\"Grand Aquarium\",WEEKDAY(A39)=7),20,VLOOKUP(B39,Price!$A$6:$C$216,3,0)))","v":23},{"$f":"IF(SUMIFS(Data!$J:$J,Data!$C:$C,A39,Data!$B:$B,B39)>H39,SUMIFS(Data!$J:$J,Data!$C:$C,A39,Data!$B:$B,B39)-H39,\"\")","v":0},180,{"$f":"SUMPRODUCT((Data!$C:$C=A39)*(Data!$B:$B=B39),(Data!$I:$I))","v":15},{"$f":"IF(SUMIFS(Data!$J:$J,Data!$C:$C,A39,Data!$B:$B,B39)<H39,H39-SUMIFS(Data!$J:$J,Data!$C:$C,A39,Data!$B:$B,B39),\"\")","v":0}]
[null,{"$f":"IFERROR(INDEX(INDIRECT(\"Data!B\"&MATCH(A40,Data!$C$2:$C$100000,0)+1&\":B100000\"),SMALL(IF((A40=INDIRECT(\"Data!C\"&MATCH(A40,Data!$C$2:$C$100000,0)+1&\":C100000\"))*(MATCH(INDIRECT(\"Data!B\"&MATCH(A40,Data!$C$2:$C$100000,0)+1&\":B100000\")&\"\",INDIRECT(\"Data!B\"&MATCH(A40,Data!$C$2:$C$100000,0)+1&\":B100000\")&\"\",0)=(ROW(INDIRECT(\"Data!B\"&MATCH(A40,Data!$C$2:$C$100000,0)+1&\":B100000\"))-MATCH(A40,Data!$C$2:$C$100000,0))),ROW(INDIRECT(\"Data!B\"&MATCH(A40,Data!$C$2:$C$100000,0)+1&\":B100000\"))-MATCH(A40,Data!$C$2:$C$100000,0),\"\"),COUNTIF($A$5:A40,A40))),\"\")","v":""},{"$f":"SUMIFS(Data!$D:$D,Data!$C:$C,A40,Data!$B:$B,B40)","v":0},{"$f":"SUMIFS(Data!$E:$E,Data!$C:$C,A40,Data!$B:$B,B40)","v":0},null,null,{"$f":"IF(SUMIFS(Data!$J:$J,Data!$C:$C,A40,Data!$B:$B,B40)>H40,SUMIFS(Data!$J:$J,Data!$C:$C,A40,Data!$B:$B,B40)-H40,\"\")","v":0},180,{"$f":"SUMPRODUCT((Data!$C:$C=A40)*(Data!$B:$B=B40),(Data!$I:$I))","v":0},{"$f":"IF(SUMIFS(Data!$J:$J,Data!$C:$C,A40,Data!$B:$B,B40)<H40,H40-SUMIFS(Data!$J:$J,Data!$C:$C,A40,Data!$B:$B,B40),\"\")","v":0},{"$f":"SUM(H38:H39)","v":360}]
["2018-08-11",{"$f":"IFERROR(INDEX(INDIRECT(\"Data!B\"&MATCH(A41,Data!$C$2:$C$100000,0)+1&\":B100000\"),SMALL(IF((A41=INDIRECT(\"Data!C\"&MATCH(A41,Data!$C$2:$C$100000,0)+1&\":C100000\"))*(MATCH(INDIRECT(\"Data!B\"&MATCH(A41,Data!$C$2:$C$100000,0)+1&\":B100000\")&\"\",INDIRECT(\"Data!B\"&MATCH(A41,Data!$C$2:$C$100000,0)+1&\":B100000\")&\"\",0)=(ROW(INDIRECT(\"Data!B\"&MATCH(A41,Data!$C$2:$C$100000,0)+1&\":B100000\"))-MATCH(A41,Data!$C$2:$C$100000,0))),ROW(INDIRECT(\"Data!B\"&MATCH(A41,Data!$C$2:$C$100000,0)+1&\":B100000\"))-MATCH(A41,Data!$C$2:$C$100000,0),\"\"),COUNTIF($A$5:A41,A41))),\"\")","v":"Grand Aquarium"},{"$f":"SUMIFS(Data!$D:$D,Data!$C:$C,A41,Data!$B:$B,B41)","v":4},{"$f":"SUMIFS(Data!$E:$E,Data!$C:$C,A41,Data!$B:$B,B41)","v":0},{"$f":"IF(AND(B41=\"Grand Aquarium\",WEEKDAY(A41)=3),40,IF(AND(B41=\"Grand Aquarium\",WEEKDAY(A41)=7),40,VLOOKUP(B41,Price!$A$6:$C$216,2,0)))","v":40},{"$f":"IF(AND(B41=\"Grand Aquarium\",WEEKDAY(A41)=3),20,IF(AND(B41=\"Grand Aquarium\",WEEKDAY(A41)=7),20,VLOOKUP(B41,Price!$A$6:$C$216,3,0)))","v":20},{"$f":"IF(SUMIFS(Data!$J:$J,Data!$C:$C,A41,Data!$B:$B,B41)>H41,SUMIFS(Data!$J:$J,Data!$C:$C,A41,Data!$B:$B,B41)-H41,\"\")","v":0},180,{"$f":"SUMPRODUCT((Data!$C:$C=A41)*(Data!$B:$B=B41),(Data!$I:$I))","v":0},{"$f":"IF(SUMIFS(Data!$J:$J,Data!$C:$C,A41,Data!$B:$B,B41)<H41,H41-SUMIFS(Data!$J:$J,Data!$C:$C,A41,Data!$B:$B,B41),\"\")","v":0}]
["2018-08-11",{"$f":"IFERROR(INDEX(INDIRECT(\"Data!B\"&MATCH(A42,Data!$C$2:$C$100000,0)+1&\":B100000\"),SMALL(IF((A42=INDIRECT(\"Data!C\"&MATCH(A42,Data!$C$2:$C$100000,0)+1&\":C100000\"))*(MATCH(INDIRECT(\"Data!B\"&MATCH(A42,Data!$C$2:$C$100000,0)+1&\":B100000\")&\"\",INDIRECT(\"Data!B\"&MATCH(A42,Data!$C$2:$C$100000,0)+1&\":B100000\")&\"\",0)=(ROW(INDIRECT(\"Data!B\"&MATCH(A42,Data!$C$2:$C$100000,0)+1&\":B100000\"))-MATCH(A42,Data!$C$2:$C$100000,0))),ROW(INDIRECT(\"Data!B\"&MATCH(A42,Data!$C$2:$C$100000,0)+1&\":B100000\"))-MATCH(A42,Data!$C$2:$C$100000,0),\"\"),COUNTIF($A$5:A42,A42))),\"\")","v":"Diving"},{"$f":"SUMIFS(Data!$D:$D,Data!$C:$C,A42,Data!$B:$B,B42)","v":2},{"$f":"SUMIFS(Data!$E:$E,Data!$C:$C,A42,Data!$B:$B,B42)","v":0},{"$f":"IF(AND(B42=\"Grand Aquarium\",WEEKDAY(A42)=3),40,IF(AND(B42=\"Grand Aquarium\",WEEKDAY(A42)=7),40,VLOOKUP(B42,Price!$A$6:$C$216,2,0)))","v":65},{"$f":"IF(AND(B42=\"Grand Aquarium\",WEEKDAY(A42)=3),20,IF(AND(B42=\"Grand Aquarium\",WEEKDAY(A42)=7),20,VLOOKUP(B42,Price!$A$6:$C$216,3,0)))","v":65},{"$f":"IF(SUMIFS(Data!$J:$J,Data!$C:$C,A42,Data!$B:$B,B42)>H42,SUMIFS(Data!$J:$J,Data!$C:$C,A42,Data!$B:$B,B42)-H42,\"\")","v":0},180,{"$f":"SUMPRODUCT((Data!$C:$C=A42)*(Data!$B:$B=B42),(Data!$I:$I))","v":0},{"$f":"IF(SUMIFS(Data!$J:$J,Data!$C:$C,A42,Data!$B:$B,B42)<H42,H42-SUMIFS(Data!$J:$J,Data!$C:$C,A42,Data!$B:$B,B42),\"\")","v":0}]
["2018-08-11",{"$f":"IFERROR(INDEX(INDIRECT(\"Data!B\"&MATCH(A43,Data!$C$2:$C$100000,0)+1&\":B100000\"),SMALL(IF((A43=INDIRECT(\"Data!C\"&MATCH(A43,Data!$C$2:$C$100000,0)+1&\":C100000\"))*(MATCH(INDIRECT(\"Data!B\"&MATCH(A43,Data!$C$2:$C$100000,0)+1&\":B100000\")&\"\",INDIRECT(\"Data!B\"&MATCH(A43,Data!$C$2:$C$100000,0)+1&\":B100000\")&\"\",0)=(ROW(INDIRECT(\"Data!B\"&MATCH(A43,Data!$C$2:$C$100000,0)+1&\":B100000\"))-MATCH(A43,Data!$C$2:$C$100000,0))),ROW(INDIRECT(\"Data!B\"&MATCH(A43,Data!$C$2:$C$100000,0)+1&\":B100000\"))-MATCH(A43,Data!$C$2:$C$100000,0),\"\"),COUNTIF($A$5:A43,A43))),\"\")","v":"LUXOR 2"},{"$f":"SUMIFS(Data!$D:$D,Data!$C:$C,A43,Data!$B:$B,B43)","v":19},{"$f":"SUMIFS(Data!$E:$E,Data!$C:$C,A43,Data!$B:$B,B43)","v":1},{"$f":"IF(AND(B43=\"Grand Aquarium\",WEEKDAY(A43)=3),40,IF(AND(B43=\"Grand Aquarium\",WEEKDAY(A43)=7),40,VLOOKUP(B43,Price!$A$6:$C$216,2,0)))","v":90},{"$f":"IF(AND(B43=\"Grand Aquarium\",WEEKDAY(A43)=3),20,IF(AND(B43=\"Grand Aquarium\",WEEKDAY(A43)=7),20,VLOOKUP(B43,Price!$A$6:$C$216,3,0)))","v":45},{"$f":"IF(SUMIFS(Data!$J:$J,Data!$C:$C,A43,Data!$B:$B,B43)>H43,SUMIFS(Data!$J:$J,Data!$C:$C,A43,Data!$B:$B,B43)-H43,\"\")","v":0},180,{"$f":"SUMPRODUCT((Data!$C:$C=A43)*(Data!$B:$B=B43),(Data!$I:$I))","v":0},{"$f":"IF(SUMIFS(Data!$J:$J,Data!$C:$C,A43,Data!$B:$B,B43)<H43,H43-SUMIFS(Data!$J:$J,Data!$C:$C,A43,Data!$B:$B,B43),\"\")","v":0}]
["2018-08-11",{"$f":"IFERROR(INDEX(INDIRECT(\"Data!B\"&MATCH(A44,Data!$C$2:$C$100000,0)+1&\":B100000\"),SMALL(IF((A44=INDIRECT(\"Data!C\"&MATCH(A44,Data!$C$2:$C$100000,0)+1&\":C100000\"))*(MATCH(INDIRECT(\"Data!B\"&MATCH(A44,Data!$C$2:$C$100000,0)+1&\":B100000\")&\"\",INDIRECT(\"Data!B\"&MATCH(A44,Data!$C$2:$C$100000,0)+1&\":B100000\")&\"\",0)=(ROW(INDIRECT(\"Data!B\"&MATCH(A44,Data!$C$2:$C$100000,0)+1&\":B100000\"))-MATCH(A44,Data!$C$2:$C$100000,0))),ROW(INDIRECT(\"Data!B\"&MATCH(A44,Data!$C$2:$C$100000,0)+1&\":B100000\"))-MATCH(A44,Data!$C$2:$C$100000,0),\"\"),COUNTIF($A$5:A44,A44))),\"\")","v":"Submarine"},{"$f":"SUMIFS(Data!$D:$D,Data!$C:$C,A44,Data!$B:$B,B44)","v":2},{"$f":"SUMIFS(Data!$E:$E,Data!$C:$C,A44,Data!$B:$B,B44)","v":0},{"$f":"IF(AND(B44=\"Grand Aquarium\",WEEKDAY(A44)=3),40,IF(AND(B44=\"Grand Aquarium\",WEEKDAY(A44)=7),40,VLOOKUP(B44,Price!$A$6:$C$216,2,0)))","v":58},{"$f":"IF(AND(B44=\"Grand Aquarium\",WEEKDAY(A44)=3),20,IF(AND(B44=\"Grand Aquarium\",WEEKDAY(A44)=7),20,VLOOKUP(B44,Price!$A$6:$C$216,3,0)))","v":29},{"$f":"IF(SUMIFS(Data!$J:$J,Data!$C:$C,A44,Data!$B:$B,B44)>H44,SUMIFS(Data!$J:$J,Data!$C:$C,A44,Data!$B:$B,B44)-H44,\"\")","v":0},180,{"$f":"SUMPRODUCT((Data!$C:$C=A44)*(Data!$B:$B=B44),(Data!$I:$I))","v":10},{"$f":"IF(SUMIFS(Data!$J:$J,Data!$C:$C,A44,Data!$B:$B,B44)<H44,H44-SUMIFS(Data!$J:$J,Data!$C:$C,A44,Data!$B:$B,B44),\"\")","v":0}]
["2018-08-11",{"$f":"IFERROR(INDEX(INDIRECT(\"Data!B\"&MATCH(A45,Data!$C$2:$C$100000,0)+1&\":B100000\"),SMALL(IF((A45=INDIRECT(\"Data!C\"&MATCH(A45,Data!$C$2:$C$100000,0)+1&\":C100000\"))*(MATCH(INDIRECT(\"Data!B\"&MATCH(A45,Data!$C$2:$C$100000,0)+1&\":B100000\")&\"\",INDIRECT(\"Data!B\"&MATCH(A45,Data!$C$2:$C$100000,0)+1&\":B100000\")&\"\",0)=(ROW(INDIRECT(\"Data!B\"&MATCH(A45,Data!$C$2:$C$100000,0)+1&\":B100000\"))-MATCH(A45,Data!$C$2:$C$100000,0))),ROW(INDIRECT(\"Data!B\"&MATCH(A45,Data!$C$2:$C$100000,0)+1&\":B100000\"))-MATCH(A45,Data!$C$2:$C$100000,0),\"\"),COUNTIF($A$5:A45,A45))),\"\")","v":"Dbl parasaling"},{"$f":"SUMIFS(Data!$D:$D,Data!$C:$C,A45,Data!$B:$B,B45)","v":2},{"$f":"SUMIFS(Data!$E:$E,Data!$C:$C,A45,Data!$B:$B,B45)","v":0},{"$f":"IF(AND(B45=\"Grand Aquarium\",WEEKDAY(A45)=3),40,IF(AND(B45=\"Grand Aquarium\",WEEKDAY(A45)=7),40,VLOOKUP(B45,Price!$A$6:$C$216,2,0)))","v":75},{"$f":"IF(AND(B45=\"Grand Aquarium\",WEEKDAY(A45)=3),20,IF(AND(B45=\"Grand Aquarium\",WEEKDAY(A45)=7),20,VLOOKUP(B45,Price!$A$6:$C$216,3,0)))","v":25},{"$f":"IF(SUMIFS(Data!$J:$J,Data!$C:$C,A45,Data!$B:$B,B45)>H45,SUMIFS(Data!$J:$J,Data!$C:$C,A45,Data!$B:$B,B45)-H45,\"\")","v":0},180,{"$f":"SUMPRODUCT((Data!$C:$C=A45)*(Data!$B:$B=B45),(Data!$I:$I))","v":0},{"$f":"IF(SUMIFS(Data!$J:$J,Data!$C:$C,A45,Data!$B:$B,B45)<H45,H45-SUMIFS(Data!$J:$J,Data!$C:$C,A45,Data!$B:$B,B45),\"\")","v":0}]
[null,{"$f":"IFERROR(INDEX(INDIRECT(\"Data!B\"&MATCH(A46,Data!$C$2:$C$100000,0)+1&\":B100000\"),SMALL(IF((A46=INDIRECT(\"Data!C\"&MATCH(A46,Data!$C$2:$C$100000,0)+1&\":C100000\"))*(MATCH(INDIRECT(\"Data!B\"&MATCH(A46,Data!$C$2:$C$100000,0)+1&\":B100000\")&\"\",INDIRECT(\"Data!B\"&MATCH(A46,Data!$C$2:$C$100000,0)+1&\":B100000\")&\"\",0)=(ROW(INDIRECT(\"Data!B\"&MATCH(A46,Data!$C$2:$C$100000,0)+1&\":B100000\"))-MATCH(A46,Data!$C$2:$C$100000,0))),ROW(INDIRECT(\"Data!B\"&MATCH(A46,Data!$C$2:$C$100000,0)+1&\":B100000\"))-MATCH(A46,Data!$C$2:$C$100000,0),\"\"),COUNTIF($A$5:A46,A46))),\"\")","v":""},{"$f":"SUMIFS(Data!$D:$D,Data!$C:$C,A46,Data!$B:$B,B46)","v":0},{"$f":"SUMIFS(Data!$E:$E,Data!$C:$C,A46,Data!$B:$B,B46)","v":0},null,null,{"$f":"IF(SUMIFS(Data!$J:$J,Data!$C:$C,A46,Data!$B:$B,B46)>H46,SUMIFS(Data!$J:$J,Data!$C:$C,A46,Data!$B:$B,B46)-H46,\"\")","v":0},180,{"$f":"SUMPRODUCT((Data!$C:$C=A46)*(Data!$B:$B=B46),(Data!$I:$I))","v":0},{"$f":"IF(SUMIFS(Data!$J:$J,Data!$C:$C,A46,Data!$B:$B,B46)<H46,H46-SUMIFS(Data!$J:$J,Data!$C:$C,A46,Data!$B:$B,B46),\"\")","v":0},{"$f":"SUM(H41:H45)","v":2311}]
["2018-08-12",{"$f":"IFERROR(INDEX(INDIRECT(\"Data!B\"&MATCH(A47,Data!$C$2:$C$100000,0)+1&\":B100000\"),SMALL(IF((A47=INDIRECT(\"Data!C\"&MATCH(A47,Data!$C$2:$C$100000,0)+1&\":C100000\"))*(MATCH(INDIRECT(\"Data!B\"&MATCH(A47,Data!$C$2:$C$100000,0)+1&\":B100000\")&\"\",INDIRECT(\"Data!B\"&MATCH(A47,Data!$C$2:$C$100000,0)+1&\":B100000\")&\"\",0)=(ROW(INDIRECT(\"Data!B\"&MATCH(A47,Data!$C$2:$C$100000,0)+1&\":B100000\"))-MATCH(A47,Data!$C$2:$C$100000,0))),ROW(INDIRECT(\"Data!B\"&MATCH(A47,Data!$C$2:$C$100000,0)+1&\":B100000\"))-MATCH(A47,Data!$C$2:$C$100000,0),\"\"),COUNTIF($A$5:A47,A47))),\"\")","v":"Utopia"},{"$f":"SUMIFS(Data!$D:$D,Data!$C:$C,A47,Data!$B:$B,B47)","v":45},{"$f":"SUMIFS(Data!$E:$E,Data!$C:$C,A47,Data!$B:$B,B47)","v":6},{"$f":"IF(AND(B47=\"Grand Aquarium\",WEEKDAY(A47)=3),40,IF(AND(B47=\"Grand Aquarium\",WEEKDAY(A47)=7),40,VLOOKUP(B47,Price!$A$6:$C$216,2,0)))","v":55},{"$f":"IF(AND(B47=\"Grand Aquarium\",WEEKDAY(A47)=3),20,IF(AND(B47=\"Grand Aquarium\",WEEKDAY(A47)=7),20,VLOOKUP(B47,Price!$A$6:$C$216,3,0)))","v":28},{"$f":"IF(SUMIFS(Data!$J:$J,Data!$C:$C,A47,Data!$B:$B,B47)>H47,SUMIFS(Data!$J:$J,Data!$C:$C,A47,Data!$B:$B,B47)-H47,\"\")","v":0},180,{"$f":"SUMPRODUCT((Data!$C:$C=A47)*(Data!$B:$B=B47),(Data!$I:$I))","v":0},{"$f":"IF(SUMIFS(Data!$J:$J,Data!$C:$C,A47,Data!$B:$B,B47)<H47,H47-SUMIFS(Data!$J:$J,Data!$C:$C,A47,Data!$B:$B,B47),\"\")","v":0}]
[null,{"$f":"IFERROR(INDEX(INDIRECT(\"Data!B\"&MATCH(A48,Data!$C$2:$C$100000,0)+1&\":B100000\"),SMALL(IF((A48=INDIRECT(\"Data!C\"&MATCH(A48,Data!$C$2:$C$100000,0)+1&\":C100000\"))*(MATCH(INDIRECT(\"Data!B\"&MATCH(A48,Data!$C$2:$C$100000,0)+1&\":B100000\")&\"\",INDIRECT(\"Data!B\"&MATCH(A48,Data!$C$2:$C$100000,0)+1&\":B100000\")&\"\",0)=(ROW(INDIRECT(\"Data!B\"&MATCH(A48,Data!$C$2:$C$100000,0)+1&\":B100000\"))-MATCH(A48,Data!$C$2:$C$100000,0))),ROW(INDIRECT(\"Data!B\"&MATCH(A48,Data!$C$2:$C$100000,0)+1&\":B100000\"))-MATCH(A48,Data!$C$2:$C$100000,0),\"\"),COUNTIF($A$5:A48,A48))),\"\")","v":""},{"$f":"SUMIFS(Data!$D:$D,Data!$C:$C,A48,Data!$B:$B,B48)","v":0},{"$f":"SUMIFS(Data!$E:$E,Data!$C:$C,A48,Data!$B:$B,B48)","v":0},null,null,{"$f":"IF(SUMIFS(Data!$J:$J,Data!$C:$C,A48,Data!$B:$B,B48)>H48,SUMIFS(Data!$J:$J,Data!$C:$C,A48,Data!$B:$B,B48)-H48,\"\")","v":0},180,{"$f":"SUMPRODUCT((Data!$C:$C=A48)*(Data!$B:$B=B48),(Data!$I:$I))","v":0},{"$f":"IF(SUMIFS(Data!$J:$J,Data!$C:$C,A48,Data!$B:$B,B48)<H48,H48-SUMIFS(Data!$J:$J,Data!$C:$C,A48,Data!$B:$B,B48),\"\")","v":0},{"$f":"SUM(H47:H47)","v":2643}]
["2018-08-13",{"$f":"IFERROR(INDEX(INDIRECT(\"Data!B\"&MATCH(A49,Data!$C$2:$C$100000,0)+1&\":B100000\"),SMALL(IF((A49=INDIRECT(\"Data!C\"&MATCH(A49,Data!$C$2:$C$100000,0)+1&\":C100000\"))*(MATCH(INDIRECT(\"Data!B\"&MATCH(A49,Data!$C$2:$C$100000,0)+1&\":B100000\")&\"\",INDIRECT(\"Data!B\"&MATCH(A49,Data!$C$2:$C$100000,0)+1&\":B100000\")&\"\",0)=(ROW(INDIRECT(\"Data!B\"&MATCH(A49,Data!$C$2:$C$100000,0)+1&\":B100000\"))-MATCH(A49,Data!$C$2:$C$100000,0))),ROW(INDIRECT(\"Data!B\"&MATCH(A49,Data!$C$2:$C$100000,0)+1&\":B100000\"))-MATCH(A49,Data!$C$2:$C$100000,0),\"\"),COUNTIF($A$5:A49,A49))),\"\")","v":"Sea Trip"},{"$f":"SUMIFS(Data!$D:$D,Data!$C:$C,A49,Data!$B:$B,B49)","v":5},{"$f":"SUMIFS(Data!$E:$E,Data!$C:$C,A49,Data!$B:$B,B49)","v":0},{"$f":"IF(AND(B49=\"Grand Aquarium\",WEEKDAY(A49)=3),40,IF(AND(B49=\"Grand Aquarium\",WEEKDAY(A49)=7),40,VLOOKUP(B49,Price!$A$6:$C$216,2,0)))","v":40},{"$f":"IF(AND(B49=\"Grand Aquarium\",WEEKDAY(A49)=3),20,IF(AND(B49=\"Grand Aquarium\",WEEKDAY(A49)=7),20,VLOOKUP(B49,Price!$A$6:$C$216,3,0)))","v":20},{"$f":"IF(SUMIFS(Data!$J:$J,Data!$C:$C,A49,Data!$B:$B,B49)>H49,SUMIFS(Data!$J:$J,Data!$C:$C,A49,Data!$B:$B,B49)-H49,\"\")","v":0},180,{"$f":"SUMPRODUCT((Data!$C:$C=A49)*(Data!$B:$B=B49),(Data!$I:$I))","v":0},{"$f":"IF(SUMIFS(Data!$J:$J,Data!$C:$C,A49,Data!$B:$B,B49)<H49,H49-SUMIFS(Data!$J:$J,Data!$C:$C,A49,Data!$B:$B,B49),\"\")","v":0}]
["2018-08-13",{"$f":"IFERROR(INDEX(INDIRECT(\"Data!B\"&MATCH(A50,Data!$C$2:$C$100000,0)+1&\":B100000\"),SMALL(IF((A50=INDIRECT(\"Data!C\"&MATCH(A50,Data!$C$2:$C$100000,0)+1&\":C100000\"))*(MATCH(INDIRECT(\"Data!B\"&MATCH(A50,Data!$C$2:$C$100000,0)+1&\":B100000\")&\"\",INDIRECT(\"Data!B\"&MATCH(A50,Data!$C$2:$C$100000,0)+1&\":B100000\")&\"\",0)=(ROW(INDIRECT(\"Data!B\"&MATCH(A50,Data!$C$2:$C$100000,0)+1&\":B100000\"))-MATCH(A50,Data!$C$2:$C$100000,0))),ROW(INDIRECT(\"Data!B\"&MATCH(A50,Data!$C$2:$C$100000,0)+1&\":B100000\"))-MATCH(A50,Data!$C$2:$C$100000,0),\"\"),COUNTIF($A$5:A50,A50))),\"\")","v":"Diving"},{"$f":"SUMIFS(Data!$D:$D,Data!$C:$C,A50,Data!$B:$B,B50)","v":1},{"$f":"SUMIFS(Data!$E:$E,Data!$C:$C,A50,Data!$B:$B,B50)","v":0},{"$f":"IF(AND(B50=\"Grand Aquarium\",WEEKDAY(A50)=3),40,IF(AND(B50=\"Grand Aquarium\",WEEKDAY(A50)=7),40,VLOOKUP(B50,Price!$A$6:$C$216,2,0)))","v":65},{"$f":"IF(AND(B50=\"Grand Aquarium\",WEEKDAY(A50)=3),20,IF(AND(B50=\"Grand Aquarium\",WEEKDAY(A50)=7),20,VLOOKUP(B50,Price!$A$6:$C$216,3,0)))","v":65},{"$f":"IF(SUMIFS(Data!$J:$J,Data!$C:$C,A50,Data!$B:$B,B50)>H50,SUMIFS(Data!$J:$J,Data!$C:$C,A50,Data!$B:$B,B50)-H50,\"\")","v":0},180,{"$f":"SUMPRODUCT((Data!$C:$C=A50)*(Data!$B:$B=B50),(Data!$I:$I))","v":5},{"$f":"IF(SUMIFS(Data!$J:$J,Data!$C:$C,A50,Data!$B:$B,B50)<H50,H50-SUMIFS(Data!$J:$J,Data!$C:$C,A50,Data!$B:$B,B50),\"\")","v":0}]
["2018-08-13",{"$f":"IFERROR(INDEX(INDIRECT(\"Data!B\"&MATCH(A51,Data!$C$2:$C$100000,0)+1&\":B100000\"),SMALL(IF((A51=INDIRECT(\"Data!C\"&MATCH(A51,Data!$C$2:$C$100000,0)+1&\":C100000\"))*(MATCH(INDIRECT(\"Data!B\"&MATCH(A51,Data!$C$2:$C$100000,0)+1&\":B100000\")&\"\",INDIRECT(\"Data!B\"&MATCH(A51,Data!$C$2:$C$100000,0)+1&\":B100000\")&\"\",0)=(ROW(INDIRECT(\"Data!B\"&MATCH(A51,Data!$C$2:$C$100000,0)+1&\":B100000\"))-MATCH(A51,Data!$C$2:$C$100000,0))),ROW(INDIRECT(\"Data!B\"&MATCH(A51,Data!$C$2:$C$100000,0)+1&\":B100000\"))-MATCH(A51,Data!$C$2:$C$100000,0),\"\"),COUNTIF($A$5:A51,A51))),\"\")","v":"Moto 2"},{"$f":"SUMIFS(Data!$D:$D,Data!$C:$C,A51,Data!$B:$B,B51)","v":6},{"$f":"SUMIFS(Data!$E:$E,Data!$C:$C,A51,Data!$B:$B,B51)","v":0},{"$f":"IF(AND(B51=\"Grand Aquarium\",WEEKDAY(A51)=3),40,IF(AND(B51=\"Grand Aquarium\",WEEKDAY(A51)=7),40,VLOOKUP(B51,Price!$A$6:$C$216,2,0)))","v":45},{"$f":"IF(AND(B51=\"Grand Aquarium\",WEEKDAY(A51)=3),20,IF(AND(B51=\"Grand Aquarium\",WEEKDAY(A51)=7),20,VLOOKUP(B51,Price!$A$6:$C$216,3,0)))","v":23},{"$f":"IF(SUMIFS(Data!$J:$J,Data!$C:$C,A51,Data!$B:$B,B51)>H51,SUMIFS(Data!$J:$J,Data!$C:$C,A51,Data!$B:$B,B51)-H51,\"\")","v":0},180,{"$f":"SUMPRODUCT((Data!$C:$C=A51)*(Data!$B:$B=B51),(Data!$I:$I))","v":0},{"$f":"IF(SUMIFS(Data!$J:$J,Data!$C:$C,A51,Data!$B:$B,B51)<H51,H51-SUMIFS(Data!$J:$J,Data!$C:$C,A51,Data!$B:$B,B51),\"\")","v":0}]
[null,{"$f":"IFERROR(INDEX(INDIRECT(\"Data!B\"&MATCH(A52,Data!$C$2:$C$100000,0)+1&\":B100000\"),SMALL(IF((A52=INDIRECT(\"Data!C\"&MATCH(A52,Data!$C$2:$C$100000,0)+1&\":C100000\"))*(MATCH(INDIRECT(\"Data!B\"&MATCH(A52,Data!$C$2:$C$100000,0)+1&\":B100000\")&\"\",INDIRECT(\"Data!B\"&MATCH(A52,Data!$C$2:$C$100000,0)+1&\":B100000\")&\"\",0)=(ROW(INDIRECT(\"Data!B\"&MATCH(A52,Data!$C$2:$C$100000,0)+1&\":B100000\"))-MATCH(A52,Data!$C$2:$C$100000,0))),ROW(INDIRECT(\"Data!B\"&MATCH(A52,Data!$C$2:$C$100000,0)+1&\":B100000\"))-MATCH(A52,Data!$C$2:$C$100000,0),\"\"),COUNTIF($A$5:A52,A52))),\"\")","v":""},{"$f":"SUMIFS(Data!$D:$D,Data!$C:$C,A52,Data!$B:$B,B52)","v":0},{"$f":"SUMIFS(Data!$E:$E,Data!$C:$C,A52,Data!$B:$B,B52)","v":0},null,null,{"$f":"IF(SUMIFS(Data!$J:$J,Data!$C:$C,A52,Data!$B:$B,B52)>H52,SUMIFS(Data!$J:$J,Data!$C:$C,A52,Data!$B:$B,B52)-H52,\"\")","v":0},180,{"$f":"SUMPRODUCT((Data!$C:$C=A52)*(Data!$B:$B=B52),(Data!$I:$I))","v":0},{"$f":"IF(SUMIFS(Data!$J:$J,Data!$C:$C,A52,Data!$B:$B,B52)<H52,H52-SUMIFS(Data!$J:$J,Data!$C:$C,A52,Data!$B:$B,B52),\"\")","v":0},{"$f":"SUM(H49:H51)","v":535}]
[null,{"$f":"IFERROR(INDEX(INDIRECT(\"Data!B\"&MATCH(A53,Data!$C$2:$C$100000,0)+1&\":B100000\"),SMALL(IF((A53=INDIRECT(\"Data!C\"&MATCH(A53,Data!$C$2:$C$100000,0)+1&\":C100000\"))*(MATCH(INDIRECT(\"Data!B\"&MATCH(A53,Data!$C$2:$C$100000,0)+1&\":B100000\")&\"\",INDIRECT(\"Data!B\"&MATCH(A53,Data!$C$2:$C$100000,0)+1&\":B100000\")&\"\",0)=(ROW(INDIRECT(\"Data!B\"&MATCH(A53,Data!$C$2:$C$100000,0)+1&\":B100000\"))-MATCH(A53,Data!$C$2:$C$100000,0))),ROW(INDIRECT(\"Data!B\"&MATCH(A53,Data!$C$2:$C$100000,0)+1&\":B100000\"))-MATCH(A53,Data!$C$2:$C$100000,0),\"\"),COUNTIF($A$5:A53,A53))),\"\")","v":""},{"$f":"SUMIFS(Data!$D:$D,Data!$C:$C,A53,Data!$B:$B,B53)","v":0},{"$f":"SUMIFS(Data!$E:$E,Data!$C:$C,A53,Data!$B:$B,B53)","v":0},{"$f":"IF(AND(B53=\"Grand Aquarium\",WEEKDAY(A53)=3),40,IF(AND(B53=\"Grand Aquarium\",WEEKDAY(A53)=7),40,VLOOKUP(B53,Price!$A$6:$C$216,2,0)))","v":{"$error":"#N/A"}},{"$f":"IF(AND(B53=\"Grand Aquarium\",WEEKDAY(A53)=3),20,IF(AND(B53=\"Grand Aquarium\",WEEKDAY(A53)=7),20,VLOOKUP(B53,Price!$A$6:$C$216,3,0)))","v":{"$error":"#N/A"}},{"$f":"IF(SUMIFS(Data!$J:$J,Data!$C:$C,A53,Data!$B:$B,B53)>H53,SUMIFS(Data!$J:$J,Data!$C:$C,A53,Data!$B:$B,B53)-H53,\"\")","v":0},180,{"$f":"SUMPRODUCT((Data!$C:$C=A53)*(Data!$B:$B=B53),(Data!$I:$I))","v":0},{"$f":"IF(SUMIFS(Data!$J:$J,Data!$C:$C,A53,Data!$B:$B,B53)<H53,H53-SUMIFS(Data!$J:$J,Data!$C:$C,A53,Data!$B:$B,B53),\"\")","v":0}]
[null,{"$f":"IFERROR(INDEX(INDIRECT(\"Data!B\"&MATCH(A54,Data!$C$2:$C$100000,0)+1&\":B100000\"),SMALL(IF((A54=INDIRECT(\"Data!C\"&MATCH(A54,Data!$C$2:$C$100000,0)+1&\":C100000\"))*(MATCH(INDIRECT(\"Data!B\"&MATCH(A54,Data!$C$2:$C$100000,0)+1&\":B100000\")&\"\",INDIRECT(\"Data!B\"&MATCH(A54,Data!$C$2:$C$100000,0)+1&\":B100000\")&\"\",0)=(ROW(INDIRECT(\"Data!B\"&MATCH(A54,Data!$C$2:$C$100000,0)+1&\":B100000\"))-MATCH(A54,Data!$C$2:$C$100000,0))),ROW(INDIRECT(\"Data!B\"&MATCH(A54,Data!$C$2:$C$100000,0)+1&\":B100000\"))-MATCH(A54,Data!$C$2:$C$100000,0),\"\"),COUNTIF($A$5:A54,A54))),\"\")","v":""},{"$f":"SUMIFS(Data!$D:$D,Data!$C:$C,A54,Data!$B:$B,B54)","v":0},{"$f":"SUMIFS(Data!$E:$E,Data!$C:$C,A54,Data!$B:$B,B54)","v":0},{"$f":"IF(AND(B54=\"Grand Aquarium\",WEEKDAY(A54)=3),40,IF(AND(B54=\"Grand Aquarium\",WEEKDAY(A54)=7),40,VLOOKUP(B54,Price!$A$6:$C$216,2,0)))","v":{"$error":"#N/A"}},{"$f":"IF(AND(B54=\"Grand Aquarium\",WEEKDAY(A54)=3),20,IF(AND(B54=\"Grand Aquarium\",WEEKDAY(A54)=7),20,VLOOKUP(B54,Price!$A$6:$C$216,3,0)))","v":{"$error":"#N/A"}},{"$f":"IF(SUMIFS(Data!$J:$J,Data!$C:$C,A54,Data!$B:$B,B54)>H54,SUMIFS(Data!$J:$J,Data!$C:$C,A54,Data!$B:$B,B54)-H54,\"\")","v":0},180,{"$f":"SUMPRODUCT((Data!$C:$C=A54)*(Data!$B:$B=B54),(Data!$I:$I))","v":0},{"$f":"IF(SUMIFS(Data!$J:$J,Data!$C:$C,A54,Data!$B:$B,B54)<H54,H54-SUMIFS(Data!$J:$J,Data!$C:$C,A54,Data!$B:$B,B54),\"\")","v":0}]
[null,{"$f":"IFERROR(INDEX(INDIRECT(\"Data!B\"&MATCH(A55,Data!$C$2:$C$100000,0)+1&\":B100000\"),SMALL(IF((A55=INDIRECT(\"Data!C\"&MATCH(A55,Data!$C$2:$C$100000,0)+1&\":C100000\"))*(MATCH(INDIRECT(\"Data!B\"&MATCH(A55,Data!$C$2:$C$100000,0)+1&\":B100000\")&\"\",INDIRECT(\"Data!B\"&MATCH(A55,Data!$C$2:$C$100000,0)+1&\":B100000\")&\"\",0)=(ROW(INDIRECT(\"Data!B\"&MATCH(A55,Data!$C$2:$C$100000,0)+1&\":B100000\"))-MATCH(A55,Data!$C$2:$C$100000,0))),ROW(INDIRECT(\"Data!B\"&MATCH(A55,Data!$C$2:$C$100000,0)+1&\":B100000\"))-MATCH(A55,Data!$C$2:$C$100000,0),\"\"),COUNTIF($A$5:A55,A55))),\"\")","v":""},{"$f":"SUMIFS(Data!$D:$D,Data!$C:$C,A55,Data!$B:$B,B55)","v":0},{"$f":"SUMIFS(Data!$E:$E,Data!$C:$C,A55,Data!$B:$B,B55)","v":0},{"$f":"IF(AND(B55=\"Grand Aquarium\",WEEKDAY(A55)=3),40,IF(AND(B55=\"Grand Aquarium\",WEEKDAY(A55)=7),40,VLOOKUP(B55,Price!$A$6:$C$216,2,0)))","v":{"$error":"#N/A"}},{"$f":"IF(AND(B55=\"Grand Aquarium\",WEEKDAY(A55)=3),20,IF(AND(B55=\"Grand Aquarium\",WEEKDAY(A55)=7),20,VLOOKUP(B55,Price!$A$6:$C$216,3,0)))","v":{"$error":"#N/A"}},{"$f":"IF(SUMIFS(Data!$J:$J,Data!$C:$C,A55,Data!$B:$B,B55)>H55,SUMIFS(Data!$J:$J,Data!$C:$C,A55,Data!$B:$B,B55)-H55,\"\")","v":0},180,{"$f":"SUMPRODUCT((Data!$C:$C=A55)*(Data!$B:$B=B55),(Data!$I:$I))","v":0},{"$f":"IF(SUMIFS(Data!$J:$J,Data!$C:$C,A55,Data!$B:$B,B55)<H55,H55-SUMIFS(Data!$J:$J,Data!$C:$C,A55,Data!$B:$B,B55),\"\")","v":0}]
[null,{"$f":"IFERROR(INDEX(INDIRECT(\"Data!B\"&MATCH(A56,Data!$C$2:$C$100000,0)+1&\":B100000\"),SMALL(IF((A56=INDIRECT(\"Data!C\"&MATCH(A56,Data!$C$2:$C$100000,0)+1&\":C100000\"))*(MATCH(INDIRECT(\"Data!B\"&MATCH(A56,Data!$C$2:$C$100000,0)+1&\":B100000\")&\"\",INDIRECT(\"Data!B\"&MATCH(A56,Data!$C$2:$C$100000,0)+1&\":B100000\")&\"\",0)=(ROW(INDIRECT(\"Data!B\"&MATCH(A56,Data!$C$2:$C$100000,0)+1&\":B100000\"))-MATCH(A56,Data!$C$2:$C$100000,0))),ROW(INDIRECT(\"Data!B\"&MATCH(A56,Data!$C$2:$C$100000,0)+1&\":B100000\"))-MATCH(A56,Data!$C$2:$C$100000,0),\"\"),COUNTIF($A$5:A56,A56))),\"\")","v":""},{"$f":"SUMIFS(Data!$D:$D,Data!$C:$C,A56,Data!$B:$B,B56)","v":0},{"$f":"SUMIFS(Data!$E:$E,Data!$C:$C,A56,Data!$B:$B,B56)","v":0},{"$f":"IF(AND(B56=\"Grand Aquarium\",WEEKDAY(A56)=3),40,IF(AND(B56=\"Grand Aquarium\",WEEKDAY(A56)=7),40,VLOOKUP(B56,Price!$A$6:$C$216,2,0)))","v":{"$error":"#N/A"}},{"$f":"IF(AND(B56=\"Grand Aquarium\",WEEKDAY(A56)=3),20,IF(AND(B56=\"Grand Aquarium\",WEEKDAY(A56)=7),20,VLOOKUP(B56,Price!$A$6:$C$216,3,0)))","v":{"$error":"#N/A"}},{"$f":"IF(SUMIFS(Data!$J:$J,Data!$C:$C,A56,Data!$B:$B,B56)>H56,SUMIFS(Data!$J:$J,Data!$C:$C,A56,Data!$B:$B,B56)-H56,\"\")","v":0},180,{"$f":"SUMPRODUCT((Data!$C:$C=A56)*(Data!$B:$B=B56),(Data!$I:$I))","v":0},{"$f":"IF(SUMIFS(Data!$J:$J,Data!$C:$C,A56,Data!$B:$B,B56)<H56,H56-SUMIFS(Data!$J:$J,Data!$C:$C,A56,Data!$B:$B,B56),\"\")","v":0}]
[null,{"$f":"IFERROR(INDEX(INDIRECT(\"Data!B\"&MATCH(A57,Data!$C$2:$C$100000,0)+1&\":B100000\"),SMALL(IF((A57=INDIRECT(\"Data!C\"&MATCH(A57,Data!$C$2:$C$100000,0)+1&\":C100000\"))*(MATCH(INDIRECT(\"Data!B\"&MATCH(A57,Data!$C$2:$C$100000,0)+1&\":B100000\")&\"\",INDIRECT(\"Data!B\"&MATCH(A57,Data!$C$2:$C$100000,0)+1&\":B100000\")&\"\",0)=(ROW(INDIRECT(\"Data!B\"&MATCH(A57,Data!$C$2:$C$100000,0)+1&\":B100000\"))-MATCH(A57,Data!$C$2:$C$100000,0))),ROW(INDIRECT(\"Data!B\"&MATCH(A57,Data!$C$2:$C$100000,0)+1&\":B100000\"))-MATCH(A57,Data!$C$2:$C$100000,0),\"\"),COUNTIF($A$5:A57,A57))),\"\")","v":""},{"$f":"SUMIFS(Data!$D:$D,Data!$C:$C,A57,Data!$B:$B,B57)","v":0},{"$f":"SUMIFS(Data!$E:$E,Data!$C:$C,A57,Data!$B:$B,B57)","v":0},{"$f":"IF(AND(B57=\"Grand Aquarium\",WEEKDAY(A57)=3),40,IF(AND(B57=\"Grand Aquarium\",WEEKDAY(A57)=7),40,VLOOKUP(B57,Price!$A$6:$C$216,2,0)))","v":{"$error":"#N/A"}},{"$f":"IF(AND(B57=\"Grand Aquarium\",WEEKDAY(A57)=3),20,IF(AND(B57=\"Grand Aquarium\",WEEKDAY(A57)=7),20,VLOOKUP(B57,Price!$A$6:$C$216,3,0)))","v":{"$error":"#N/A"}},{"$f":"IF(SUMIFS(Data!$J:$J,Data!$C:$C,A57,Data!$B:$B,B57)>H57,SUMIFS(Data!$J:$J,Data!$C:$C,A57,Data!$B:$B,B57)-H57,\"\")","v":0},180,{"$f":"SUMPRODUCT((Data!$C:$C=A57)*(Data!$B:$B=B57),(Data!$I:$I))","v":0},{"$f":"IF(SUMIFS(Data!$J:$J,Data!$C:$C,A57,Data!$B:$B,B57)<H57,H57-SUMIFS(Data!$J:$J,Data!$C:$C,A57,Data!$B:$B,B57),\"\")","v":0}]
[null,{"$f":"IFERROR(INDEX(INDIRECT(\"Data!B\"&MATCH(A58,Data!$C$2:$C$100000,0)+1&\":B100000\"),SMALL(IF((A58=INDIRECT(\"Data!C\"&MATCH(A58,Data!$C$2:$C$100000,0)+1&\":C100000\"))*(MATCH(INDIRECT(\"Data!B\"&MATCH(A58,Data!$C$2:$C$100000,0)+1&\":B100000\")&\"\",INDIRECT(\"Data!B\"&MATCH(A58,Data!$C$2:$C$100000,0)+1&\":B100000\")&\"\",0)=(ROW(INDIRECT(\"Data!B\"&MATCH(A58,Data!$C$2:$C$100000,0)+1&\":B100000\"))-MATCH(A58,Data!$C$2:$C$100000,0))),ROW(INDIRECT(\"Data!B\"&MATCH(A58,Data!$C$2:$C$100000,0)+1&\":B100000\"))-MATCH(A58,Data!$C$2:$C$100000,0),\"\"),COUNTIF($A$5:A58,A58))),\"\")","v":""},{"$f":"SUMIFS(Data!$D:$D,Data!$C:$C,A58,Data!$B:$B,B58)","v":0},{"$f":"SUMIFS(Data!$E:$E,Data!$C:$C,A58,Data!$B:$B,B58)","v":0},{"$f":"IF(AND(B58=\"Grand Aquarium\",WEEKDAY(A58)=3),40,IF(AND(B58=\"Grand Aquarium\",WEEKDAY(A58)=7),40,VLOOKUP(B58,Price!$A$6:$C$216,2,0)))","v":{"$error":"#N/A"}},{"$f":"IF(AND(B58=\"Grand Aquarium\",WEEKDAY(A58)=3),20,IF(AND(B58=\"Grand Aquarium\",WEEKDAY(A58)=7),20,VLOOKUP(B58,Price!$A$6:$C$216,3,0)))","v":{"$error":"#N/A"}},{"$f":"IF(SUMIFS(Data!$J:$J,Data!$C:$C,A58,Data!$B:$B,B58)>H58,SUMIFS(Data!$J:$J,Data!$C:$C,A58,Data!$B:$B,B58)-H58,\"\")","v":0},180,{"$f":"SUMPRODUCT((Data!$C:$C=A58)*(Data!$B:$B=B58),(Data!$I:$I))","v":0},{"$f":"IF(SUMIFS(Data!$J:$J,Data!$C:$C,A58,Data!$B:$B,B58)<H58,H58-SUMIFS(Data!$J:$J,Data!$C:$C,A58,Data!$B:$B,B58),\"\")","v":0}]
[null,{"$f":"IFERROR(INDEX(INDIRECT(\"Data!B\"&MATCH(A59,Data!$C$2:$C$100000,0)+1&\":B100000\"),SMALL(IF((A59=INDIRECT(\"Data!C\"&MATCH(A59,Data!$C$2:$C$100000,0)+1&\":C100000\"))*(MATCH(INDIRECT(\"Data!B\"&MATCH(A59,Data!$C$2:$C$100000,0)+1&\":B100000\")&\"\",INDIRECT(\"Data!B\"&MATCH(A59,Data!$C$2:$C$100000,0)+1&\":B100000\")&\"\",0)=(ROW(INDIRECT(\"Data!B\"&MATCH(A59,Data!$C$2:$C$100000,0)+1&\":B100000\"))-MATCH(A59,Data!$C$2:$C$100000,0))),ROW(INDIRECT(\"Data!B\"&MATCH(A59,Data!$C$2:$C$100000,0)+1&\":B100000\"))-MATCH(A59,Data!$C$2:$C$100000,0),\"\"),COUNTIF($A$5:A59,A59))),\"\")","v":""},{"$f":"SUMIFS(Data!$D:$D,Data!$C:$C,A59,Data!$B:$B,B59)","v":0},{"$f":"SUMIFS(Data!$E:$E,Data!$C:$C,A59,Data!$B:$B,B59)","v":0},null,null,{"$f":"IF(SUMIFS(Data!$J:$J,Data!$C:$C,A59,Data!$B:$B,B59)>H59,SUMIFS(Data!$J:$J,Data!$C:$C,A59,Data!$B:$B,B59)-H59,\"\")","v":0},180,{"$f":"SUMPRODUCT((Data!$C:$C=A59)*(Data!$B:$B=B59),(Data!$I:$I))","v":0},{"$f":"IF(SUMIFS(Data!$J:$J,Data!$C:$C,A59,Data!$B:$B,B59)<H59,H59-SUMIFS(Data!$J:$J,Data!$C:$C,A59,Data!$B:$B,B59),\"\")","v":0},{"$f":"SUM(H53:H58)","v":{"$error":"#N/A"}}]
[null,{"$f":"IFERROR(INDEX(INDIRECT(\"Data!B\"&MATCH(A60,Data!$C$2:$C$100000,0)+1&\":B100000\"),SMALL(IF((A60=INDIRECT(\"Data!C\"&MATCH(A60,Data!$C$2:$C$100000,0)+1&\":C100000\"))*(MATCH(INDIRECT(\"Data!B\"&MATCH(A60,Data!$C$2:$C$100000,0)+1&\":B100000\")&\"\",INDIRECT(\"Data!B\"&MATCH(A60,Data!$C$2:$C$100000,0)+1&\":B100000\")&\"\",0)=(ROW(INDIRECT(\"Data!B\"&MATCH(A60,Data!$C$2:$C$100000,0)+1&\":B100000\"))-MATCH(A60,Data!$C$2:$C$100000,0))),ROW(INDIRECT(\"Data!B\"&MATCH(A60,Data!$C$2:$C$100000,0)+1&\":B100000\"))-MATCH(A60,Data!$C$2:$C$100000,0),\"\"),COUNTIF($A$5:A60,A60))),\"\")","v":""},{"$f":"SUMIFS(Data!$D:$D,Data!$C:$C,A60,Data!$B:$B,B60)","v":0},{"$f":"SUMIFS(Data!$E:$E,Data!$C:$C,A60,Data!$B:$B,B60)","v":0},{"$f":"IF(AND(B60=\"Grand Aquarium\",WEEKDAY(A60)=3),40,IF(AND(B60=\"Grand Aquarium\",WEEKDAY(A60)=7),40,VLOOKUP(B60,Price!$A$6:$C$216,2,0)))","v":{"$error":"#N/A"}},{"$f":"IF(AND(B60=\"Grand Aquarium\",WEEKDAY(A60)=3),20,IF(AND(B60=\"Grand Aquarium\",WEEKDAY(A60)=7),20,VLOOKUP(B60,Price!$A$6:$C$216,3,0)))","v":{"$error":"#N/A"}},{"$f":"IF(SUMIFS(Data!$J:$J,Data!$C:$C,A60,Data!$B:$B,B60)>H60,SUMIFS(Data!$J:$J,Data!$C:$C,A60,Data!$B:$B,B60)-H60,\"\")","v":0},180,{"$f":"SUMPRODUCT((Data!$C:$C=A60)*(Data!$B:$B=B60),(Data!$I:$I))","v":0},{"$f":"IF(SUMIFS(Data!$J:$J,Data!$C:$C,A60,Data!$B:$B,B60)<H60,H60-SUMIFS(Data!$J:$J,Data!$C:$C,A60,Data!$B:$B,B60),\"\")","v":0},"Without Transfer"]
[null,{"$f":"IFERROR(INDEX(INDIRECT(\"Data!B\"&MATCH(A61,Data!$C$2:$C$100000,0)+1&\":B100000\"),SMALL(IF((A61=INDIRECT(\"Data!C\"&MATCH(A61,Data!$C$2:$C$100000,0)+1&\":C100000\"))*(MATCH(INDIRECT(\"Data!B\"&MATCH(A61,Data!$C$2:$C$100000,0)+1&\":B100000\")&\"\",INDIRECT(\"Data!B\"&MATCH(A61,Data!$C$2:$C$100000,0)+1&\":B100000\")&\"\",0)=(ROW(INDIRECT(\"Data!B\"&MATCH(A61,Data!$C$2:$C$100000,0)+1&\":B100000\"))-MATCH(A61,Data!$C$2:$C$100000,0))),ROW(INDIRECT(\"Data!B\"&MATCH(A61,Data!$C$2:$C$100000,0)+1&\":B100000\"))-MATCH(A61,Data!$C$2:$C$100000,0),\"\"),COUNTIF($A$5:A61,A61))),\"\")","v":""},{"$f":"SUMIFS(Data!$D:$D,Data!$C:$C,A61,Data!$B:$B,B61)","v":0},{"$f":"SUMIFS(Data!$E:$E,Data!$C:$C,A61,Data!$B:$B,B61)","v":0},{"$f":"IF(AND(B61=\"Grand Aquarium\",WEEKDAY(A61)=3),40,IF(AND(B61=\"Grand Aquarium\",WEEKDAY(A61)=7),40,VLOOKUP(B61,Price!$A$6:$C$216,2,0)))","v":{"$error":"#N/A"}},{"$f":"IF(AND(B61=\"Grand Aquarium\",WEEKDAY(A61)=3),20,IF(AND(B61=\"Grand Aquarium\",WEEKDAY(A61)=7),20,VLOOKUP(B61,Price!$A$6:$C$216,3,0)))","v":{"$error":"#N/A"}},{"$f":"IF(SUMIFS(Data!$J:$J,Data!$C:$C,A61,Data!$B:$B,B61)>H61,SUMIFS(Data!$J:$J,Data!$C:$C,A61,Data!$B:$B,B61)-H61,\"\")","v":0},180,{"$f":"SUMPRODUCT((Data!$C:$C=A61)*(Data!$B:$B=B61),(Data!$I:$I))","v":0},{"$f":"IF(SUMIFS(Data!$J:$J,Data!$C:$C,A61,Data!$B:$B,B61)<H61,H61-SUMIFS(Data!$J:$J,Data!$C:$C,A61,Data!$B:$B,B61),\"\")","v":0}]
[null,{"$f":"IFERROR(INDEX(INDIRECT(\"Data!B\"&MATCH(A62,Data!$C$2:$C$100000,0)+1&\":B100000\"),SMALL(IF((A62=INDIRECT(\"Data!C\"&MATCH(A62,Data!$C$2:$C$100000,0)+1&\":C100000\"))*(MATCH(INDIRECT(\"Data!B\"&MATCH(A62,Data!$C$2:$C$100000,0)+1&\":B100000\")&\"\",INDIRECT(\"Data!B\"&MATCH(A62,Data!$C$2:$C$100000,0)+1&\":B100000\")&\"\",0)=(ROW(INDIRECT(\"Data!B\"&MATCH(A62,Data!$C$2:$C$100000,0)+1&\":B100000\"))-MATCH(A62,Data!$C$2:$C$100000,0))),ROW(INDIRECT(\"Data!B\"&MATCH(A62,Data!$C$2:$C$100000,0)+1&\":B100000\"))-MATCH(A62,Data!$C$2:$C$100000,0),\"\"),COUNTIF($A$5:A62,A62))),\"\")","v":""},{"$f":"SUMIFS(Data!$D:$D,Data!$C:$C,A62,Data!$B:$B,B62)","v":0},{"$f":"SUMIFS(Data!$E:$E,Data!$C:$C,A62,Data!$B:$B,B62)","v":0},null,null,{"$f":"IF(SUMIFS(Data!$J:$J,Data!$C:$C,A62,Data!$B:$B,B62)>H62,SUMIFS(Data!$J:$J,Data!$C:$C,A62,Data!$B:$B,B62)-H62,\"\")","v":0},180,{"$f":"SUMPRODUCT((Data!$C:$C=A62)*(Data!$B:$B=B62),(Data!$I:$I))","v":0},{"$f":"IF(SUMIFS(Data!$J:$J,Data!$C:$C,A62,Data!$B:$B,B62)<H62,H62-SUMIFS(Data!$J:$J,Data!$C:$C,A62,Data!$B:$B,B62),\"\")","v":0},{"$f":"SUM(H60:H61)","v":{"$error":"#N/A"}}]
[null,{"$f":"IFERROR(INDEX(INDIRECT(\"Data!B\"&MATCH(A63,Data!$C$2:$C$100000,0)+1&\":B100000\"),SMALL(IF((A63=INDIRECT(\"Data!C\"&MATCH(A63,Data!$C$2:$C$100000,0)+1&\":C100000\"))*(MATCH(INDIRECT(\"Data!B\"&MATCH(A63,Data!$C$2:$C$100000,0)+1&\":B100000\")&\"\",INDIRECT(\"Data!B\"&MATCH(A63,Data!$C$2:$C$100000,0)+1&\":B100000\")&\"\",0)=(ROW(INDIRECT(\"Data!B\"&MATCH(A63,Data!$C$2:$C$100000,0)+1&\":B100000\"))-MATCH(A63,Data!$C$2:$C$100000,0))),ROW(INDIRECT(\"Data!B\"&MATCH(A63,Data!$C$2:$C$100000,0)+1&\":B100000\"))-MATCH(A63,Data!$C$2:$C$100000,0),\"\"),COUNTIF($A$5:A63,A63))),\"\")","v":""},{"$f":"SUMIFS(Data!$D:$D,Data!$C:$C,A63,Data!$B:$B,B63)","v":0},{"$f":"SUMIFS(Data!$E:$E,Data!$C:$C,A63,Data!$B:$B,B63)","v":0},{"$f":"IF(AND(B63=\"Grand Aquarium\",WEEKDAY(A63)=3),40,IF(AND(B63=\"Grand Aquarium\",WEEKDAY(A63)=7),40,VLOOKUP(B63,Price!$A$6:$C$216,2,0)))","v":{"$error":"#N/A"}},{"$f":"IF(AND(B63=\"Grand Aquarium\",WEEKDAY(A63)=3),20,IF(AND(B63=\"Grand Aquarium\",WEEKDAY(A63)=7),20,VLOOKUP(B63,Price!$A$6:$C$216,3,0)))","v":{"$error":"#N/A"}},{"$f":"IF(SUMIFS(Data!$J:$J,Data!$C:$C,A63,Data!$B:$B,B63)>H63,SUMIFS(Data!$J:$J,Data!$C:$C,A63,Data!$B:$B,B63)-H63,\"\")","v":0},180,{"$f":"SUMPRODUCT((Data!$C:$C=A63)*(Data!$B:$B=B63),(Data!$I:$I))","v":0},{"$f":"IF(SUMIFS(Data!$J:$J,Data!$C:$C,A63,Data!$B:$B,B63)<H63,H63-SUMIFS(Data!$J:$J,Data!$C:$C,A63,Data!$B:$B,B63),\"\")","v":0}]
[null,{"$f":"IFERROR(INDEX(INDIRECT(\"Data!B\"&MATCH(A64,Data!$C$2:$C$100000,0)+1&\":B100000\"),SMALL(IF((A64=INDIRECT(\"Data!C\"&MATCH(A64,Data!$C$2:$C$100000,0)+1&\":C100000\"))*(MATCH(INDIRECT(\"Data!B\"&MATCH(A64,Data!$C$2:$C$100000,0)+1&\":B100000\")&\"\",INDIRECT(\"Data!B\"&MATCH(A64,Data!$C$2:$C$100000,0)+1&\":B100000\")&\"\",0)=(ROW(INDIRECT(\"Data!B\"&MATCH(A64,Data!$C$2:$C$100000,0)+1&\":B100000\"))-MATCH(A64,Data!$C$2:$C$100000,0))),ROW(INDIRECT(\"Data!B\"&MATCH(A64,Data!$C$2:$C$100000,0)+1&\":B100000\"))-MATCH(A64,Data!$C$2:$C$100000,0),\"\"),COUNTIF($A$5:A64,A64))),\"\")","v":""},{"$f":"SUMIFS(Data!$D:$D,Data!$C:$C,A64,Data!$B:$B,B64)","v":0},{"$f":"SUMIFS(Data!$E:$E,Data!$C:$C,A64,Data!$B:$B,B64)","v":0},null,null,{"$f":"IF(SUMIFS(Data!$J:$J,Data!$C:$C,A64,Data!$B:$B,B64)>H64,SUMIFS(Data!$J:$J,Data!$C:$C,A64,Data!$B:$B,B64)-H64,\"\")","v":0},180,{"$f":"SUMPRODUCT((Data!$C:$C=A64)*(Data!$B:$B=B64),(Data!$I:$I))","v":0},{"$f":"IF(SUMIFS(Data!$J:$J,Data!$C:$C,A64,Data!$B:$B,B64)<H64,H64-SUMIFS(Data!$J:$J,Data!$C:$C,A64,Data!$B:$B,B64),\"\")","v":0},{"$f":"SUM(H63:H63)","v":{"$error":"#N/A"}}]
[null,{"$f":"IFERROR(INDEX(INDIRECT(\"Data!B\"&MATCH(A65,Data!$C$2:$C$100000,0)+1&\":B100000\"),SMALL(IF((A65=INDIRECT(\"Data!C\"&MATCH(A65,Data!$C$2:$C$100000,0)+1&\":C100000\"))*(MATCH(INDIRECT(\"Data!B\"&MATCH(A65,Data!$C$2:$C$100000,0)+1&\":B100000\")&\"\",INDIRECT(\"Data!B\"&MATCH(A65,Data!$C$2:$C$100000,0)+1&\":B100000\")&\"\",0)=(ROW(INDIRECT(\"Data!B\"&MATCH(A65,Data!$C$2:$C$100000,0)+1&\":B100000\"))-MATCH(A65,Data!$C$2:$C$100000,0))),ROW(INDIRECT(\"Data!B\"&MATCH(A65,Data!$C$2:$C$100000,0)+1&\":B100000\"))-MATCH(A65,Data!$C$2:$C$100000,0),\"\"),COUNTIF($A$5:A65,A65))),\"\")","v":""},{"$f":"SUMIFS(Data!$D:$D,Data!$C:$C,A65,Data!$B:$B,B65)","v":0},{"$f":"SUMIFS(Data!$E:$E,Data!$C:$C,A65,Data!$B:$B,B65)","v":0},{"$f":"IF(AND(B65=\"Grand Aquarium\",WEEKDAY(A65)=3),40,IF(AND(B65=\"Grand Aquarium\",WEEKDAY(A65)=7),40,VLOOKUP(B65,Price!$A$6:$C$216,2,0)))","v":{"$error":"#N/A"}},{"$f":"IF(AND(B65=\"Grand Aquarium\",WEEKDAY(A65)=3),20,IF(AND(B65=\"Grand Aquarium\",WEEKDAY(A65)=7),20,VLOOKUP(B65,Price!$A$6:$C$216,3,0)))","v":{"$error":"#N/A"}},{"$f":"IF(SUMIFS(Data!$J:$J,Data!$C:$C,A65,Data!$B:$B,B65)>H65,SUMIFS(Data!$J:$J,Data!$C:$C,A65,Data!$B:$B,B65)-H65,\"\")","v":0},180,{"$f":"SUMPRODUCT((Data!$C:$C=A65)*(Data!$B:$B=B65),(Data!$I:$I))","v":0},{"$f":"IF(SUMIFS(Data!$J:$J,Data!$C:$C,A65,Data!$B:$B,B65)<H65,H65-SUMIFS(Data!$J:$J,Data!$C:$C,A65,Data!$B:$B,B65),\"\")","v":0}]
[null,{"$f":"IFERROR(INDEX(INDIRECT(\"Data!B\"&MATCH(A66,Data!$C$2:$C$100000,0)+1&\":B100000\"),SMALL(IF((A66=INDIRECT(\"Data!C\"&MATCH(A66,Data!$C$2:$C$100000,0)+1&\":C100000\"))*(MATCH(INDIRECT(\"Data!B\"&MATCH(A66,Data!$C$2:$C$100000,0)+1&\":B100000\")&\"\",INDIRECT(\"Data!B\"&MATCH(A66,Data!$C$2:$C$100000,0)+1&\":B100000\")&\"\",0)=(ROW(INDIRECT(\"Data!B\"&MATCH(A66,Data!$C$2:$C$100000,0)+1&\":B100000\"))-MATCH(A66,Data!$C$2:$C$100000,0))),ROW(INDIRECT(\"Data!B\"&MATCH(A66,Data!$C$2:$C$100000,0)+1&\":B100000\"))-MATCH(A66,Data!$C$2:$C$100000,0),\"\"),COUNTIF($A$5:A66,A66))),\"\")","v":""},{"$f":"SUMIFS(Data!$D:$D,Data!$C:$C,A66,Data!$B:$B,B66)","v":0},{"$f":"SUMIFS(Data!$E:$E,Data!$C:$C,A66,Data!$B:$B,B66)","v":0},null,null,{"$f":"IF(SUMIFS(Data!$J:$J,Data!$C:$C,A66,Data!$B:$B,B66)>H66,SUMIFS(Data!$J:$J,Data!$C:$C,A66,Data!$B:$B,B66)-H66,\"\")","v":0},180,{"$f":"SUMPRODUCT((Data!$C:$C=A66)*(Data!$B:$B=B66),(Data!$I:$I))","v":0},{"$f":"IF(SUMIFS(Data!$J:$J,Data!$C:$C,A66,Data!$B:$B,B66)<H66,H66-SUMIFS(Data!$J:$J,Data!$C:$C,A66,Data!$B:$B,B66),\"\")","v":0},{"$f":"SUM(H65:H65)","v":{"$error":"#N/A"}}]
[null,{"$f":"IFERROR(INDEX(INDIRECT(\"Data!B\"&MATCH(A67,Data!$C$2:$C$100000,0)+1&\":B100000\"),SMALL(IF((A67=INDIRECT(\"Data!C\"&MATCH(A67,Data!$C$2:$C$100000,0)+1&\":C100000\"))*(MATCH(INDIRECT(\"Data!B\"&MATCH(A67,Data!$C$2:$C$100000,0)+1&\":B100000\")&\"\",INDIRECT(\"Data!B\"&MATCH(A67,Data!$C$2:$C$100000,0)+1&\":B100000\")&\"\",0)=(ROW(INDIRECT(\"Data!B\"&MATCH(A67,Data!$C$2:$C$100000,0)+1&\":B100000\"))-MATCH(A67,Data!$C$2:$C$100000,0))),ROW(INDIRECT(\"Data!B\"&MATCH(A67,Data!$C$2:$C$100000,0)+1&\":B100000\"))-MATCH(A67,Data!$C$2:$C$100000,0),\"\"),COUNTIF($A$5:A67,A67))),\"\")","v":""},{"$f":"SUMIFS(Data!$D:$D,Data!$C:$C,A67,Data!$B:$B,B67)","v":0},{"$f":"SUMIFS(Data!$E:$E,Data!$C:$C,A67,Data!$B:$B,B67)","v":0},{"$f":"IF(AND(B67=\"Grand Aquarium\",WEEKDAY(A67)=3),40,IF(AND(B67=\"Grand Aquarium\",WEEKDAY(A67)=7),40,VLOOKUP(B67,Price!$A$6:$C$216,2,0)))","v":{"$error":"#N/A"}},{"$f":"IF(AND(B67=\"Grand Aquarium\",WEEKDAY(A67)=3),20,IF(AND(B67=\"Grand Aquarium\",WEEKDAY(A67)=7),20,VLOOKUP(B67,Price!$A$6:$C$216,3,0)))","v":{"$error":"#N/A"}},{"$f":"IF(SUMIFS(Data!$J:$J,Data!$C:$C,A67,Data!$B:$B,B67)>H67,SUMIFS(Data!$J:$J,Data!$C:$C,A67,Data!$B:$B,B67)-H67,\"\")","v":0},180,{"$f":"SUMPRODUCT((Data!$C:$C=A67)*(Data!$B:$B=B67),(Data!$I:$I))","v":0},{"$f":"IF(SUMIFS(Data!$J:$J,Data!$C:$C,A67,Data!$B:$B,B67)<H67,H67-SUMIFS(Data!$J:$J,Data!$C:$C,A67,Data!$B:$B,B67),\"\")","v":0}]
[null,{"$f":"IFERROR(INDEX(INDIRECT(\"Data!B\"&MATCH(A68,Data!$C$2:$C$100000,0)+1&\":B100000\"),SMALL(IF((A68=INDIRECT(\"Data!C\"&MATCH(A68,Data!$C$2:$C$100000,0)+1&\":C100000\"))*(MATCH(INDIRECT(\"Data!B\"&MATCH(A68,Data!$C$2:$C$100000,0)+1&\":B100000\")&\"\",INDIRECT(\"Data!B\"&MATCH(A68,Data!$C$2:$C$100000,0)+1&\":B100000\")&\"\",0)=(ROW(INDIRECT(\"Data!B\"&MATCH(A68,Data!$C$2:$C$100000,0)+1&\":B100000\"))-MATCH(A68,Data!$C$2:$C$100000,0))),ROW(INDIRECT(\"Data!B\"&MATCH(A68,Data!$C$2:$C$100000,0)+1&\":B100000\"))-MATCH(A68,Data!$C$2:$C$100000,0),\"\"),COUNTIF($A$5:A68,A68))),\"\")","v":""},{"$f":"SUMIFS(Data!$D:$D,Data!$C:$C,A68,Data!$B:$B,B68)","v":0},{"$f":"SUMIFS(Data!$E:$E,Data!$C:$C,A68,Data!$B:$B,B68)","v":0},null,null,{"$f":"IF(SUMIFS(Data!$J:$J,Data!$C:$C,A68,Data!$B:$B,B68)>H68,SUMIFS(Data!$J:$J,Data!$C:$C,A68,Data!$B:$B,B68)-H68,\"\")","v":0},180,{"$f":"SUMPRODUCT((Data!$C:$C=A68)*(Data!$B:$B=B68),(Data!$I:$I))","v":0},{"$f":"IF(SUMIFS(Data!$J:$J,Data!$C:$C,A68,Data!$B:$B,B68)<H68,H68-SUMIFS(Data!$J:$J,Data!$C:$C,A68,Data!$B:$B,B68),\"\")","v":0},{"$f":"SUM(H67:H67)","v":{"$error":"#N/A"}}]
[null,{"$f":"IFERROR(INDEX(INDIRECT(\"Data!B\"&MATCH(A69,Data!$C$2:$C$100000,0)+1&\":B100000\"),SMALL(IF((A69=INDIRECT(\"Data!C\"&MATCH(A69,Data!$C$2:$C$100000,0)+1&\":C100000\"))*(MATCH(INDIRECT(\"Data!B\"&MATCH(A69,Data!$C$2:$C$100000,0)+1&\":B100000\")&\"\",INDIRECT(\"Data!B\"&MATCH(A69,Data!$C$2:$C$100000,0)+1&\":B100000\")&\"\",0)=(ROW(INDIRECT(\"Data!B\"&MATCH(A69,Data!$C$2:$C$100000,0)+1&\":B100000\"))-MATCH(A69,Data!$C$2:$C$100000,0))),ROW(INDIRECT(\"Data!B\"&MATCH(A69,Data!$C$2:$C$100000,0)+1&\":B100000\"))-MATCH(A69,Data!$C$2:$C$100000,0),\"\"),COUNTIF($A$5:A69,A69))),\"\")","v":""},{"$f":"SUMIFS(Data!$D:$D,Data!$C:$C,A69,Data!$B:$B,B69)","v":0},{"$f":"SUMIFS(Data!$E:$E,Data!$C:$C,A69,Data!$B:$B,B69)","v":0},{"$f":"IF(AND(B69=\"Grand Aquarium\",WEEKDAY(A69)=3),40,IF(AND(B69=\"Grand Aquarium\",WEEKDAY(A69)=7),40,VLOOKUP(B69,Price!$A$6:$C$216,2,0)))","v":{"$error":"#N/A"}},{"$f":"IF(AND(B69=\"Grand Aquarium\",WEEKDAY(A69)=3),20,IF(AND(B69=\"Grand Aquarium\",WEEKDAY(A69)=7),20,VLOOKUP(B69,Price!$A$6:$C$216,3,0)))","v":{"$error":"#N/A"}},{"$f":"IF(SUMIFS(Data!$J:$J,Data!$C:$C,A69,Data!$B:$B,B69)>H69,SUMIFS(Data!$J:$J,Data!$C:$C,A69,Data!$B:$B,B69)-H69,\"\")","v":0},180,{"$f":"SUMPRODUCT((Data!$C:$C=A69)*(Data!$B:$B=B69),(Data!$I:$I))","v":0},{"$f":"IF(SUMIFS(Data!$J:$J,Data!$C:$C,A69,Data!$B:$B,B69)<H69,H69-SUMIFS(Data!$J:$J,Data!$C:$C,A69,Data!$B:$B,B69),\"\")","v":0}]
[null,{"$f":"IFERROR(INDEX(INDIRECT(\"Data!B\"&MATCH(A70,Data!$C$2:$C$100000,0)+1&\":B100000\"),SMALL(IF((A70=INDIRECT(\"Data!C\"&MATCH(A70,Data!$C$2:$C$100000,0)+1&\":C100000\"))*(MATCH(INDIRECT(\"Data!B\"&MATCH(A70,Data!$C$2:$C$100000,0)+1&\":B100000\")&\"\",INDIRECT(\"Data!B\"&MATCH(A70,Data!$C$2:$C$100000,0)+1&\":B100000\")&\"\",0)=(ROW(INDIRECT(\"Data!B\"&MATCH(A70,Data!$C$2:$C$100000,0)+1&\":B100000\"))-MATCH(A70,Data!$C$2:$C$100000,0))),ROW(INDIRECT(\"Data!B\"&MATCH(A70,Data!$C$2:$C$100000,0)+1&\":B100000\"))-MATCH(A70,Data!$C$2:$C$100000,0),\"\"),COUNTIF($A$5:A70,A70))),\"\")","v":""},{"$f":"SUMIFS(Data!$D:$D,Data!$C:$C,A70,Data!$B:$B,B70)","v":0},{"$f":"SUMIFS(Data!$E:$E,Data!$C:$C,A70,Data!$B:$B,B70)","v":0},{"$f":"IF(AND(B70=\"Grand Aquarium\",WEEKDAY(A70)=3),40,IF(AND(B70=\"Grand Aquarium\",WEEKDAY(A70)=7),40,VLOOKUP(B70,Price!$A$6:$C$216,2,0)))","v":{"$error":"#N/A"}},{"$f":"IF(AND(B70=\"Grand Aquarium\",WEEKDAY(A70)=3),20,IF(AND(B70=\"Grand Aquarium\",WEEKDAY(A70)=7),20,VLOOKUP(B70,Price!$A$6:$C$216,3,0)))","v":{"$error":"#N/A"}},{"$f":"IF(SUMIFS(Data!$J:$J,Data!$C:$C,A70,Data!$B:$B,B70)>H70,SUMIFS(Data!$J:$J,Data!$C:$C,A70,Data!$B:$B,B70)-H70,\"\")","v":0},{"$f":"(C70*E70)+(D70*F70)+G70","v":180},{"$f":"SUMPRODUCT((Data!$C:$C=A70)*(Data!$B:$B=B70),(Data!$I:$I))","v":0},{"$f":"IF(SUMIFS(Data!$J:$J,Data!$C:$C,A70,Data!$B:$B,B70)<H70,H70-SUMIFS(Data!$J:$J,Data!$C:$C,A70,Data!$B:$B,B70),\"\")","v":0}]
[null,{"$f":"IFERROR(INDEX(INDIRECT(\"Data!B\"&MATCH(A71,Data!$C$2:$C$100000,0)+1&\":B100000\"),SMALL(IF((A71=INDIRECT(\"Data!C\"&MATCH(A71,Data!$C$2:$C$100000,0)+1&\":C100000\"))*(MATCH(INDIRECT(\"Data!B\"&MATCH(A71,Data!$C$2:$C$100000,0)+1&\":B100000\")&\"\",INDIRECT(\"Data!B\"&MATCH(A71,Data!$C$2:$C$100000,0)+1&\":B100000\")&\"\",0)=(ROW(INDIRECT(\"Data!B\"&MATCH(A71,Data!$C$2:$C$100000,0)+1&\":B100000\"))-MATCH(A71,Data!$C$2:$C$100000,0))),ROW(INDIRECT(\"Data!B\"&MATCH(A71,Data!$C$2:$C$100000,0)+1&\":B100000\"))-MATCH(A71,Data!$C$2:$C$100000,0),\"\"),COUNTIF($A$5:A71,A71))),\"\")","v":""},{"$f":"SUMIFS(Data!$D:$D,Data!$C:$C,A71,Data!$B:$B,B71)","v":0},{"$f":"SUMIFS(Data!$E:$E,Data!$C:$C,A71,Data!$B:$B,B71)","v":0},null,null,{"$f":"IF(SUMIFS(Data!$J:$J,Data!$C:$C,A71,Data!$B:$B,B71)>H71,SUMIFS(Data!$J:$J,Data!$C:$C,A71,Data!$B:$B,B71)-H71,\"\")","v":0},180,{"$f":"SUMPRODUCT((Data!$C:$C=A71)*(Data!$B:$B=B71),(Data!$I:$I))","v":0},{"$f":"IF(SUMIFS(Data!$J:$J,Data!$C:$C,A71,Data!$B:$B,B71)<H71,H71-SUMIFS(Data!$J:$J,Data!$C:$C,A71,Data!$B:$B,B71),\"\")","v":0},{"$f":"SUM(H69:H70)","v":{"$error":"#N/A"}}]
[null,{"$f":"IFERROR(INDEX(INDIRECT(\"Data!B\"&MATCH(A72,Data!$C$2:$C$100000,0)+1&\":B100000\"),SMALL(IF((A72=INDIRECT(\"Data!C\"&MATCH(A72,Data!$C$2:$C$100000,0)+1&\":C100000\"))*(MATCH(INDIRECT(\"Data!B\"&MATCH(A72,Data!$C$2:$C$100000,0)+1&\":B100000\")&\"\",INDIRECT(\"Data!B\"&MATCH(A72,Data!$C$2:$C$100000,0)+1&\":B100000\")&\"\",0)=(ROW(INDIRECT(\"Data!B\"&MATCH(A72,Data!$C$2:$C$100000,0)+1&\":B100000\"))-MATCH(A72,Data!$C$2:$C$100000,0))),ROW(INDIRECT(\"Data!B\"&MATCH(A72,Data!$C$2:$C$100000,0)+1&\":B100000\"))-MATCH(A72,Data!$C$2:$C$100000,0),\"\"),COUNTIF($A$5:A72,A72))),\"\")","v":""},{"$f":"SUMIFS(Data!$D:$D,Data!$C:$C,A72,Data!$B:$B,B72)","v":0},{"$f":"SUMIFS(Data!$E:$E,Data!$C:$C,A72,Data!$B:$B,B72)","v":0},{"$f":"IF(AND(B72=\"Grand Aquarium\",WEEKDAY(A72)=3),40,IF(AND(B72=\"Grand Aquarium\",WEEKDAY(A72)=7),40,VLOOKUP(B72,Price!$A$6:$C$216,2,0)))","v":{"$error":"#N/A"}},{"$f":"IF(AND(B72=\"Grand Aquarium\",WEEKDAY(A72)=3),20,IF(AND(B72=\"Grand Aquarium\",WEEKDAY(A72)=7),20,VLOOKUP(B72,Price!$A$6:$C$216,3,0)))","v":{"$error":"#N/A"}},{"$f":"IF(SUMIFS(Data!$J:$J,Data!$C:$C,A72,Data!$B:$B,B72)>H72,SUMIFS(Data!$J:$J,Data!$C:$C,A72,Data!$B:$B,B72)-H72,\"\")","v":0},180,{"$f":"SUMPRODUCT((Data!$C:$C=A72)*(Data!$B:$B=B72),(Data!$I:$I))","v":0},{"$f":"IF(SUMIFS(Data!$J:$J,Data!$C:$C,A72,Data!$B:$B,B72)<H72,H72-SUMIFS(Data!$J:$J,Data!$C:$C,A72,Data!$B:$B,B72),\"\")","v":0}]
[null,{"$f":"IFERROR(INDEX(INDIRECT(\"Data!B\"&MATCH(A73,Data!$C$2:$C$100000,0)+1&\":B100000\"),SMALL(IF((A73=INDIRECT(\"Data!C\"&MATCH(A73,Data!$C$2:$C$100000,0)+1&\":C100000\"))*(MATCH(INDIRECT(\"Data!B\"&MATCH(A73,Data!$C$2:$C$100000,0)+1&\":B100000\")&\"\",INDIRECT(\"Data!B\"&MATCH(A73,Data!$C$2:$C$100000,0)+1&\":B100000\")&\"\",0)=(ROW(INDIRECT(\"Data!B\"&MATCH(A73,Data!$C$2:$C$100000,0)+1&\":B100000\"))-MATCH(A73,Data!$C$2:$C$100000,0))),ROW(INDIRECT(\"Data!B\"&MATCH(A73,Data!$C$2:$C$100000,0)+1&\":B100000\"))-MATCH(A73,Data!$C$2:$C$100000,0),\"\"),COUNTIF($A$5:A73,A73))),\"\")","v":""},{"$f":"SUMIFS(Data!$D:$D,Data!$C:$C,A73,Data!$B:$B,B73)","v":0},{"$f":"SUMIFS(Data!$E:$E,Data!$C:$C,A73,Data!$B:$B,B73)","v":0},null,null,{"$f":"IF(SUMIFS(Data!$J:$J,Data!$C:$C,A73,Data!$B:$B,B73)>H73,SUMIFS(Data!$J:$J,Data!$C:$C,A73,Data!$B:$B,B73)-H73,\"\")","v":0},180,{"$f":"SUMPRODUCT((Data!$C:$C=A73)*(Data!$B:$B=B73),(Data!$I:$I))","v":0},{"$f":"IF(SUMIFS(Data!$J:$J,Data!$C:$C,A73,Data!$B:$B,B73)<H73,H73-SUMIFS(Data!$J:$J,Data!$C:$C,A73,Data!$B:$B,B73),\"\")","v":0},{"$f":"SUM(H72:H72)","v":{"$error":"#N/A"}}]
[null,{"$f":"IFERROR(INDEX(INDIRECT(\"Data!B\"&MATCH(A74,Data!$C$2:$C$100000,0)+1&\":B100000\"),SMALL(IF((A74=INDIRECT(\"Data!C\"&MATCH(A74,Data!$C$2:$C$100000,0)+1&\":C100000\"))*(MATCH(INDIRECT(\"Data!B\"&MATCH(A74,Data!$C$2:$C$100000,0)+1&\":B100000\")&\"\",INDIRECT(\"Data!B\"&MATCH(A74,Data!$C$2:$C$100000,0)+1&\":B100000\")&\"\",0)=(ROW(INDIRECT(\"Data!B\"&MATCH(A74,Data!$C$2:$C$100000,0)+1&\":B100000\"))-MATCH(A74,Data!$C$2:$C$100000,0))),ROW(INDIRECT(\"Data!B\"&MATCH(A74,Data!$C$2:$C$100000,0)+1&\":B100000\"))-MATCH(A74,Data!$C$2:$C$100000,0),\"\"),COUNTIF($A$5:A74,A74))),\"\")","v":""},{"$f":"SUMIFS(Data!$D:$D,Data!$C:$C,A74,Data!$B:$B,B74)","v":0},{"$f":"SUMIFS(Data!$E:$E,Data!$C:$C,A74,Data!$B:$B,B74)","v":0},{"$f":"IF(AND(B74=\"Grand Aquarium\",WEEKDAY(A74)=3),40,IF(AND(B74=\"Grand Aquarium\",WEEKDAY(A74)=7),40,VLOOKUP(B74,Price!$A$6:$C$216,2,0)))","v":{"$error":"#N/A"}},{"$f":"IF(AND(B74=\"Grand Aquarium\",WEEKDAY(A74)=3),20,IF(AND(B74=\"Grand Aquarium\",WEEKDAY(A74)=7),20,VLOOKUP(B74,Price!$A$6:$C$216,3,0)))","v":{"$error":"#N/A"}},{"$f":"IF(SUMIFS(Data!$J:$J,Data!$C:$C,A74,Data!$B:$B,B74)>H74,SUMIFS(Data!$J:$J,Data!$C:$C,A74,Data!$B:$B,B74)-H74,\"\")","v":0},180,{"$f":"SUMPRODUCT((Data!$C:$C=A74)*(Data!$B:$B=B74),(Data!$I:$I))","v":0},{"$f":"IF(SUMIFS(Data!$J:$J,Data!$C:$C,A74,Data!$B:$B,B74)<H74,H74-SUMIFS(Data!$J:$J,Data!$C:$C,A74,Data!$B:$B,B74),\"\")","v":0}]
[null,{"$f":"IFERROR(INDEX(INDIRECT(\"Data!B\"&MATCH(A75,Data!$C$2:$C$100000,0)+1&\":B100000\"),SMALL(IF((A75=INDIRECT(\"Data!C\"&MATCH(A75,Data!$C$2:$C$100000,0)+1&\":C100000\"))*(MATCH(INDIRECT(\"Data!B\"&MATCH(A75,Data!$C$2:$C$100000,0)+1&\":B100000\")&\"\",INDIRECT(\"Data!B\"&MATCH(A75,Data!$C$2:$C$100000,0)+1&\":B100000\")&\"\",0)=(ROW(INDIRECT(\"Data!B\"&MATCH(A75,Data!$C$2:$C$100000,0)+1&\":B100000\"))-MATCH(A75,Data!$C$2:$C$100000,0))),ROW(INDIRECT(\"Data!B\"&MATCH(A75,Data!$C$2:$C$100000,0)+1&\":B100000\"))-MATCH(A75,Data!$C$2:$C$100000,0),\"\"),COUNTIF($A$5:A75,A75))),\"\")","v":""},{"$f":"SUMIFS(Data!$D:$D,Data!$C:$C,A75,Data!$B:$B,B75)","v":0},{"$f":"SUMIFS(Data!$E:$E,Data!$C:$C,A75,Data!$B:$B,B75)","v":0},{"$f":"IF(AND(B75=\"Grand Aquarium\",WEEKDAY(A75)=3),40,IF(AND(B75=\"Grand Aquarium\",WEEKDAY(A75)=7),40,VLOOKUP(B75,Price!$A$6:$C$216,2,0)))","v":{"$error":"#N/A"}},{"$f":"IF(AND(B75=\"Grand Aquarium\",WEEKDAY(A75)=3),20,IF(AND(B75=\"Grand Aquarium\",WEEKDAY(A75)=7),20,VLOOKUP(B75,Price!$A$6:$C$216,3,0)))","v":{"$error":"#N/A"}},{"$f":"IF(SUMIFS(Data!$J:$J,Data!$C:$C,A75,Data!$B:$B,B75)>H75,SUMIFS(Data!$J:$J,Data!$C:$C,A75,Data!$B:$B,B75)-H75,\"\")","v":0},180,{"$f":"SUMPRODUCT((Data!$C:$C=A75)*(Data!$B:$B=B75),(Data!$I:$I))","v":0},{"$f":"IF(SUMIFS(Data!$J:$J,Data!$C:$C,A75,Data!$B:$B,B75)<H75,H75-SUMIFS(Data!$J:$J,Data!$C:$C,A75,Data!$B:$B,B75),\"\")","v":0}]
[null,{"$f":"IFERROR(INDEX(INDIRECT(\"Data!B\"&MATCH(A76,Data!$C$2:$C$100000,0)+1&\":B100000\"),SMALL(IF((A76=INDIRECT(\"Data!C\"&MATCH(A76,Data!$C$2:$C$100000,0)+1&\":C100000\"))*(MATCH(INDIRECT(\"Data!B\"&MATCH(A76,Data!$C$2:$C$100000,0)+1&\":B100000\")&\"\",INDIRECT(\"Data!B\"&MATCH(A76,Data!$C$2:$C$100000,0)+1&\":B100000\")&\"\",0)=(ROW(INDIRECT(\"Data!B\"&MATCH(A76,Data!$C$2:$C$100000,0)+1&\":B100000\"))-MATCH(A76,Data!$C$2:$C$100000,0))),ROW(INDIRECT(\"Data!B\"&MATCH(A76,Data!$C$2:$C$100000,0)+1&\":B100000\"))-MATCH(A76,Data!$C$2:$C$100000,0),\"\"),COUNTIF($A$5:A76,A76))),\"\")","v":""},{"$f":"SUMIFS(Data!$D:$D,Data!$C:$C,A76,Data!$B:$B,B76)","v":0},{"$f":"SUMIFS(Data!$E:$E,Data!$C:$C,A76,Data!$B:$B,B76)","v":0},null,null,{"$f":"IF(SUMIFS(Data!$J:$J,Data!$C:$C,A76,Data!$B:$B,B76)>H76,SUMIFS(Data!$J:$J,Data!$C:$C,A76,Data!$B:$B,B76)-H76,\"\")","v":0},180,{"$f":"SUMPRODUCT((Data!$C:$C=A76)*(Data!$B:$B=B76),(Data!$I:$I))","v":0},{"$f":"IF(SUMIFS(Data!$J:$J,Data!$C:$C,A76,Data!$B:$B,B76)<H76,H76-SUMIFS(Data!$J:$J,Data!$C:$C,A76,Data!$B:$B,B76),\"\")","v":0},{"$f":"SUM(H74:H75)","v":{"$error":"#N/A"}}]
[null,{"$f":"IFERROR(INDEX(INDIRECT(\"Data!B\"&MATCH(A77,Data!$C$2:$C$100000,0)+1&\":B100000\"),SMALL(IF((A77=INDIRECT(\"Data!C\"&MATCH(A77,Data!$C$2:$C$100000,0)+1&\":C100000\"))*(MATCH(INDIRECT(\"Data!B\"&MATCH(A77,Data!$C$2:$C$100000,0)+1&\":B100000\")&\"\",INDIRECT(\"Data!B\"&MATCH(A77,Data!$C$2:$C$100000,0)+1&\":B100000\")&\"\",0)=(ROW(INDIRECT(\"Data!B\"&MATCH(A77,Data!$C$2:$C$100000,0)+1&\":B100000\"))-MATCH(A77,Data!$C$2:$C$100000,0))),ROW(INDIRECT(\"Data!B\"&MATCH(A77,Data!$C$2:$C$100000,0)+1&\":B100000\"))-MATCH(A77,Data!$C$2:$C$100000,0),\"\"),COUNTIF($A$5:A77,A77))),\"\")","v":""},{"$f":"SUMIFS(Data!$D:$D,Data!$C:$C,A77,Data!$B:$B,B77)","v":0},{"$f":"SUMIFS(Data!$E:$E,Data!$C:$C,A77,Data!$B:$B,B77)","v":0},{"$f":"IF(AND(B77=\"Grand Aquarium\",WEEKDAY(A77)=3),40,IF(AND(B77=\"Grand Aquarium\",WEEKDAY(A77)=7),40,VLOOKUP(B77,Price!$A$6:$C$216,2,0)))","v":{"$error":"#N/A"}},{"$f":"IF(AND(B77=\"Grand Aquarium\",WEEKDAY(A77)=3),20,IF(AND(B77=\"Grand Aquarium\",WEEKDAY(A77)=7),20,VLOOKUP(B77,Price!$A$6:$C$216,3,0)))","v":{"$error":"#N/A"}},{"$f":"IF(SUMIFS(Data!$J:$J,Data!$C:$C,A77,Data!$B:$B,B77)>H77,SUMIFS(Data!$J:$J,Data!$C:$C,A77,Data!$B:$B,B77)-H77,\"\")","v":0},180,{"$f":"SUMPRODUCT((Data!$C:$C=A77)*(Data!$B:$B=B77),(Data!$I:$I))","v":0},{"$f":"IF(SUMIFS(Data!$J:$J,Data!$C:$C,A77,Data!$B:$B,B77)<H77,H77-SUMIFS(Data!$J:$J,Data!$C:$C,A77,Data!$B:$B,B77),\"\")","v":0}]
[null,{"$f":"IFERROR(INDEX(INDIRECT(\"Data!B\"&MATCH(A78,Data!$C$2:$C$100000,0)+1&\":B100000\"),SMALL(IF((A78=INDIRECT(\"Data!C\"&MATCH(A78,Data!$C$2:$C$100000,0)+1&\":C100000\"))*(MATCH(INDIRECT(\"Data!B\"&MATCH(A78,Data!$C$2:$C$100000,0)+1&\":B100000\")&\"\",INDIRECT(\"Data!B\"&MATCH(A78,Data!$C$2:$C$100000,0)+1&\":B100000\")&\"\",0)=(ROW(INDIRECT(\"Data!B\"&MATCH(A78,Data!$C$2:$C$100000,0)+1&\":B100000\"))-MATCH(A78,Data!$C$2:$C$100000,0))),ROW(INDIRECT(\"Data!B\"&MATCH(A78,Data!$C$2:$C$100000,0)+1&\":B100000\"))-MATCH(A78,Data!$C$2:$C$100000,0),\"\"),COUNTIF($A$5:A78,A78))),\"\")","v":""},{"$f":"SUMIFS(Data!$D:$D,Data!$C:$C,A78,Data!$B:$B,B78)","v":0},{"$f":"SUMIFS(Data!$E:$E,Data!$C:$C,A78,Data!$B:$B,B78)","v":0},{"$f":"IF(AND(B78=\"Grand Aquarium\",WEEKDAY(A78)=3),40,IF(AND(B78=\"Grand Aquarium\",WEEKDAY(A78)=7),40,VLOOKUP(B78,Price!$A$6:$C$216,2,0)))","v":{"$error":"#N/A"}},{"$f":"IF(AND(B78=\"Grand Aquarium\",WEEKDAY(A78)=3),20,IF(AND(B78=\"Grand Aquarium\",WEEKDAY(A78)=7),20,VLOOKUP(B78,Price!$A$6:$C$216,3,0)))","v":{"$error":"#N/A"}},{"$f":"IF(SUMIFS(Data!$J:$J,Data!$C:$C,A78,Data!$B:$B,B78)>H78,SUMIFS(Data!$J:$J,Data!$C:$C,A78,Data!$B:$B,B78)-H78,\"\")","v":0},180,{"$f":"SUMPRODUCT((Data!$C:$C=A78)*(Data!$B:$B=B78),(Data!$I:$I))","v":0},{"$f":"IF(SUMIFS(Data!$J:$J,Data!$C:$C,A78,Data!$B:$B,B78)<H78,H78-SUMIFS(Data!$J:$J,Data!$C:$C,A78,Data!$B:$B,B78),\"\")","v":0}]
[null,{"$f":"IFERROR(INDEX(INDIRECT(\"Data!B\"&MATCH(A79,Data!$C$2:$C$100000,0)+1&\":B100000\"),SMALL(IF((A79=INDIRECT(\"Data!C\"&MATCH(A79,Data!$C$2:$C$100000,0)+1&\":C100000\"))*(MATCH(INDIRECT(\"Data!B\"&MATCH(A79,Data!$C$2:$C$100000,0)+1&\":B100000\")&\"\",INDIRECT(\"Data!B\"&MATCH(A79,Data!$C$2:$C$100000,0)+1&\":B100000\")&\"\",0)=(ROW(INDIRECT(\"Data!B\"&MATCH(A79,Data!$C$2:$C$100000,0)+1&\":B100000\"))-MATCH(A79,Data!$C$2:$C$100000,0))),ROW(INDIRECT(\"Data!B\"&MATCH(A79,Data!$C$2:$C$100000,0)+1&\":B100000\"))-MATCH(A79,Data!$C$2:$C$100000,0),\"\"),COUNTIF($A$5:A79,A79))),\"\")","v":""},{"$f":"SUMIFS(Data!$D:$D,Data!$C:$C,A79,Data!$B:$B,B79)","v":0},{"$f":"SUMIFS(Data!$E:$E,Data!$C:$C,A79,Data!$B:$B,B79)","v":0},{"$f":"IF(AND(B79=\"Grand Aquarium\",WEEKDAY(A79)=3),40,IF(AND(B79=\"Grand Aquarium\",WEEKDAY(A79)=7),40,VLOOKUP(B79,Price!$A$6:$C$216,2,0)))","v":{"$error":"#N/A"}},{"$f":"IF(AND(B79=\"Grand Aquarium\",WEEKDAY(A79)=3),20,IF(AND(B79=\"Grand Aquarium\",WEEKDAY(A79)=7),20,VLOOKUP(B79,Price!$A$6:$C$216,3,0)))","v":{"$error":"#N/A"}},{"$f":"IF(SUMIFS(Data!$J:$J,Data!$C:$C,A79,Data!$B:$B,B79)>H79,SUMIFS(Data!$J:$J,Data!$C:$C,A79,Data!$B:$B,B79)-H79,\"\")","v":0},180,{"$f":"SUMPRODUCT((Data!$C:$C=A79)*(Data!$B:$B=B79),(Data!$I:$I))","v":0},{"$f":"IF(SUMIFS(Data!$J:$J,Data!$C:$C,A79,Data!$B:$B,B79)<H79,H79-SUMIFS(Data!$J:$J,Data!$C:$C,A79,Data!$B:$B,B79),\"\")","v":0}]
[null,{"$f":"IFERROR(INDEX(INDIRECT(\"Data!B\"&MATCH(A80,Data!$C$2:$C$100000,0)+1&\":B100000\"),SMALL(IF((A80=INDIRECT(\"Data!C\"&MATCH(A80,Data!$C$2:$C$100000,0)+1&\":C100000\"))*(MATCH(INDIRECT(\"Data!B\"&MATCH(A80,Data!$C$2:$C$100000,0)+1&\":B100000\")&\"\",INDIRECT(\"Data!B\"&MATCH(A80,Data!$C$2:$C$100000,0)+1&\":B100000\")&\"\",0)=(ROW(INDIRECT(\"Data!B\"&MATCH(A80,Data!$C$2:$C$100000,0)+1&\":B100000\"))-MATCH(A80,Data!$C$2:$C$100000,0))),ROW(INDIRECT(\"Data!B\"&MATCH(A80,Data!$C$2:$C$100000,0)+1&\":B100000\"))-MATCH(A80,Data!$C$2:$C$100000,0),\"\"),COUNTIF($A$5:A80,A80))),\"\")","v":""},{"$f":"SUMIFS(Data!$D:$D,Data!$C:$C,A80,Data!$B:$B,B80)","v":0},{"$f":"SUMIFS(Data!$E:$E,Data!$C:$C,A80,Data!$B:$B,B80)","v":0},{"$f":"IF(AND(B80=\"Grand Aquarium\",WEEKDAY(A80)=3),40,IF(AND(B80=\"Grand Aquarium\",WEEKDAY(A80)=7),40,VLOOKUP(B80,Price!$A$6:$C$216,2,0)))","v":{"$error":"#N/A"}},{"$f":"IF(AND(B80=\"Grand Aquarium\",WEEKDAY(A80)=3),20,IF(AND(B80=\"Grand Aquarium\",WEEKDAY(A80)=7),20,VLOOKUP(B80,Price!$A$6:$C$216,3,0)))","v":{"$error":"#N/A"}},{"$f":"IF(SUMIFS(Data!$J:$J,Data!$C:$C,A80,Data!$B:$B,B80)>H80,SUMIFS(Data!$J:$J,Data!$C:$C,A80,Data!$B:$B,B80)-H80,\"\")","v":0},180,{"$f":"SUMPRODUCT((Data!$C:$C=A80)*(Data!$B:$B=B80),(Data!$I:$I))","v":0},{"$f":"IF(SUMIFS(Data!$J:$J,Data!$C:$C,A80,Data!$B:$B,B80)<H80,H80-SUMIFS(Data!$J:$J,Data!$C:$C,A80,Data!$B:$B,B80),\"\")","v":0}]
[null,{"$f":"IFERROR(INDEX(INDIRECT(\"Data!B\"&MATCH(A81,Data!$C$2:$C$188,0)+1&\":B188\"),SMALL(IF((A81=INDIRECT(\"Data!C\"&MATCH(A81,Data!$C$2:$C$188,0)+1&\":C188\"))*(MATCH(INDIRECT(\"Data!B\"&MATCH(A81,Data!$C$2:$C$188,0)+1&\":B188\")&\"\",INDIRECT(\"Data!B\"&MATCH(A81,Data!$C$2:$C$188,0)+1&\":B188\")&\"\",0)=(ROW(INDIRECT(\"Data!B\"&MATCH(A81,Data!$C$2:$C$188,0)+1&\":B188\"))-MATCH(A81,Data!$C$2:$C$188,0))),ROW(INDIRECT(\"Data!B\"&MATCH(A81,Data!$C$2:$C$188,0)+1&\":B188\"))-MATCH(A81,Data!$C$2:$C$188,0),\"\"),COUNTIF($A$5:A81,A81))),\"\")","v":""},null,null,null,null,null,null,null,null,{"$f":"SUM(H77:H80)","v":{"$error":"#N/A"}}]
[null,{"$f":"IFERROR(INDEX(INDIRECT(\"Data!B\"&MATCH(A82,Data!$C$2:$C$188,0)+1&\":B188\"),SMALL(IF((A82=INDIRECT(\"Data!C\"&MATCH(A82,Data!$C$2:$C$188,0)+1&\":C188\"))*(MATCH(INDIRECT(\"Data!B\"&MATCH(A82,Data!$C$2:$C$188,0)+1&\":B188\")&\"\",INDIRECT(\"Data!B\"&MATCH(A82,Data!$C$2:$C$188,0)+1&\":B188\")&\"\",0)=(ROW(INDIRECT(\"Data!B\"&MATCH(A82,Data!$C$2:$C$188,0)+1&\":B188\"))-MATCH(A82,Data!$C$2:$C$188,0))),ROW(INDIRECT(\"Data!B\"&MATCH(A82,Data!$C$2:$C$188,0)+1&\":B188\"))-MATCH(A82,Data!$C$2:$C$188,0),\"\"),COUNTIF($A$5:A82,A82))),\"\")","v":""},null,null,null,{"$f":"25627-174","v":25453},null,{"$f":"SUM(H5:H81)","v":{"$error":"#N/A"}},{"$f":"SUM(I5:I81)","v":164},{"$f":"SUM(J5:J81)","v":491},{"$f":"SUM(K8+K12+K14+K18+K21+K24+K31+K35+K37+K40+K46+K48+K52+K59+K62+K64+K66+K68+K71+K73+K76+K81)-J82","v":{"$error":"#N/A"}}]

{"sheet":"Sheet2","index":3,"n_rows":18,"n_cols":3,"rows_kept":18,"cut":false,"hidden":true,"merged":[]}
[null,"Excursion"]
[null,"ASPENDOS TURKISH BATH"]
[null,"CAIRO BY PLANE"]
[null,"CAIRO OVERDAY","Cairo"]
[null,"DOLPHIN WORLD SHOW","Dolphin world show"]
[null,"GRAND AQUARIUM","Grand Aquarium"]
[null,"INTRO DIVING","Diving"]
[null,"JUNGLE AQUAPARK","Jungle Aqua Park"]
[null,"MOTO 1 HOUR","Moto 1 Hour"]
[null,"MOTO2","Moto 2"]
[null,"OVER DAY LUXORQUEEN VALLY","LUXOR 2"]
[null,"PARASAILING TRIP"]
[null,"PRIVATE BOAT FISHING","Private Boat Fishing"]
[null,"RUSALKA  ( MERMAID )","Rusalka (Mermaid)"]
[null,"SEA TRIP","Sea Trip"]
[null,"SNORKELING ON DIVING BOAT","Snorkling"]
[null,"SUBMARINE","Submarine"]
[null,"UTOPIA ISLAND","Utopia"]

{"sheet":"Sources","index":4,"n_rows":168,"n_cols":9,"rows_kept":168,"cut":false,"hidden":true,"merged":[]}
[]
[null,"OVER DAY LUXOR","MAKADI BAY","RUSALKA -PACKAGE 13","SAFAGA","CAIRO- PACKAGE 1","EL GOUNA","MOTO2","CAIRO- PACKAGE 1"]
[null," LUXORQUEEN VALLY - PACKAGE 23","SAFAGA","RUSALKA -PACKAGE 16","SOMA BAY","CAIRO- PACKAGE 20",null,"OVER DAY LUXOR","CAIRO- PACKAGE 20"]
[null," LUXORQUEEN VALLY - PACKAGE 24","SOMA BAY","RUSALKA -PACKAGE 6",null,"CAIRO- PACKAGE 21",null," LUXORQUEEN VALLY - PACKAGE 23","CAIRO- PACKAGE 21"]
[null," LUXORQUEEN VALLY - PACKAGE 25",null,"RUSALKA -PACKAGE 9",null,"CAIRO- PACKAGE 22",null," LUXORQUEEN VALLY - PACKAGE 24","CAIRO- PACKAGE 22"]
[null," LUXORQUEEN VALLY - PACKAGE 30",null,"RUSALKA  ( MERMAID )",null,"CAIRO- PACKAGE 24",null," LUXORQUEEN VALLY - PACKAGE 25","CAIRO- PACKAGE 24"]
[null," LUXORQUEEN VALLY - PACKAGE 31",null,"RUSALKA -PACKAGE 3",null,"CAIRO- PACKAGE 26",null," LUXORQUEEN VALLY - PACKAGE 30","CAIRO- PACKAGE 26"]
[null," LUXORQUEEN VALLY - PACKAGE 32",null,null,null,"CAIRO - PACKAGE 33",null," LUXORQUEEN VALLY - PACKAGE 31","CAIRO - PACKAGE 33"]
[null," LUXORQUEEN VALLY - PACKAGE 33",null,null,null,"CAIRO - PACKAGE 34",null," LUXORQUEEN VALLY - PACKAGE 32","CAIRO - PACKAGE 34"]
[null," LUXORQUEEN VALLY - PACKAGE 36",null,null,null,"CAIRO - PACKAGE 35",null," LUXORQUEEN VALLY - PACKAGE 33","CAIRO - PACKAGE 35"]
[null," LUXORQUEEN VALLY - PACKAGE 5",null,null,null,"El GOUNA TRIP- PACKAGE 28",null," LUXORQUEEN VALLY - PACKAGE 36","El GOUNA TRIP- PACKAGE 28"]
[null,"BIO SHOP (OIL PARFUM)",null,null,null,"CAIRO OVERDAY",null," LUXORQUEEN VALLY - PACKAGE 5","CAIRO OVERDAY"]
[null,"COMBINE SHOP GROUP- SOUTH",null,null,null,"CAIRO/ALEX 2 Night",null,"1001 SHOW","CAIRO/ALEX 2 Night"]
[null,"COMBINE SHOP GROUP - NORTH",null,null,null,"EL GOUNA TRIP",null,"ASWAN OVER DAY -PACKAGE 1","EL GOUNA TRIP"]
[null,"COMBINE, MODA SHOW& COTTON FLOWER SHOP",null,null,null,"INDIVIDUAL CAIRO ALEX",null,"CITY TOUR+SAND CITY","INDIVIDUAL CAIRO ALEX"]
[null,"DANDARA-PACKAGE 2",null,null,null,"INDIVIDUAL CAIRO OVER DAY",null,"DANDARA-PACKAGE 2","INDIVIDUAL CAIRO OVER DAY"]
[null,"DOLPHIN WORLD SHOW - PACKAGE 3",null,null,null,"INDIVIDUAL EL GOUNA",null,"DIVING- PACKAGE 25","INDIVIDUAL EL GOUNA"]
[null,"LUXOR DANDARA BY CRUISE ON NILE",null,null,null,"INDIVIDUAL ST.POUL& ANTOY",null,"DIVING- PACKAGE 26","INDIVIDUAL ST.POUL& ANTOY"]
[null,"MODA SHOW",null,null,null,"RUSALKA -PACKAGE 3",null,"DIVING-PACKAGE 20","RUSALKA -PACKAGE 3"]
[null,"ROMANCE UTOPIA",null,null,null,"RUSALKA -PACKAGE 13",null,"DOLPHIN HOUSE- PACKAGE 29","RUSALKA -PACKAGE 13"]
[null,"RUSALKA -PACKAGE 3",null,null,null,"RUSALKA -PACKAGE 16",null,"DOLPHIN HOUSE","RUSALKA -PACKAGE 16"]
[null,"TEXTILE ,AUTEX & COTTON FLOWER& BIO SHOP",null,null,null,"RUSALKA -PACKAGE 6",null,"DOLPHIN SWIMMING ( DOLPHINA )","RUSALKA -PACKAGE 6"]
[null,"UTOPIA ISLAND- PACKAGE 22",null,null,null,"RUSALKA -PACKAGE 9",null,"DOLPHIN WORLD SHOW - PACKAGE 3","RUSALKA -PACKAGE 9"]
[null,"UTOPIA ISLAND- PACKAGE 27",null,null,null,"RUSALKA  ( MERMAID )",null,"DREAM ISLAND","RUSALKA  ( MERMAID )"]
[null,"UTOPIA ISLAND- PACKAGE 30",null,null,null,"ST. POUL&ST.ANTONY",null,"ELITE VIP SEA TRIP","ST. POUL&ST.ANTONY"]
[null,"UTOPIA ISLAND - PACKAGE 35",null,null,null,"ST. POUL&ST.ANTONY PKG 8",null,"GRAND AQUARIUM","ST. POUL&ST.ANTONY PKG 8"]
[null," LUXORQUEEN VALLY - PACKAGE 12",null,null,null,"ST. POUL&ST.ANTONY PKG 9",null,"GRAND AQUARIUM+DOLPHIN SHOW","ST. POUL&ST.ANTONY PKG 9"]
[null," LUXORQUEEN VALLY - PACKAGE 7",null,null,null,"CAIRO WITHOUT MUSEUM",null,"GRAND AQUARIUM+JUNGLE AQUA PARK"]
[null,"ASWAN - ABU SIMPLE O/N 3***",null,null,null,null,null,"GRAND AQUARIUM+SAND MUSEUM+DOLPHIN SHOW"]
[null,"DOLPHIN SWIMMING ( DOLPHINA )",null,null,null,null,null,"GRAND AQUARIUM+SAND MUSEUM+JUNGLE AQUAPARK"]
[null,"COTTON FLOWER SHOP",null,null,null,null,null,"INDIVIDUAL SUPER SCUBA"]
[null,"DANDARA-ABYDOS",null,null,null,null,null,"JUNGLE AQUAPARK"]
[null,"DANDARA-PACKAGE 10",null,null,null,null,null,"LUXOR DANDARA BY CRUISE ON NILE"]
[null,"DANDARA-PACKAGE 15",null,null,null,null,null,"MOTO 1 HOUR - PACKAGE 36"]
[null,"DANDARA-PACKAGE 6",null,null,null,null,null,"MOTO 1 HOUR"]
[null,"DANDARA",null,null,null,null,null,"MOTO 2- PACKAGE 21"]
[null,"DANDARA DELUXE",null,null,null,null,null,"MOTO 2- PACKAGE 23"]
[null,"DOLPHIN SWIMMING",null,null,null,null,null,"MOTO 2- PACKAGE 25"]
[null,"DOLPHIN THERAPY ",null,null,null,null,null,"MOTO 2- PACKAGE 26"]
[null,"DOLPHIN WORLD SHOW",null,null,null,null,null,"MOTO 2- PACKAGE 27"]
[null,"EXTRA MASSAGE",null,null,null,null,null,"MOTO 2- PACKAGE 28"]
[null,"OVER DAY LUXORQUEEN VALLY",null,null,null,null,null,"MOTO 2- PACKAGE 29"]
[null,"ROYAL UTOPIA",null,null,null,null,null,"MOTO 2 - PACKAGE 31"]
[null,"RUSALKA -PACKAGE 13",null,null,null,null,null,"MOTO 2 - PACKAGE 34"]
[null,"RUSALKA -PACKAGE 16",null,null,null,null,null,"MOTO SUN RISE"]
[null,"RUSALKA -PACKAGE 6",null,null,null,null,null,"MYSTERY ROYAL OASIS+SAND CITY"]
[null,"RUSALKA -PACKAGE 9",null,null,null,null,null,"QUAD SAFARI"]
[null,"RUSALKA  ( MERMAID )",null,null,null,null,null,"ROMANCE UTOPIA"]
[null,"UTOPIA ISLAND",null,null,null,null,null,"SCUBA TRIP"]
[null,"VIP LUXOR",null,null,null,null,null,"SEA TRIP- PACKAGE 1"]
[null,"ASWAN - ABU SIMPLE O/N 4****",null,null,null,null,null,"SEA TRIP- PACKAGE 2"]
[null,null,null,null,null,null,null,"SEA TRIP- PACKAGE 4"]
[null,null,null,null,null,null,null,"SEA TRIP- PACKAGE 5"]
[null,null,null,null,null,null,null,"SEA TRIP - PACKAGE 32"]
[null,null,null,null,null,null,null,"SUBMARINE+TITANIC AQUA PARK"]
[null,null,null,null,null,null,null,"SUPER BADAWIA-PACKAGE 4"]
[null,null,null,null,null,null,null,"SUPER BADAWIA -PACKAGE 1"]
[null,null,null,null,null,null,null,"SUPER BADAWIA -PACKAGE 2"]
[null,null,null,null,null,null,null,"UTOPIA ISLAND- PACKAGE 22"]
[null,null,null,null,null,null,null,"UTOPIA ISLAND- PACKAGE 27"]
[null,null,null,null,null,null,null,"UTOPIA ISLAND- PACKAGE 30"]
[null,null,null,null,null,null,null,"UTOPIA ISLAND - PACKAGE 35"]
[null,null,null,null,null,null,null," LUXORQUEEN VALLY - PACKAGE 12"]
[null,null,null,null,null,null,null," LUXORQUEEN VALLY - PACKAGE 2"]
[null,null,null,null,null,null,null," LUXORQUEEN VALLY - PACKAGE 3"]
[null,null,null,null,null,null,null," LUXORQUEEN VALLY - PACKAGE 7"]
[null,null,null,null,null,null,null,"1001 SHOW PKG 12"]
[null,null,null,null,null,null,null,"1001 SHOW PKG 14"]
[null,null,null,null,null,null,null,"1001 SHOW PKG 6"]
[null,null,null,null,null,null,null,"1001 SHOW PKG 8"]
[null,null,null,null,null,null,null,"ADVANCED COURSE "]
[null,null,null,null,null,null,null,"ASPENDOS TURKISH BATH"]
[null,null,null,null,null,null,null,"ASWAN - ABU SIMPLE O/N 3***"]
[null,null,null,null,null,null,null,"ASWAN  OVER DAY "]
[null,null,null,null,null,null,null,"ASWAN ABU SIMBLE- PACKAGE 6"]
[null,null,null,null,null,null,null,"BADAWIA "]
[null,null,null,null,null,null,null,"BLUE AQUARIUM"]
[null,null,null,null,null,null,null,"CAIRO BY PLANE"]
[null,null,null,null,null,null,null,"CITY TOUR"]
[null,null,null,null,null,null,null,"CITY TOUR WITH AQUARIUM"]
[null,null,null,null,null,null,null,"DANDARA- PACKAGE 7"]
[null,null,null,null,null,null,null,"DANDARA- PACKAGE 8"]
[null,null,null,null,null,null,null,"DANDARA-ABYDOS"]
[null,null,null,null,null,null,null,"DANDARA-PACKAGE 10"]
[null,null,null,null,null,null,null,"DANDARA-PACKAGE 15"]
[null,null,null,null,null,null,null,"DANDARA-PACKAGE 6"]
[null,null,null,null,null,null,null,"DANDARA"]
[null,null,null,null,null,null,null,"DANDARA DELUXE"]
[null,null,null,null,null,null,null,"DIVING - PACKAGE 9"]
[null,null,null,null,null,null,null,"DIVING FROM THE BEACH "]
[null,null,null,null,null,null,null,"DOLPHIN SHOW+ SAND MUSEUM"]
[null,null,null,null,null,null,null,"DOLPHIN SWIMMING"]
[null,null,null,null,null,null,null,"DOLPHIN THERAPY "]
[null,null,null,null,null,null,null,"DOLPHIN WORLD SHOW"]
[null,null,null,null,null,null,null,"FAST TRACK"]
[null,null,null,null,null,null,null,"INDIVIDUAL  CAIRO BY PLANE"]
[null,null,null,null,null,null,null,"INDIVIDUAL  ORANGE BAY"]
[null,null,null,null,null,null,null,"INDIVIDUAL ASWAN OVER DAY"]
[null,null,null,null,null,null,null,"INDIVIDUAL BADAWIA"]
[null,null,null,null,null,null,null,"INDIVIDUAL CITY TOUR"]
[null,null,null,null,null,null,null,"INDIVIDUAL DANDARA"]
[null,null,null,null,null,null,null,"INDIVIDUAL LUXOR"]
[null,null,null,null,null,null,null,"INDIVIDUAL MOTO 2"]
[null,null,null,null,null,null,null,"INDIVIDUAL MOTO2  DBL"]
[null,null,null,null,null,null,null,"INDIVIDUAL MOTO2 SGL"]
[null,null,null,null,null,null,null,"INDIVIDUAL PARADISE "]
[null,null,null,null,null,null,null,"INDIVIDUAL SUPER BADAWIA"]
[null,null,null,null,null,null,null,"INDIVIDUAL SUPER SAFARI"]
[null,null,null,null,null,null,null,"INDIVIDUAL TRANSFER"]
[null,null,null,null,null,null,null,"INDIVIDUAL UTOPIA "]
[null,null,null,null,null,null,null,"INTRO DIVING"]
[null,null,null,null,null,null,null,"JERUSALEM"]
[null,null,null,null,null,null,null,"M2.SUNSET"]
[null,null,null,null,null,null,null,"MOTO 2 - PACKAGE 10"]
[null,null,null,null,null,null,null,"MOTO 2 - PACKAGE 11"]
[null,null,null,null,null,null,null,"MOTO 2 - PACKAGE 13"]
[null,null,null,null,null,null,null,"MOTO 2 - PACKAGE 15"]
[null,null,null,null,null,null,null,"MOTO 2 - PACKAGE 2"]
[null,null,null,null,null,null,null,"MOTO 2 - PACKAGE 7"]
[null,null,null,null,null,null,null,"MOTO 2 - PACKAGE 8"]
[null,null,null,null,null,null,null,"MOTO2-MARSAALAM"]
[null,null,null,null,null,null,null,"MOTO2 + SAND CITY"]
[null,null,null,null,null,null,null,"MOTO5 +SAND CITY"]
[null,null,null,null,null,null,null,"MYSTERY  ROYAL  OASIS"]
[null,null,null,null,null,null,null,"NATULIUS"]
[null,null,null,null,null,null,null,"NATULIUS + SAND MUSEUM "]
[null,null,null,null,null,null,null,"NILE CRUISE  "]
[null,null,null,null,null,null,null,"OPEN WATER COURSE"]
[null,null,null,null,null,null,null,"OPENAIR SAND MUSEUM "]
[null,null,null,null,null,null,null,"OVER DAY LUXORQUEEN VALLY"]
[null,null,null,null,null,null,null,"PARADISE"]
[null,null,null,null,null,null,null,"PARASAILING TRIP"]
[null,null,null,null,null,null,null,"PRIVATE ASWAN -SIMBLE O.N"]
[null,null,null,null,null,null,null,"PRIVATE BOAT DIVING"]
[null,null,null,null,null,null,null,"PRIVATE BOAT FISHING"]
[null,null,null,null,null,null,null,"PRIVATE SULTAN SELECT"]
[null,null,null,null,null,null,null,"PROFESSIONAL FISHING "]
[null,null,null,null,null,null,null,"ROMANTIC SUNSET SEA TRIP"]
[null,null,null,null,null,null,null,"ROYAL DOLPHIN SEA TRIP"]
[null,null,null,null,null,null,null,"ROYAL UTOPIA"]
[null,null,null,null,null,null,null,"RUSSIAN FISHING"]
[null,null,null,null,null,null,null,"SALING BOAT"]
[null,null,null,null,null,null,null,"SEA SCOPE- PACKAGE 4"]
[null,null,null,null,null,null,null,"SEA SCOPE"]
[null,null,null,null,null,null,null,"SEA TRIP"]
[null,null,null,null,null,null,null,"SEA TRIP+SAND MUSEUM"]
[null,null,null,null,null,null,null,"SINDBAD AQUA PARK "]
[null,null,null,null,null,null,null,"SNORKELING ON DIVING BOAT"]
[null,null,null,null,null,null,null,"SUBMARINE"]
[null,null,null,null,null,null,null,"SUBMARINE+ SINDBAD AQUA PARK"]
[null,null,null,null,null,null,null,"SULTAN 1 TURKISH PKG 7"]
[null,null,null,null,null,null,null,"SULTAN TURKISH BATH"]
[null,null,null,null,null,null,null,"SULTAN1 TURKISH PKG 10"]
[null,null,null,null,null,null,null,"SULTAN1 TURKISH PKG 11"]
[null,null,null,null,null,null,null,"SULTAN1 TURKISH PKG 14"]
[null,null,null,null,null,null,null,"SULTAN1 TURKISH PKG 9"]
[null,null,null,null,null,null,null,"SUNNY ORANGE BAY"]
[null,null,null,null,null,null,null,"SUPER BADAWIA"]
[null,null,null,null,null,null,null,"SUPER SAFARI"]
[null,null,null,null,null,null,null,"SUPER SCUBA"]
[null,null,null,null,null,null,null,"TITANIC AQUA PARK"]
[null,null,null,null,null,null,null,"TITANIC AQUA PARK PKG 16"]
[null,null,null,null,null,null,null,"UTOPIA ISLAND"]
[null,null,null,null,null,null,null,"UTOPIA ISLAND+SAND MUSEUM"]
[null,null,null,null,null,null,null,"VIP LUXOR"]
[null,null,null,null,null,null,null,"VIP SEA TRIP"]
[null,null,null,null,null,null,null,"ASWAN - ABU SIMPLE O/N"]
[null,null,null,null,null,null,null,"ASWAN - ABU SIMPLE O/N 4****"]