{"text_format":"1","workbook":"xlsx","n_sheets":4,"sheets":["بنين","طباعة قوائم الفصول","سجل درجات","غياب1-1"],"not_rendered":{"charts":0,"images":0,"macros":1,"external_links":0,"defined_names":12,"comments":3,"pivot_tables":0},"unopened":[],"bounds":{"document_bytes":16777216,"sheet_cells":100000,"rows_first":2000,"rows_last":500,"rows_between":2000,"halvings":0,"cell_chars":16384,"cell_head_chars":4096},"cells_cut":0,"cells_raw":0,"read":"whole","date_system":"1900"}

{"sheet":"بنين","index":0,"n_rows":2664,"n_cols":20,"rows_kept":2664,"cut":false,"hidden":false,"merged":[[7,1,7,6],[4,8,4,9],[1,2,3,6]]}
[]
[null,null,"يرجى التأكد من صحة البيانات وعدم ترك خليه فارغة خصوصا عمود الجنس لأنه مبني عليه الأبجده والترتيب ( البنين ثم البنات ) يمكن كتابة الصفوف الثلاثة في هذا الجدول ويقوم البرنامج بالفرز تلقائيا"]
[]
[null,null,null,null,null,null,null,null,null,null,null,null,null,null,null,null,"الاول"]
[null,null,null,null,null,null,"الصف","الاول","الاعدادي",null,null,null,null,null,null,null,"الثاني"]
[null,null,null,null,null,null,null,null,null,null,null,null,null,null,null,null,"الثالث","مستجد","ذكر ","مسلم"]
[null,null,null,null,null,null,null,null,null,null,null,null,null,null,null,null,null,"معيد","انثى","مسيحي"]
[null,"بنـــــــــــــــــــــين وبنات",null,null,null,null,null,null,null,null,null,null,null,null,null,null,null,"مستجدة",null,"مسلمه"]
[null,"م","الاســـــــم","الفصل"," القيد","الجنس","الديانة",null,null,null,null,null,null,null,null,null,null,"معيدة",null,"مسيحيه"]
[null,{"$f":"IF(C10=\"\",\"\",ROW()-9)","v":1},"ابراهيم ابراهيم على ابراهيم البدحى","1\\1","مستجد","ذكر ","مسلم",{"$f":"IF(F10=$S$6,\"1\",IF(F10=$S$7,\"2\",\"\"))","v":"1"}]
{"$rows_left_out":2655}
{"sheet":"طباعة قوائم الفصول","index":1,"n_rows":295,"n_cols":20,"rows_kept":295,"cut":false,"hidden":false,"merged":[[7,2,7,5],[5,8,5,9],[4,0,4,1],[5,0,5,1],[6,0,6,1]]}
[]
[]
[null,null,null,null,null,null,null,null,null,null,null,null,null,null,null,null,null,"مستجد","ذكر ","مسلم"]
[null,null,null,null,null,null,null,null,null,null,null,null,null,null,null,null,null,"معيد","انثى","مسيحي"]
["مديرية التربية والتعليم بطنطا",null,null,null,null,null,null,null,null,null,null,null,null,null,null,null,"الاول","مستجدة",null,"مسلمه"]
["إدارة شرق المحلة التعليمية",null,null,null,null,null,"الصف","الثاني","الاعدادي",null,null,null,null,null,null,null,"الثاني","معيدة",null,"مسيحيه"]
["مدرسة ميت السراج الاعدادية المشتركة",null,null,null,null,null,null,null,null,null,null,null,null,null,null,null,"الثالث"]
[null,null,"قائمـــة فصـــل ",null,null,null,"2\\1"]
["م","الاســـــــم"," القيد","الجنس","الديانة","م","الاســـــــم"," القيد","الجنس","الديانة"]
[{"$f":"IF(B10=\"\",\"\",ROW()-9)","v":1},{"$f":"IFERROR(INDEX(بنين!$C$10:$C$512,SMALL(IF(بنين!$D$10:$D$512=$G$8,IF(بنين!$F$10:$F$512=$S$3,ROW($D$10:$D$512)-ROW($D$10)+1)),ROWS($B$10:B10))),\"\")","v":"ابراهيم عبدالرازق ابراهيم فرحات"},{"$f":"IFERROR(INDEX(بنين!$E$10:$E$512,SMALL(IF(بنين!$D$10:$D$512=$G$8,IF(بنين!$F$10:$F$512=$S$3,ROW($D$10:$D$512)-ROW($D$10)+1)),ROWS($B$10:C10))),\"\")","v":"معيد"},{"$f":"IFERROR(INDEX(بنين!$F$10:$F$512,SMALL(IF(بنين!$D$10:$D$512=$G$8,IF(بنين!$F$10:$F$512=$S$3,ROW($D$10:$D$512)-ROW($D$10)+1)),ROWS($B$10:D10))),\"\")","v":"ذكر "},{"$f":"IFERROR(INDEX(بنين!$G$10:$G$512,SMALL(IF(بنين!$D$10:$D$512=$G$8,IF(بنين!$F$10:$F$512=$S$3,ROW($D$10:$D$512)-ROW($D$10)+1)),ROWS($B$10:E10))),\"\")","v":"مسلم"},{"$f":"IF(G10=\"\",\"\",COUNT($A$10:$A$126)+ROW()-9)","v":29},{"$f":"IFERROR(INDEX(بنين!$C$10:$C$512,SMALL(IF(بنين!$D$10:$D$512=$G$8,IF(بنين!$F$10:$F$512=$S$4,ROW($D$10:$D$512)-ROW($D$10)+1)),ROWS($B$10:G10))),\"\")","v":"احلام محمد اليمانى الششتاوى"},{"$f":"IFERROR(INDEX(بنين!$E$10:$E$512,SMALL(IF(بنين!$D$10:$D$512=$G$8,IF(بنين!$F$10:$F$512=$S$4,ROW($D$10:$D$512)-ROW($D$10)+1)),ROWS($B$10:H10))),\"\")","v":"مستجدة"},{"$f":"IFERROR(INDEX(بنين!$F$10:$F$512,SMALL(IF(بنين!$D$10:$D$512=$G$8,IF(بنين!$F$10:$F$512=$S$4,ROW($D$10:$D$512)-ROW($D$10)+1)),ROWS($B$10:I10))),\"\")","v":"انثى"},{"$f":"IFERROR(INDEX(بنين!$G$10:$G$512,SMALL(IF(بنين!$D$10:$D$512=$G$8,IF(بنين!$F$10:$F$512=$S$4,ROW($D$10:$D$512)-ROW($D$10)+1)),ROWS($B$10:J10))),\"\")","v":"مسلمه"},null,null,null,null,{"$f":"ROW()-9","v":1}]
{"$rows_left_out":286}
{"sheet":"سجل درجات","index":2,"n_rows":322,"n_cols":22,"rows_kept":322,"cut":false,"hidden":false,"merged":[[4,0,4,1],[5,0,5,1],[6,0,6,1],[8,13,9,13],[8,12,9,12],[8,11,9,11],[5,7,5,8],[7,6,7,7],[8,0,9,0],[8,1,9,1],[8,2,8,4],[8,5,8,7],[8,8,8,10],[7,2,7,5]]}
[]
[]
[null,null,null,null,null,null,null,null,null,null,null,null,null,null,null,null,null,null,null,"مستجد","ذكر ","مسلم"]
[null,null,null,null,null,null,null,null,null,null,null,null,null,null,null,null,null,null,null,"معيد","انثى","مسيحي"]
["مديرية التربية والتعليم بطنطا",null,null,null,null,null,null,null,null,null,null,null,null,null,null,null,null,null,"الاول","مستجدة",null,"مسلمه"]
["إدارة شرق المحلة التعليمية",null,null,null,null,null,"الصف","الاول",null,"الاعدادي",null,null,null,null,null,null,null,null,"الثاني","معيدة",null,"مسيحيه"]
["مدرسة ميت السراج الاعدادية المشتركة",null,null,null,null,null,null,null,null,null,null,null,null,null,null,null,null,null,"الثالث"]
[null,null,"سجل درجات",null,null,null,"1\\4"]
["م","الاســـــــم",null,null,null,null,null,null,null,null,null,"مجموع","متوسط","نصف العام"]
[null,null,"نشاط","شفهى","سلوك","نشاط","شفهى","سلوك","نشاط","شفهى","سلوك"]
{"$rows_left_out":313}
{"sheet":"غياب1-1","index":3,"n_rows":75,"n_cols":333,"rows_kept":75,"cut":false,"hidden":false,"merged":[[73,2,73,10],[74,2,74,10],[73,46,73,54],[74,46,74,54],[73,80,73,88],[74,80,74,88],[73,114,73,122],[74,114,74,122],[73,148,73,156],[74,148,74,156],[73,284,73,292],[74,284,74,292],[73,182,73,190],[74,182,74,190],[73,216,73,224],[74,216,74,224],[73,250,73,258],[74,250,74,258]]}
[null,null,null,null,"1\\1",null,null,null,null,"سبتمبر",null,null,null,null,null,null,null,null,null,null,null,null,null,null,null,null,null,null,null,null,null,null,null,null,null,null,null,null,null,null,null,null,null,null,null,null,null,null,"1\\1",null,null,null,null,null,null,null,"اكتوبر",null,null,null,null,null,null,null,null,null,null,null,null,null,null,null,null,null,null,null,null,null,null,null,null,null,"1\\1",null,null,null,null,null,null,null,"نوفمبر",null,null,null,null,null,null,null,null,null,null,null,null,null,null,null,null,null,null,null,null,null,null,null,null,null,"1\\1",null,null,null,null,null,null,"ديسمبر",null,null,null,null,null,null,null,null,null,null,null,null,null,null,null,null,null,null,null,null,null,null,null,null,null,null,"1\\1",null,null,null,null,null,null,null,"يناير",null,null,null,null,null,null,null,null,null,null,null,null,null,null,null,null,null,null,null,null,null,null,null,null,null,"1\\1",null,null,null,null,null,null,null,null,"فبراير",null,null,null,null,null,null,null,null,null,null,null,null,null,null,null,null,null,null,null,null,null,null,null,null,"1\\1",null,null,null,null,null,null,null,"مارس",null,null,null,null,null,null,null,null,null,null,null,null,null,null,null,null,null,null,null,null,null,null,null,null,null,"1\\1",null,null,null,null,null,null,null,"ابريل",null,null,null,null,null,null,null,null,null,null,null,null,null,null,null,null,null,null,null,null,null,null,null,null,null,"1\\1",null,null,null,null,null,null,null,"مايو"]
[]
[]
[null,null,"2018-08-30","2018-08-30","2018-08-30","2018-08-30","2018-08-30","2018-08-30",null,null,null,null,null,null,null,null,null,null,null,null,null,null,null,null,null,null,null,null,null,null,null,null,null,{"$f":"COUNTA(C4:AG4)","v":6},null,null,null,null,null,null,null,null,null,null,null,null,"2018-08-30","2018-08-30","2018-08-30",null,null,null,null,null,null,null,null,null,null,null,null,null,null,null,null,"2018-08-30",null,null,null,null,null,null,null,null,null,null,null,{"$f":"COUNT(AU4:BY4)","v":4},null,null,"2018-08-30","2018-08-30",null,null,null,null,null,null,null,null,null,null,null,null,null,null,null,null,null,null,null,null,null,null,null,null,null,null,null,null,null,{"$f":"COUNT(CC4:DF4)","v":2},null,null,"2018-08-30","2018-08-30",null,null,null,null,null,null,null,null,null,null,null,null,null,null,null,null,null,null,null,null,null,null,null,null,null,null,null,null,null,{"$f":"COUNT(DK4:EO4)","v":2},null,null,"2018-08-30","2018-08-30",null,null,null,null,null,null,null,null,null,null,null,null,null,null,null,null,null,null,null,null,null,null,null,null,null,null,null,null,null,{"$f":"COUNT(ES4:FW4)","v":2},null,null,null,"2018-08-30","2018-08-30","2018-08-30",null,null,null,null,null,null,null,null,null,null,null,null,null,null,null,null,null,null,null,null,null,null,null,null,null,null,null,{"$f":"COUNT(GA4:HB4)","v":3},null,null,"2018-08-30","2018-08-30",null,null,null,null,null,null,null,null,null,null,null,null,null,null,null,null,null,null,null,null,null,null,null,null,null,null,null,null,null,{"$f":"COUNT(HI4:IM4)","v":2},null,null,"2018-08-29",null,null,null,null,null,null,null,null,null,null,null,null,null,null,null,null,null,null,null,null,null,null,null,null,null,null,null,null,null,null,{"$f":"COUNTA(IQ4:JT4)","v":1},null,null,"2018-08-30","2018-08-30",null,null,null,null,null,null,null,null,null,null,null,null,null,null,null,null,null,null,null,null,null,null,null,null,null,null,null,null,null,{"$f":"COUNT(JY4:LC4)","v":2}]
["م","الاســــــــــــــــــــــــم",1,2,3,4,5,6,7,8,9,10,11,12,13,14,15,16,17,18,19,20,21,22,23,24,25,26,27,28,29,30,null,null,null,null,null,null,null,null,null,null,null,null,{"$f":"ROW()-4","v":1},null,1,2,3,4,5,6,7,8,9,10,11,12,13,14,15,16,17,18,19,20,21,22,23,24,25,26,27,28,29,30,31,null,null,null,1,2,3,4,5,6,7,8,9,10,11,12,13,14,15,16,17,18,19,20,21,22,23,24,25,26,27,28,29,30,null,null,null,null,1,2,3,4,5,6,7,8,9,10,11,12,13,14,15,16,17,18,19,20,21,22,23,24,25,26,27,28,29,30,31,null,null,null,1,2,3,4,5,6,7,8,9,10,11,12,13,14,15,16,17,18,19,20,21,22,23,24,25,26,27,28,29,30,31,null,null,null,1,2,3,4,5,6,7,8,9,10,11,12,13,14,15,16,17,18,19,20,21,22,23,24,25,26,27,28,null,null,null,null,null,null,1,2,3,4,5,6,7,8,9,10,11,12,13,14,15,16,17,18,19,20,21,22,23,24,25,26,27,28,29,30,31,null,null,null,1,2,3,4,5,6,7,8,9,10,11,12,13,14,15,16,17,18,19,20,21,22,23,24,25,26,27,28,29,30,null,null,null,null,1,2,3,4,5,6,7,8,9,10,11,12,13,14,15,16,17,18,19,20,21,22,23,24,25,26,27,28,29,30,31,null,null,null,null,null,null,null,null,null,null,null,null,null,null,null,null,null,"1\\1"]
[{"$f":"IF(B6=\"\",\"\",ROW()-5)","v":1},{"$f":"VLOOK2ALL(بنين!$D$10:$D$2547,$E$1,AS5,0)","v":"ابراهيم ابراهيم على ابراهيم البدحى"},null,null,null,null,null,null,null,null,null,null,null,null,null,null,null,null,null,null,null,null,null,null,null,null,null,null,null,null,null,null,null,{"$f":"COUNTA(C6:AG6)","v":0},null,null,null,null,null,null,null,null,null,null,{"$f":"ROW()-4","v":2},null,"غ",null,"غ",null,null,null,null,null,null,null,null,null,null,null,null,null,null,null,null,null,null,null,null,null,null,null,null,null,null,null,null,{"$f":"COUNTA(AU6:BY6)","v":2},null,null,"غ",null,"غ",null,null,null,null,null,null,null,null,null,null,null,null,null,null,null,null,null,null,null,null,null,null,null,null,null,null,null,null,{"$f":"COUNTA(CC6:DG6)","v":2},null,null,"غ",null,"غ",null,null,null,null,null,null,null,null,null,null,null,null,null,null,null,null,null,null,null,null,null,null,null,null,null,null,null,null,{"$f":"COUNTA(DK6:EO6)","v":2},null,null,"غ",null,"غ",null,null,null,null,null,null,null,null,null,null,null,null,null,null,null,null,null,null,null,null,null,null,null,null,null,null,null,null,{"$f":"COUNTA(ES6:FW6)","v":2},null,null,"غ",null,"غ",null,null,null,null,null,null,null,null,null,null,null,null,null,null,null,null,null,null,null,null,null,null,null,null,null,null,null,null,{"$f":"COUNTA(GA6:HE6)","v":2},null,null,"غ",null,"غ",null,null,null,null,null,null,null,null,null,null,null,null,null,null,null,null,null,null,null,null,null,null,null,null,null,null,null,null,{"$f":"COUNTA(HI6:IM6)","v":2},null,null,"غ",null,"غ",null,null,null,null,null,null,null,null,null,null,null,null,null,null,null,null,null,null,null,null,null,null,null,null,null,null,null,null,{"$f":"COUNTA(IQ6:JU6)","v":2},null,null,"غ",null,"غ",null,null,null,null,null,null,null,null,null,null,null,null,null,null,null,null,null,null,null,null,null,null,null,null,null,null,null,null,{"$f":"COUNTA(JY6:LC6)","v":2},null,null,null,null,null,null,null,null,null,null,null,null,null,null,null,null,"1\\2"]
[{"$f":"IF(B7=\"\",\"\",ROW()-5)","v":2},{"$f":"VLOOK2ALL(بنين!$D$10:$D$2547,$E$1,AS6,0)","v":"ابراهيم السيد ابراهيم احمد محمد"},null,null,null,null,null,null,null,null,null,null,null,null,null,null,null,null,null,null,null,null,null,null,null,null,null,null,null,null,null,null,null,0,null,null,null,null,null,null,null,null,null,null,3,null,"غ",null,null,null,null,null,null,null,null,null,"غ",null,null,null,null,null,"غ",null,null,"غ",null,null,null,null,null,null,null,null,null,null,null,4,null,null,"غ",null,null,null,null,null,null,null,null,null,"غ",null,null,null,null,null,"غ",null,null,"غ",null,null,null,null,null,null,null,null,null,null,null,4,null,null,"غ",null,null,null,null,null,null,null,null,null,"غ",null,null,null,null,null,"غ",null,null,"غ",null,null,null,null,null,null,null,null,null,null,null,4,null,null,"غ",null,null,null,null,null,null,null,null,null,"غ",null,null,null,null,null,"غ",null,null,"غ",null,null,null,null,null,null,null,null,null,null,null,4,null,null,"غ",null,null,null,null,null,null,null,null,null,"غ",null,null,null,null,null,"غ",null,null,"غ",null,null,null,null,null,null,null,null,null,null,null,4,null,null,"غ",null,null,null,null,null,null,null,null,null,"غ",null,null,null,null,null,"غ",null,null,"غ",null,null,null,null,null,null,null,null,null,null,null,4,null,null,"غ",null,null,null,null,null,null,null,null,null,"غ",null,null,null,null,null,"غ",null,null,"غ",null,null,null,null,null,null,null,null,null,null,null,4,null,null,"غ",null,null,null,null,null,null,null,null,null,"غ",null,null,null,null,null,"غ",null,null,"غ",null,null,null,null,null,null,null,null,null,null,null,4,null,null,null,null,null,null,null,null,null,null,null,null,null,null,null,null,"1\\3"]
[3,{"$f":"VLOOK2ALL(بنين!$D$10:$D$2547,$E$1,AS7,0)","v":"ابراهيم المرسى يوسف جمال الدين"},null,null,null,null,null,null,null,null,null,null,null,null,null,null,null,null,null,null,null,null,null,null,null,null,null,null,null,null,null,null,null,0,null,null,null,null,null,null,null,null,null,null,4,null,"غ",null,null,null,null,null,null,null,null,null,null,null,null,null,null,null,null,null,null,null,null,null,null,null,null,null,null,null,null,null,null,1,null,null,"غ",null,null,null,null,null,null,null,null,null,null,null,null,null,null,null,null,null,null,null,null,null,null,null,null,null,null,null,null,null,null,1,null,null,"غ",null,null,null,null,null,null,null,null,null,null,null,null,null,null,null,null,null,null,null,null,null,null,null,null,null,null,null,null,null,null,1,null,null,"غ",null,null,null,null,null,null,null,null,null,null,null,null,null,null,null,null,null,null,null,null,null,null,null,null,null,null,null,null,null,null,1,null,null,"غ",null,null,null,null,null,null,null,null,null,null,null,null,null,null,null,null,null,null,null,null,null,null,null,null,null,null,null,null,null,null,1,null,null,"غ",null,null,null,null,null,null,null,null,null,null,null,null,null,null,null,null,null,null,null,null,null,null,null,null,null,null,null,null,null,null,1,null,null,"غ",null,null,null,null,null,null,null,null,null,null,null,null,null,null,null,null,null,null,null,null,null,null,null,null,null,null,null,null,null,null,1,null,null,"غ",null,null,null,null,null,null,null,null,null,null,null,null,null,null,null,null,null,null,null,null,null,null,null,null,null,null,null,null,null,null,1,null,null,null,null,null,null,null,null,null,null,null,null,null,null,null,null,"1\\4"]
[4,{"$f":"VLOOK2ALL(بنين!$D$10:$D$2547,$E$1,AS8,0)","v":"ابراهيم حسن محروس محمد"},null,null,null,null,null,null,null,null,null,null,null,null,null,null,null,null,null,null,null,null,null,null,null,null,null,null,null,null,null,null,null,0,null,null,null,null,null,null,null,null,null,null,5,null,null,null,null,null,null,null,null,null,null,null,null,null,null,null,null,null,null,null,null,null,null,null,null,null,null,null,null,null,null,null,null,0,null,null,null,null,null,null,null,null,null,null,null,null,null,null,null,null,null,null,null,null,null,null,null,null,null,null,null,null,null,null,null,null,null,0,null,null,null,null,null,null,null,null,null,null,null,null,null,null,null,null,null,null,null,null,null,null,null,null,null,null,null,null,null,null,null,null,null,0,null,null,null,null,null,null,null,null,null,null,null,null,null,null,null,null,null,null,null,null,null,null,null,null,null,null,null,null,null,null,null,null,null,0,null,null,null,null,null,null,null,null,null,null,null,null,null,null,null,null,null,null,null,null,null,null,null,null,null,null,null,null,null,null,null,null,null,0,null,null,null,null,null,null,null,null,null,null,null,null,null,null,null,null,null,null,null,null,null,null,null,null,null,null,null,null,null,null,null,null,null,0,null,null,null,null,null,null,null,null,null,null,null,null,null,null,null,null,null,null,null,null,null,null,null,null,null,null,null,null,null,null,null,null,null,0,null,null,null,null,null,null,null,null,null,null,null,null,null,null,null,null,null,null,null,null,null,null,null,null,null,null,null,null,null,null,null,null,null,0,null,null,null,null,null,null,null,null,null,null,null,null,null,null,null,null,"2\\1"]
[5,{"$f":"VLOOK2ALL(بنين!$D$10:$D$2547,$E$1,AS9,0)","v":"ابراهيم عاطف محمد حاتم"},null,null,null,null,null,null,null,null,null,null,null,null,null,null,null,null,null,null,null,null,null,null,null,null,null,null,null,null,null,null,null,0,null,null,null,null,null,null,null,null,null,null,6,null,null,null,null,null,null,null,null,null,null,null,null,null,null,null,null,null,null,null,null,null,null,null,null,null,null,null,null,null,null,null,null,0,null,null,null,null,null,null,null,null,null,null,null,null,null,null,null,null,null,null,null,null,null,null,null,null,null,null,null,null,null,null,null,null,null,0,null,null,null,null,null,null,null,null,null,null,null,null,null,null,null,null,null,null,null,null,null,null,null,null,null,null,null,null,null,null,null,null,null,0,null,null,null,null,null,null,null,null,null,null,null,null,null,null,null,null,null,null,null,null,null,null,null,null,null,null,null,null,null,null,null,null,null,0,null,null,null,null,null,null,null,null,null,null,null,null,null,null,null,null,null,null,null,null,null,null,null,null,null,null,null,null,null,null,null,null,null,0,null,null,null,null,null,null,null,null,null,null,null,null,null,null,null,null,null,null,null,null,null,null,null,null,null,null,null,null,null,null,null,null,null,0,null,null,null,null,null,null,null,null,null,null,null,null,null,null,null,null,null,null,null,null,null,null,null,null,null,null,null,null,null,null,null,null,null,0,null,null,null,null,null,null,null,null,null,null,null,null,null,null,null,null,null,null,null,null,null,null,null,null,null,null,null,null,null,null,null,null,null,0,null,null,null,null,null,null,null,null,null,null,null,null,null,null,null,null,"2\\2"]
{"$rows_left_out":65}