{"text_format":"1","workbook":"xlsx","n_sheets":3,"sheets":["ورقة1","salim","Sheet1"],"not_rendered":{"charts":0,"images":1,"macros":1,"external_links":0,"defined_names":0,"comments":0,"pivot_tables":0},"unopened":[],"bounds":{"document_bytes":16777216,"sheet_cells":100000,"rows_first":2000,"rows_last":500,"rows_between":2000,"halvings":0,"cell_chars":16384,"cell_head_chars":4096},"cells_cut":0,"cells_raw":0,"read":"whole","date_system":"1900"}

{"sheet":"ورقة1","index":0,"n_rows":20,"n_cols":8,"rows_kept":20,"cut":false,"hidden":false,"merged":[]}
["الاسم الكامل","المبلغ الكلي","الاستقطاع الشهري","عدد الأشهر","الدائرة","التاريخ ","القسط الأول","القسط الثاني"]
["عزيز حامد عبد الباقي عبد العزيز",5500000,500,11,"مديرية حماية المنشات"]
["حسين جبار لعيبي خلف",660000,110,6,"حرس الحدود"]
["ثائر عباس عزيز علي",1500000,150,10,"الشرطة الاتحادية ف2"]
["سعيد ناصر هادي كاظم",3000,300,10,"الشرطة الاتحادية فوج المغاوير"]
["ناصرالدين",175000,44,4,"الشرطة الاتحادية فق 1"]
["حسين صالح سويد محمد العبسي",175000,44,4,"الشرطة الاتحادية فق1 الفوج الالي"]
["زهير ناصر هادي كاظم",1500,150,10,"الشرطة الاتحادية فوج المغاوير"]
["مجدي عباس فاضل عباس",1540000,220,7,"الشرطة الاتحادية ل 3 ف3"]
["حسين جبار لعيبي خلف",700000,100,7,"حرس الحدود"]
["نهاد",175000,44,4,"حرس الحدود"]
["سعد عزيز حمودي كاظم السعيدي",1500000,150,10,"مديرية شؤون السيطرات"]
["سعد عزيز حمودي كاظم السعيدي",800000,100,8,"مديرية شؤون السيطرات"]
["نصير صادق جعفر عوده علي",300000,50,6,"الشرطة الاتحادية فق 6"]
["ناجي نفبد احمد القؤش",250000,50,5,"الشرطة الاتحادية فق 6"]
["محمد مهدي سليم حسين الزيداوي",3000000,300,10,"حماية المنشأت"]
["بشير سلمان شكاصي",3000000,300,10,"حماية المنشأت"]
["علي اسماعيل عبد الحسن",770000,110,7,"حرس الحدود"]
["حيدر محمد رشيد محمد",900000,100,9,"حرس الحدود"]
["حسين علي حسين غضبان ",250,50,6,"مديرية الإدارة والميرة ش.أ"]

{"sheet":"salim","index":1,"n_rows":7,"n_cols":11,"rows_kept":7,"cut":false,"hidden":false,"merged":[]}
[]
[]
[null,"سعيد ناصر هادي كاظم"]
[]
[]
[null,null,null,null,"المبلغ الكلي","الاستقطاع الشهري","عدد الأشهر","الدائرة","التاريخ ","القسط الأول","القسط الثاني"]
[null,null,null,null,{"$f":"VLOOKUP($B$3,ورقة1!$A$2:$H$70,COLUMNS($A$1:A1)+1,0)","v":3000},{"$f":"VLOOKUP($B$3,ورقة1!$A$2:$H$70,COLUMNS($A$1:B1)+1,0)","v":300},{"$f":"VLOOKUP($B$3,ورقة1!$A$2:$H$70,COLUMNS($A$1:C1)+1,0)","v":10},{"$f":"VLOOKUP($B$3,ورقة1!$A$2:$H$70,COLUMNS($A$1:D1)+1,0)","v":"الشرطة الاتحادية فوج المغاوير"},{"$f":"VLOOKUP($B$3,ورقة1!$A$2:$H$70,COLUMNS($A$1:E1)+1,0)","v":0},{"$f":"VLOOKUP($B$3,ورقة1!$A$2:$H$70,COLUMNS($A$1:F1)+1,0)","v":0},{"$f":"VLOOKUP($B$3,ورقة1!$A$2:$H$70,COLUMNS($A$1:G1)+1,0)","v":0}]

{"sheet":"Sheet1","index":2,"n_rows":0,"n_cols":0,"rows_kept":0,"cut":false,"hidden":false,"merged":[]}