{"text_format":"1","workbook":"xlsx","n_sheets":5,"sheets":["الأصناف","القيود","البيع","ثوابت","ورقة2"],"not_rendered":{"charts":0,"images":1,"macros":1,"external_links":0,"defined_names":2,"comments":0,"pivot_tables":0},"unopened":[],"bounds":{"document_bytes":16777216,"sheet_cells":100000,"rows_first":2000,"rows_last":500,"rows_between":2000,"halvings":0,"cell_chars":16384,"cell_head_chars":4096},"cells_cut":0,"cells_raw":0,"read":"whole","date_system":"1900"}

{"sheet":"الأصناف","index":0,"n_rows":1014,"n_cols":26,"rows_kept":1014,"cut":false,"hidden":false,"merged":[]}
[null,1,2,1,3,4,5,6,7,8,9,10,11,12,13,14,15,16,17,18,19,20,21,22,23]
["اسم ورقم الحساب","رقم ","اسم الصنف","رقم ","وارد كمية","منصرف كمية","رصيد الكمية","وارد قيمة","منصرف قيمة","توضيح الوحدة جملة","توضيح الوحدة نصف جملة","توضيح الوحدة تجزئة","عدد الوحدات جملة","عدد الوحدات نصف جملة","عدد الوحدات  تجزئة","نسبة الربح الوحدة جملة","نسبة الربح الوحدة نصف جملة","نسبة الربح الوحدة تجزئة","تكلفة الوحدة جملة","سعر البيع الوحدة جملة","تكلفة الوحدة نصف جملة","سعر البيع الوحدة نصف جملة","تكلفة الوحدة تجزئة","سعر البيع الوحدة تجزئة","مكان الصنف بالأرفف","اسم المورد  ورقمه  وعنوانه "]
[{"$f":"C3&\"/\"&B3","v":"زراير قميص موديل 1 لون احمر/1"},1,"زراير قميص موديل 1 لون احمر",1,15,10,{"$f":"E3-F3","v":5},null,null,"علبة بها  50كيس كل كيس به 20 زرار","كيس كل كيس به 20 زرار","زرار",1,50,100,0.2,0.5,0.6,100,{"$f":"P3*S3+S3","v":120},{"$f":"S3/N3","v":2},{"$f":"U3*Q3+U3","v":3},{"$f":"S3/O3","v":1},{"$f":"R3*W3+W3","v":1.6},10]
[{"$f":"C4&\"/\"&B4","v":"السبت/2"},2,"السبت",2,null,null,{"$f":"E4-F4","v":0}]
["الاحد/3",3,"الاحد",3,null,null,0]
["الإثنين/4",4,"الإثنين",4,null,null,0]
["الثلاثاء/5",5,"الثلاثاء",5,null,null,0]
["الأربعاء/6",6,"الأربعاء",6,null,null,0]
["الخميس/7",7,"الخميس",7,null,null,0]
["الجمعة/8",8,"الجمعة",8,null,null,0]
["/9",9,null,9,null,null,0]
["/10",10,null,10,null,null,0]
["/11",11,null,11,null,null,0]
["/12",12,null,12,null,null,0]
["/13",13,null,13,null,null,0]
["/14",14,null,14,null,null,0]
["/15",15,null,15,null,null,0]
["/16",16,null,16,null,null,0]
["/17",17,null,17,null,null,0]
["/18",18,null,18,null,null,0]
["/19",19,null,19,null,null,0]
["/20",20,null,20,null,null,0]
["/21",21,null,21,null,null,0]
["/22",22,null,22,null,null,0]
["/23",23,null,23,null,null,0]
["/24",24,null,24]
["/25",25,null,25]
["/26",26,null,26]
["/27",27,null,27]
["/28",28,null,28]
["/29",29,null,29]
["/30",30,null,30]
["/31",31,null,31]
["/32",32,null,32]
["/33",33,null,33]
["/34",34,null,34]
["/35",35,null,35]
[null,36,null,36]
[null,37,null,37]
[null,38,null,38]
[null,39,null,39]
[null,40,null,40]
[null,41,null,41]
[null,42,null,42]
[null,43,null,43]
[null,44,null,44]
[null,45,null,45]
[null,46,null,46]
[null,47,null,47]
[null,48,null,48]
[null,49,null,49]
[null,50,null,50]
[null,51,null,51]
[null,52,null,52]
[null,53,null,53]
[null,54,null,54]
[null,55,null,55]
[null,56,null,56]
[null,57,null,57]
[null,58,null,58]
[null,59,null,59]
[null,60,null,60]
[null,61,null,61]
[null,62,null,62]
[null,63,null,63]
[null,64,null,64]
[null,65,null,65]
[null,66,null,66]
[null,67,null,67]
[null,68,null,68]
[null,69,null,69]
[null,70,null,70]
[null,71,null,71]
[null,72,null,72]
[null,73,null,73]
[null,74,null,74]
[null,75,null,75]
[null,76,null,76]
[null,77,null,77]
[null,78,null,78]
[null,79,null,79]
[null,80,null,80]
[null,81,null,81]
[null,82,null,82]
[null,83,null,83]
[null,84,null,84]
[null,85,null,85]
[null,86,null,86]
[null,87,null,87]
[null,88,null,88]
[null,89,null,89]
[null,90,null,90]
[null,91,null,91]
[null,92,null,92]
[null,93,null,93]
[null,94,null,94]
[null,95,null,95]
[null,96,null,96]
[null,97,null,97]
[null,98,null,98]
[null,99,null,99]
[null,100,null,100]
[null,101,null,101]
[null,102,null,102]
[null,103,null,103]
[null,104,null,104]
[null,105,null,105]
[null,106,null,106]
[null,107,null,107]
[null,108,null,108]
[null,109,null,109]
[null,110,null,110]
[null,111,null,111]
[null,112,null,112]
[null,113,null,113]
[null,114,null,114]
[null,115,null,115]
[null,116,null,116]
[null,117,null,117]
[null,118,null,118]
[null,119,null,119]
[null,120,null,120]
[null,121,null,121]
[null,122,null,122]
[null,123,null,123]
[null,124,null,124]
[null,125,null,125]
[null,126,null,126]
[null,127,null,127]
[null,128,null,128]
[null,129,null,129]
[null,130,null,130]
[null,131,null,131]
[null,132,null,132]
[null,133,null,133]
[null,134,null,134]
[null,135,null,135]
[null,136,null,136]
[null,137,null,137]
[null,138,null,138]
[null,139,null,139]
[null,140,null,140]
[null,141,null,141]
[null,142,null,142]
[null,143,null,143]
[null,144,null,144]
[null,145,null,145]
[null,146,null,146]
[null,147,null,147]
[null,148,null,148]
[null,149,null,149]
[null,150,null,150]
[null,151,null,151]
[null,152,null,152]
[null,153,null,153]
[null,154,null,154]
[null,155,null,155]
[null,156,null,156]
[null,157,null,157]
[null,158,null,158]
[null,159,null,159]
[null,160,null,160]
[null,161,null,161]
[null,162,null,162]
[null,163,null,163]
[null,164,null,164]
[null,165,null,165]
[null,166,null,166]
[null,167,null,167]
[null,168,null,168]
[null,169,null,169]
[null,170,null,170]
[null,171,null,171]
[null,172,null,172]
[null,173,null,173]
[null,174,null,174]
[null,175,null,175]
[null,176,null,176]
[null,177,null,177]
[null,178,null,178]
[null,179,null,179]
[null,180,null,180]
[null,181,null,181]
[null,182,null,182]
[null,183,null,183]
[null,184,null,184]
[null,185,null,185]
[null,186,null,186]
[null,187,null,187]
[null,188,null,188]
[null,189,null,189]
[null,190,null,190]
[null,191,null,191]
[null,192,null,192]
[null,193,null,193]
[null,194,null,194]
[null,195,null,195]
[null,196,null,196]
[null,197,null,197]
[null,198,null,198]
[null,199,null,199]
[null,200,200,200,null,null,null,null,null,200,200,200,200,200,200,200,200,200,200,200,200,200,200,200,200]
[null,201,null,201]
[null,202,null,202]
[null,203,null,203]
[null,204,null,204]
[null,205,null,205]
[null,206,null,206]
[null,207,null,207]
[null,208,null,208]
[null,209,null,209]
[null,210,null,210]
[null,211,null,211]
[null,212,null,212]
[null,213,null,213]
[null,214,null,214]
[null,215,null,215]
[null,216,null,216]
[null,217,null,217]
[null,218,null,218]
[null,219,null,219]
[null,220,null,220]
[null,221,null,221]
[null,222,null,222]
[null,223,null,223]
[null,224,null,224]
[null,225,null,225]
[null,226,null,226]
[null,227,null,227]
[null,228,null,228]
[null,229,null,229]
[null,230,null,230]
[null,231,null,231]
[null,232,null,232]
[null,233,null,233]
[null,234,null,234]
[null,235,null,235]
[null,236,null,236]
[null,237,null,237]
[null,238,null,238]
[null,239,null,239]
[null,240,null,240]
[null,241,null,241]
[null,242,null,242]
[null,243,null,243]
[null,244,null,244]
[null,245,null,245]
[null,246,null,246]
[null,247,null,247]
[null,248,null,248]
[null,249,null,249]
[null,250,null,250]
[null,251,null,251]
[null,252,null,252]
[null,253,null,253]
[null,254,null,254]
[null,255,null,255]
[null,256,null,256]
[null,257,null,257]
[null,258,null,258]
[null,259,null,259]
[null,260,null,260]
[null,261,null,261]
[null,262,null,262]
[null,263,null,263]
[null,264,null,264]
[null,265,null,265]
[null,266,null,266]
[null,267,null,267]
[null,268,null,268]
[null,269,null,269]
[null,270,null,270]
[null,271,null,271]
[null,272,null,272]
[null,273,null,273]
[null,274,null,274]
[null,275,null,275]
[null,276,null,276]
[null,277,null,277]
[null,278,null,278]
[null,279,null,279]
[null,280,null,280]
[null,281,null,281]
[null,282,null,282]
[null,283,null,283]
[null,284,null,284]
[null,285,null,285]
[null,286,null,286]
[null,287,null,287]
[null,288,null,288]
[null,289,null,289]
[null,290,null,290]
[null,291,null,291]
[null,292,null,292]
[null,293,null,293]
[null,294,null,294]
[null,295,null,295]
[null,296,null,296]
[null,297,null,297]
[null,298,null,298]
[null,299,null,299]
[null,300,null,300]
[null,301,null,301]
[null,302,null,302]
[null,303,null,303]
[null,304,null,304]
[null,305,null,305]
[null,306,null,306]
[null,307,null,307]
[null,308,null,308]
[null,309,null,309]
[null,310,null,310]
[null,311,null,311]
[null,312,null,312]
[null,313,null,313]
[null,314,null,314]
[null,315,null,315]
[null,316,null,316]
[null,317,null,317]
[null,318,null,318]
[null,319,null,319]
[null,320,null,320]
[null,321,null,321]
[null,322,null,322]
[null,323,null,323]
[null,324,null,324]
[null,325,null,325]
[null,326,null,326]
[null,327,null,327]
[null,328,null,328]
[null,329,null,329]
[null,330,null,330]
[null,331,null,331]
[null,332,null,332]
[null,333,null,333]
[null,334,null,334]
[null,335,null,335]
[null,336,null,336]
[null,337,null,337]
[null,338,null,338]
[null,339,null,339]
[null,340,null,340]
[null,341,null,341]
[null,342,null,342]
[null,343,null,343]
[null,344,null,344]
[null,345,null,345]
[null,346,null,346]
[null,347,null,347]
[null,348,null,348]
[null,349,null,349]
[null,350,null,350]
[null,351,null,351]
[null,352,null,352]
[null,353,null,353]
[null,354,null,354]
[null,355,null,355]
[null,356,null,356]
[null,357,null,357]
[null,358,null,358]
[null,359,null,359]
[null,360,null,360]
[null,361,null,361]
[null,362,null,362]
[null,363,null,363]
[null,364,null,364]
[null,365,null,365]
[null,366,null,366]
[null,367,null,367]
[null,368,null,368]
[null,369,null,369]
[null,370,null,370]
[null,371,null,371]
[null,372,null,372]
[null,373,null,373]
[null,374,null,374]
[null,375,null,375]
[null,376,null,376]
[null,377,null,377]
[null,378,null,378]
[null,379,null,379]
[null,380,null,380]
[null,381,null,381]
[null,382,null,382]
[null,383,null,383]
[null,384,null,384]
[null,385,null,385]
[null,386,null,386]
[null,387,null,387]
[null,388,null,388]
[null,389,null,389]
[null,390,null,390]
[null,391,null,391]
[null,392,null,392]
[null,393,null,393]
[null,394,null,394]
[null,395,null,395]
[null,396,null,396]
[null,397,null,397]
[null,398,null,398]
{"$rows_left_out":615}
{"sheet":"القيود","index":1,"n_rows":10,"n_cols":10,"rows_kept":10,"cut":false,"hidden":false,"merged":[]}
[]
[]
["التاريخ","رقم الحساب","اسم الحساب","مدين /كمية","مدين قيمة","رقم الحساب","اسم الحساب","دائن قيمة","دائن / كمية","شرح"]
["2018-10-05",1000,"الصندوق",null,9.6000000000000014,1,"زراير قميص موديل 1 لون احمر",9.6000000000000014,6]
["2018-10-05",1000,"الصندوق",null,4.8000000000000007,1,"زراير قميص موديل 1 لون احمر",4.8000000000000007,3]
["2018-10-05",1000,"الصندوق",null,0,2,"السبت",0,5]
["2018-10-05",1000,"الصندوق",null,4.8000000000000007,1,"زراير قميص موديل 1 لون احمر",4.8000000000000007,3]
["2018-09-08T17:28:42.250",1000,"الصندوق",null,4.0000000000000009,1,"زراير قميص موديل 1 لون احمر",4.0000000000000009,3]
["2018-09-08T17:41:54.160",1000,"الصندوق",null,4.8000000000000007,1,"زراير قميص موديل 1 لون احمر",4.8000000000000007,3]
["2018-09-09T17:26:07.770",1000,"الصندوق",null,4.8000000000000007,1,"زراير قميص موديل 1 لون احمر",4.8000000000000007,3]

{"sheet":"البيع","index":2,"n_rows":21,"n_cols":11,"rows_kept":21,"cut":false,"hidden":false,"merged":[]}
[null,null,"السبت"]
[null,"أختر اسم الصنف",null,null,"توضيح الوحدة جملة",null,"سعر البيع الوحدة جملة"]
[null,"رقم الصنف",{"$f":"IFERROR(VLOOKUP($C$1,الأصناف!$C$3:$Z$70,COLUMNS($C$2:C2)+1,0),\"\")","v":2},null,"توضيح الوحدة نصف جملة",null,"تكلفة الوحدة نصف جملة"]
[null,"اسم الصنف ",{"$f":"IFERROR(VLOOKUP($C$1,الأصناف!$C$3:$Z$70,COLUMNS($C$2:C3)+0,0),\"\")","v":"السبت"}]
[null,"سعر البيع الوحدة تجزئة",{"$f":"IF(ISNA(VLOOKUP($C$3,الأصناف!$B$3:$Y$12,23,0)),\"\",(VLOOKUP($C$3,الأصناف!$B$3:$Y$12,23,0)))","v":0},null,"توضيح الوحدة تجزئة",null,"سعر البيع الوحدة نصف جملة"]
[null,"مكان الصنف بالأرفف",{"$f":"IF(ISNA(VLOOKUP($C$3,الأصناف!$B$3:$Y$12,24,0)),\"\",(VLOOKUP($C$3,الأصناف!$B$3:$Y$12,24,0)))","v":0},null,"عدد الوحدات جملة",null,"تكلفة الوحدة تجزئة"]
[null,"الكمية المتاحة",{"$f":"IF(ISNA(VLOOKUP($C$3,الأصناف!$B$3:$Y$12,6,0)),\"\",(VLOOKUP($C$3,الأصناف!$B$3:$Y$12,6,0)))","v":0},null,"عدد الوحدات نصف جملة",null,"سعر البيع الوحدة تجزئة"]
[null,"الكمية المطلوبة",null,null,"عدد الوحدات  تجزئة",null,"مكان الصنف بالأرفف"]
[null,"قيمة البيع",{"$f":"IF(C3=\"\",\"استغفر الله \",C8*C5)","v":0},null,"تكلفة الوحدة نصف جملة"]
[null,"الخصم",null,null,"سعر البيع الوحدة نصف جملة"]
[null,"القيمة بعد الخصم",{"$f":"IF(C3=\"\",\"استغفر الله \",C9-C10)","v":0},null,"تكلفة الوحدة تجزئة"]
[null,"المبلغ المستلم"]
[null,"الباقي للعميل ",{"$f":"IF(C3=\"\",\"استغفر الله \",C12-C11)","v":0}]
[null,"التاريخ",{"$f":"NOW()","v":"2018-09-09T17:28:10.200"}]
[]
[]
[]
[]
[]
[null,"التاريخ","رقم الحساب","اسم الحساب","مدين /كمية","مدين قيمة","رقم الحساب","اسم الحساب","دائن قيمة","دائن / كمية","شرح"]
[null,{"$f":"C14","v":"2018-09-09T17:28:10.200"},1000,{"$f":"VLOOKUP($C$21,الأصناف!$B$3:$Y$1002,2,0)","v":"الصندوق"},null,{"$f":"C11","v":0},{"$f":"C3","v":2},{"$f":"C4","v":"السبت"},{"$f":"C11","v":0},{"$f":"C8","v":0},"بيع نقدا"]

{"sheet":"ثوابت","index":3,"n_rows":7,"n_cols":2,"rows_kept":7,"cut":false,"hidden":false,"merged":[]}
[]
[null,"أنواع الأصناف"]
[]
[null,"أبر"]
[null,"خيوط"]
[null,"أزرار"]
[null,"تصليح"]

{"sheet":"ورقة2","index":4,"n_rows":0,"n_cols":0,"rows_kept":0,"cut":false,"hidden":false,"merged":[]}