{"text_format":"1","workbook":"xlsx","n_sheets":19,"sheets":["18005 (2)","Reference","Master Sheet","15003","1","15004","15005","15006","15007","15008","15009","15000","15011","15020","15021","15019","15022","15025","18005"],"not_rendered":{"charts":0,"images":1,"macros":1,"external_links":0,"defined_names":1,"comments":0,"pivot_tables":0},"unopened":[],"bounds":{"document_bytes":16777216,"sheet_cells":100000,"rows_first":2000,"rows_last":500,"rows_between":2000,"halvings":0,"cell_chars":16384,"cell_head_chars":4096},"cells_cut":0,"cells_raw":0,"read":"whole","date_system":"1900"}

{"sheet":"18005 (2)","index":0,"n_rows":45,"n_cols":10,"rows_kept":45,"cut":false,"hidden":false,"merged":[[4,0,4,1],[4,2,4,4],[4,6,4,7],[4,8,4,9],[5,0,6,0],[5,1,6,1],[5,2,5,4],[5,5,5,7],[5,8,6,8],[5,9,6,9]]}
[]
[]
[null,null,null,null,null,null,null,null,"حد الطلب : ",{"$f":"VLOOKUP(G5,Reference!A:G,4,FALSE)/8","v":0}]
["اسم المجموعه /",{"$f":"VLOOKUP(G5,Reference!A:G,2,FALSE)","v":"شحوم"},null,null,null,null,null,null,"كمية الطلب : ",{"$f":"+J3*2","v":0}]
["اسم الصنف :",null,{"$f":"VLOOKUP(G5,Reference!A:G,3,FALSE)","v":"شحم موبيل MP"},null,null,"كود الصنف : ",18005]
["رقم المستند","التاريخ","الــــــــــــــــــوارد",null,null,"المنصــــــــــــــــــرف",null,null,"الرصيـــــد","ملاحظــــــات"]
[null,null,"2018-01-01",10,20,3,8,3]
[null,null,null,null,null,null,null,null,1]
[null,null,null,null,null,null,null,null,1]
[null,null,null,null,null,null,null,null,{"$f":"+(I9+C10+D10+E10)-F10-G10-H10","v":1}]
[null,null,null,null,null,null,null,null,1]
[null,null,null,null,null,null,null,null,1]
[null,null,null,null,null,null,null,null,1]
[null,null,null,null,null,null,null,null,1]
[null,null,null,null,null,null,null,null,1]
{"$rows_left_out":31}
{"sheet":"Reference","index":1,"n_rows":1639,"n_cols":9,"rows_kept":1639,"cut":false,"hidden":false,"merged":[]}
["الكود","المجموعه","البيان","الوحده","الوارد ","منصرف ","الرصيد",null,"أسماء الصفحات"]
[]
[1001,"دليل اصناف بنود تكاليف قطاع صناعى","رمل",null,null,null,null,null,1]
[1002,"دليل اصناف بنود تكاليف قطاع صناعى","سن 6 ",null,null,null,null,null,15003]
[1000,"دليل اصناف بنود تكاليف قطاع صناعى","سن 1",null,null,null,null,null,15004]
[1004,"دليل اصناف بنود تكاليف قطاع صناعى","توريد مياه فقط",null,null,null,null,null,15005]
[1003,"دليل اصناف بنود تكاليف قطاع صناعى","اعمال نقل مياة",null,null,null,null,null,15006]
[null,"مجموعة","زيوت ووقود",null,null,null,null,null,15007]
[null,"مجموعة","زيوت",null,null,null,null,null,15008]
[15003,"زيوت","زيت باور مرسيدس 1 كجم",null,null,null,null,null,15009]
[15004,"زيوت","زيت باور عادى 1 كجم",null,null,null,null,null,15000]
[15005,"زيوت","زيت دبرياج مرسيدس 1 كجم",null,null,null,null,null,15011]
[15006,"زيوت","زيت تروس 90W80 ",null,null,null,null,null,15020]
[15007,"زيوت","زيت موبيل سوبر mobile 20w50 ",null,null,null,null,null,15021]
[15008,"زيوت","زيت موبيل SH15w40   (20 لتر )",null,null,null,null,null,15019]
{"$rows_left_out":1625}
{"sheet":"Master Sheet","index":2,"n_rows":38,"n_cols":10,"rows_kept":38,"cut":false,"hidden":false,"merged":[[0,9,1,9],[0,0,1,0],[0,1,1,1],[0,2,1,2],[0,3,0,5],[0,6,0,8]]}
["م","رقم المستند","التاريخ","الــــــــــــــــــوارد",null,null,"المنصــــــــــــــــــرف",null,null,"الكود"]
[null,null,null,"مشتريات","الانتاج","تحويل من \nمستودع اخر ","التشغيل","الفروع","مرتجعات "]
[{"$f":"IF(B3=\"\",\"\",SUBTOTAL(3,$B$3:B3))","v":""}]
[{"$f":"IF(B4=\"\",\"\",SUBTOTAL(3,$B$3:B4))","v":""}]
[{"$f":"IF(B5=\"\",\"\",SUBTOTAL(3,$B$3:B5))","v":""}]
[{"$f":"IF(B6=\"\",\"\",SUBTOTAL(3,$B$3:B6))","v":""}]
[{"$f":"IF(B7=\"\",\"\",SUBTOTAL(3,$B$3:B7))","v":""}]
[{"$f":"IF(B8=\"\",\"\",SUBTOTAL(3,$B$3:B8))","v":""}]
[{"$f":"IF(B9=\"\",\"\",SUBTOTAL(3,$B$3:B9))","v":""}]
[{"$f":"IF(B10=\"\",\"\",SUBTOTAL(3,$B$3:B10))","v":""}]
[{"$f":"IF(B11=\"\",\"\",SUBTOTAL(3,$B$3:B11))","v":""}]
[{"$f":"IF(B12=\"\",\"\",SUBTOTAL(3,$B$3:B12))","v":""}]
[{"$f":"IF(B13=\"\",\"\",SUBTOTAL(3,$B$3:B13))","v":""}]
[{"$f":"IF(B14=\"\",\"\",SUBTOTAL(3,$B$3:B14))","v":""}]
[{"$f":"IF(B15=\"\",\"\",SUBTOTAL(3,$B$3:B15))","v":""}]
{"$rows_left_out":24}
{"sheet":"15003","index":3,"n_rows":45,"n_cols":10,"rows_kept":45,"cut":false,"hidden":false,"merged":[[5,9,6,9],[4,0,4,1],[4,2,4,4],[4,6,4,7],[4,8,4,9],[5,0,6,0],[5,1,6,1],[5,2,5,4],[5,5,5,7],[5,8,6,8]]}
[]
[]
[null,null,null,null,null,null,null,null,"حد الطلب : ",{"$f":"VLOOKUP(G5,Reference!A:G,4,FALSE)/8","v":0}]
["اسم المجموعه /",{"$f":"VLOOKUP(G5,Reference!A:G,2,FALSE)","v":"زيوت"},null,null,null,null,null,null,"كمية الطلب : ",{"$f":"+J3*2","v":0}]
["اسم الصنف :",null,{"$f":"VLOOKUP(G5,Reference!A:G,3,FALSE)","v":"زيت باور مرسيدس 1 كجم"},null,null,"كود الصنف : ",15003]
["رقم المستند","التاريخ","الــــــــــــــــــوارد",null,null,"المنصــــــــــــــــــرف",null,null,"الرصيـــــد","ملاحظــــــات"]
[null,null,"مشتريات","الانتاج","مرتجع","التشغيل","الفروع","موردين"]
[120,"2018-04-01",2,4,1,2,3,6,{"$f":"+C8+D8+E8+-F8-G8-G8","v":-1},"رصيد اول المده "]
[11,"2018-08-01",10,12,5,7,2,5,{"$f":"+(I8+C9+D9+E9)-F9-G9-H9","v":12}]
[170,"2018-04-01",16,12,11,10,2,3,{"$f":"+(I9+C10+D10+E10)-F10-G10-H10","v":36}]
[null,null,null,null,null,null,null,null,36]
[null,null,null,null,null,null,null,null,36]
[null,null,null,null,null,null,null,null,36]
[null,null,null,null,null,null,null,null,36]
[null,null,null,null,null,null,null,null,36]
{"$rows_left_out":31}
{"sheet":"1","index":4,"n_rows":45,"n_cols":10,"rows_kept":45,"cut":false,"hidden":false,"merged":[[4,0,4,1],[4,2,4,4],[4,6,4,7],[4,8,4,9],[5,0,6,0],[5,1,6,1],[5,2,5,4],[5,5,5,7],[5,8,6,8],[5,9,6,9]]}
[]
[]
[null,null,null,null,null,null,null,null,"حد الطلب : ",{"$f":"VLOOKUP(G5,Reference!A:G,4,FALSE)/8","v":0}]
["اسم المجموعه /",{"$f":"VLOOKUP(G5,Reference!A:G,2,FALSE)","v":"سولار"},null,null,null,null,null,null,"كمية الطلب : ",{"$f":"+J3*2","v":0}]
["اسم الصنف :",null,{"$f":"VLOOKUP(G5,Reference!A:G,3,FALSE)","v":"سولار"},null,null,"كود الصنف : ",1]
["رقم المستند","التاريخ","الــــــــــــــــــوارد",null,null,"المنصــــــــــــــــــرف",null,null,"الرصيـــــد","ملاحظــــــات"]
[null,null,"مشتريات","الانتاج","مرتجع","التشغيل","الفروع","موردين"]
[110,"2018-01-01",10,20,3,8,3,5,{"$f":"+C8+D8+E8+-F8-G8-G8","v":19},"رصيد اول المده "]
[150,"2018-01-01",10,20,50,18,12,6,{"$f":"+(I8+C9+D9+E9)-F9-G9-H9","v":63}]
[1000,"2018-06-01",10,20,30,40,50,60,{"$f":"+(I9+C10+D10+E10)-F10-G10-H10","v":-27}]
[null,null,null,null,null,null,null,null,-27]
[null,null,null,null,null,null,null,null,-27]
[null,null,null,null,null,null,null,null,-27]
[null,null,null,null,null,null,null,null,-27]
[null,null,null,null,null,null,null,null,-27]
{"$rows_left_out":31}
{"sheet":"15004","index":5,"n_rows":45,"n_cols":10,"rows_kept":45,"cut":false,"hidden":false,"merged":[[4,0,4,1],[4,2,4,4],[4,6,4,7],[4,8,4,9],[5,0,6,0],[5,1,6,1],[5,2,5,4],[5,5,5,7],[5,8,6,8],[5,9,6,9]]}
[]
[]
[null,null,null,null,null,null,null,null,"حد الطلب : ",{"$f":"VLOOKUP(G5,Reference!A:G,4,FALSE)/8","v":0}]
["اسم المجموعه /",{"$f":"VLOOKUP(G5,Reference!A:G,2,FALSE)","v":"زيوت"},null,null,null,null,null,null,"كمية الطلب : ",{"$f":"+J3*2","v":0}]
["اسم الصنف :",null,{"$f":"VLOOKUP(G5,Reference!A:G,3,FALSE)","v":"زيت باور عادى 1 كجم"},null,null,"كود الصنف : ",15004]
["رقم المستند","التاريخ","الــــــــــــــــــوارد",null,null,"المنصــــــــــــــــــرف",null,null,"الرصيـــــد","ملاحظــــــات"]
[null,null,"مشتريات","الانتاج","مرتجع","التشغيل","الفروع","موردين"]
[170,"2018-04-01",8,1,7,9,4,5,{"$f":"+C8+D8+E8+-F8-G8-G8","v":-1},"رصيد اول المده "]
[null,null,null,null,null,null,null,null,{"$f":"+(I8+C9+D9+E9)-F9-G9-H9","v":-1}]
[null,null,null,null,null,null,null,null,{"$f":"+(I9+C10+D10+E10)-F10-G10-H10","v":-1}]
[null,null,null,null,null,null,null,null,-1]
[null,null,null,null,null,null,null,null,-1]
[null,null,null,null,null,null,null,null,-1]
[null,null,null,null,null,null,null,null,-1]
[null,null,null,null,null,null,null,null,-1]
{"$rows_left_out":31}
{"sheet":"15005","index":6,"n_rows":45,"n_cols":10,"rows_kept":45,"cut":false,"hidden":false,"merged":[[4,0,4,1],[4,2,4,4],[4,6,4,7],[4,8,4,9],[5,0,6,0],[5,1,6,1],[5,2,5,4],[5,5,5,7],[5,8,6,8],[5,9,6,9]]}
[]
[]
[null,null,null,null,null,null,null,null,"حد الطلب : ",{"$f":"VLOOKUP(G5,Reference!A:G,4,FALSE)/8","v":0}]
["اسم المجموعه /",{"$f":"VLOOKUP(G5,Reference!A:G,2,FALSE)","v":"زيوت"},null,null,null,null,null,null,"كمية الطلب : ",{"$f":"+J3*2","v":0}]
["اسم الصنف :",null,{"$f":"VLOOKUP(G5,Reference!A:G,3,FALSE)","v":"زيت دبرياج مرسيدس 1 كجم"},null,null,"كود الصنف : ",15005]
["رقم المستند","التاريخ","الــــــــــــــــــوارد",null,null,"المنصــــــــــــــــــرف",null,null,"الرصيـــــد","ملاحظــــــات"]
[null,null,"مشتريات","الانتاج","مرتجع","التشغيل","الفروع","موردين"]
[null,null,null,null,null,null,null,null,{"$f":"+C8+D8+E8+-F8-G8-G8","v":0},"رصيد اول المده "]
[null,null,null,null,null,null,null,null,{"$f":"+(I8+C9+D9+E9)-F9-G9-H9","v":0}]
[null,null,null,null,null,null,null,null,{"$f":"+(I9+C10+D10+E10)-F10-G10-H10","v":0}]
[null,null,null,null,null,null,null,null,0]
[null,null,null,null,null,null,null,null,0]
[null,null,null,null,null,null,null,null,0]
[null,null,null,null,null,null,null,null,0]
[null,null,null,null,null,null,null,null,0]
{"$rows_left_out":31}
{"sheet":"15006","index":7,"n_rows":45,"n_cols":10,"rows_kept":45,"cut":false,"hidden":false,"merged":[[4,0,4,1],[4,2,4,4],[4,6,4,7],[4,8,4,9],[5,0,6,0],[5,1,6,1],[5,2,5,4],[5,5,5,7],[5,8,6,8],[5,9,6,9]]}
[]
[]
[null,null,null,null,null,null,null,null,"حد الطلب : ",{"$f":"VLOOKUP(G5,Reference!A:G,4,FALSE)/8","v":0}]
["اسم المجموعه /",{"$f":"VLOOKUP(G5,Reference!A:G,2,FALSE)","v":"زيوت"},null,null,null,null,null,null,"كمية الطلب : ",{"$f":"+J3*2","v":0}]
["اسم الصنف :",null,{"$f":"VLOOKUP(G5,Reference!A:G,3,FALSE)","v":"زيت تروس 90W80 "},null,null,"كود الصنف : ",15006]
["رقم المستند","التاريخ","الــــــــــــــــــوارد",null,null,"المنصــــــــــــــــــرف",null,null,"الرصيـــــد","ملاحظــــــات"]
[null,null,"مشتريات","الانتاج","مرتجع","التشغيل","الفروع","موردين"]
[null,null,null,null,null,null,null,null,{"$f":"+C8+D8+E8+-F8-G8-G8","v":0},"رصيد اول المده "]
[null,null,null,null,null,null,null,null,{"$f":"+(I8+C9+D9+E9)-F9-G9-H9","v":0}]
[null,null,null,null,null,null,null,null,{"$f":"+(I9+C10+D10+E10)-F10-G10-H10","v":0}]
[null,null,null,null,null,null,null,null,0]
[null,null,null,null,null,null,null,null,0]
[null,null,null,null,null,null,null,null,0]
[null,null,null,null,null,null,null,null,0]
[null,null,null,null,null,null,null,null,0]
{"$rows_left_out":31}
{"sheet":"15007","index":8,"n_rows":45,"n_cols":10,"rows_kept":45,"cut":false,"hidden":false,"merged":[[4,0,4,1],[4,2,4,4],[4,6,4,7],[4,8,4,9],[5,0,6,0],[5,1,6,1],[5,2,5,4],[5,5,5,7],[5,8,6,8],[5,9,6,9]]}
[]
[]
[null,null,null,null,null,null,null,null,"حد الطلب : ",{"$f":"VLOOKUP(G5,Reference!A:G,4,FALSE)/8","v":0}]
["اسم المجموعه /",{"$f":"VLOOKUP(G5,Reference!A:G,2,FALSE)","v":"زيوت"},null,null,null,null,null,null,"كمية الطلب : ",{"$f":"+J3*2","v":0}]
["اسم الصنف :",null,{"$f":"VLOOKUP(G5,Reference!A:G,3,FALSE)","v":"زيت موبيل سوبر mobile 20w50 "},null,null,"كود الصنف : ",15007]
["رقم المستند","التاريخ","الــــــــــــــــــوارد",null,null,"المنصــــــــــــــــــرف",null,null,"الرصيـــــد","ملاحظــــــات"]
[null,null,"مشتريات","الانتاج","مرتجع","التشغيل","الفروع","موردين"]
[180,"2018-05-01",10,2,3,7,2,5,{"$f":"+C8+D8+E8+-F8-G8-G8","v":4},"رصيد اول المده "]
[null,null,null,null,null,null,null,null,{"$f":"+(I8+C9+D9+E9)-F9-G9-H9","v":4}]
[null,null,null,null,null,null,null,null,{"$f":"+(I9+C10+D10+E10)-F10-G10-H10","v":4}]
[null,null,null,null,null,null,null,null,4]
[null,null,null,null,null,null,null,null,4]
[null,null,null,null,null,null,null,null,4]
[null,null,null,null,null,null,null,null,4]
[null,null,null,null,null,null,null,null,4]
{"$rows_left_out":31}
{"sheet":"15008","index":9,"n_rows":45,"n_cols":10,"rows_kept":45,"cut":false,"hidden":false,"merged":[[4,0,4,1],[4,2,4,4],[4,6,4,7],[4,8,4,9],[5,0,6,0],[5,1,6,1],[5,2,5,4],[5,5,5,7],[5,8,6,8],[5,9,6,9]]}
[]
[]
[null,null,null,null,null,null,null,null,"حد الطلب : ",{"$f":"VLOOKUP(G5,Reference!A:G,4,FALSE)/8","v":0}]
["اسم المجموعه /",{"$f":"VLOOKUP(G5,Reference!A:G,2,FALSE)","v":"زيوت"},null,null,null,null,null,null,"كمية الطلب : ",{"$f":"+J3*2","v":0}]
["اسم الصنف :",null,{"$f":"VLOOKUP(G5,Reference!A:G,3,FALSE)","v":"زيت موبيل SH15w40   (20 لتر )"},null,null,"كود الصنف : ",15008]
["رقم المستند","التاريخ","الــــــــــــــــــوارد",null,null,"المنصــــــــــــــــــرف",null,null,"الرصيـــــد","ملاحظــــــات"]
[null,null,"مشتريات","الانتاج","مرتجع","التشغيل","الفروع","موردين"]
[null,null,null,null,null,null,null,null,{"$f":"+C8+D8+E8+-F8-G8-G8","v":0},"رصيد اول المده "]
[null,null,null,null,null,null,null,null,{"$f":"+(I8+C9+D9+E9)-F9-G9-H9","v":0}]
[null,null,null,null,null,null,null,null,{"$f":"+(I9+C10+D10+E10)-F10-G10-H10","v":0}]
[null,null,null,null,null,null,null,null,0]
[null,null,null,null,null,null,null,null,0]
[null,null,null,null,null,null,null,null,0]
[null,null,null,null,null,null,null,null,0]
[null,null,null,null,null,null,null,null,0]
{"$rows_left_out":31}
{"sheet":"15009","index":10,"n_rows":45,"n_cols":10,"rows_kept":45,"cut":false,"hidden":false,"merged":[[4,0,4,1],[4,2,4,4],[4,6,4,7],[4,8,4,9],[5,0,6,0],[5,1,6,1],[5,2,5,4],[5,5,5,7],[5,8,6,8],[5,9,6,9]]}
[]
[]
[null,null,null,null,null,null,null,null,"حد الطلب : ",{"$f":"VLOOKUP(G5,Reference!A:G,4,FALSE)/8","v":0}]
["اسم المجموعه /",{"$f":"VLOOKUP(G5,Reference!A:G,2,FALSE)","v":"زيوت"},null,null,null,null,null,null,"كمية الطلب : ",{"$f":"+J3*2","v":0}]
["اسم الصنف :",null,{"$f":"VLOOKUP(G5,Reference!A:G,3,FALSE)","v":"زيت رمادى  SHC( 20 كجم ) "},null,null,"كود الصنف : ",15009]
["رقم المستند","التاريخ","الــــــــــــــــــوارد",null,null,"المنصــــــــــــــــــرف",null,null,"الرصيـــــد","ملاحظــــــات"]
[null,null,"مشتريات","الانتاج","مرتجع","التشغيل","الفروع","موردين"]
[null,null,null,null,null,null,null,null,{"$f":"+C8+D8+E8+-F8-G8-G8","v":0},"رصيد اول المده "]
[null,null,null,null,null,null,null,null,{"$f":"+(I8+C9+D9+E9)-F9-G9-H9","v":0}]
[null,null,null,null,null,null,null,null,{"$f":"+(I9+C10+D10+E10)-F10-G10-H10","v":0}]
[null,null,null,null,null,null,null,null,0]
[null,null,null,null,null,null,null,null,0]
[null,null,null,null,null,null,null,null,0]
[null,null,null,null,null,null,null,null,0]
[null,null,null,null,null,null,null,null,0]
{"$rows_left_out":31}
{"sheet":"15000","index":11,"n_rows":45,"n_cols":10,"rows_kept":45,"cut":false,"hidden":false,"merged":[[4,0,4,1],[4,2,4,4],[4,6,4,7],[4,8,4,9],[5,0,6,0],[5,1,6,1],[5,2,5,4],[5,5,5,7],[5,8,6,8],[5,9,6,9]]}
[]
[]
[null,null,null,null,null,null,null,null,"حد الطلب : ",{"$f":"VLOOKUP(G5,Reference!A:G,4,FALSE)/8","v":0}]
["اسم المجموعه /",{"$f":"VLOOKUP(G5,Reference!A:G,2,FALSE)","v":"زيوت"},null,null,null,null,null,null,"كمية الطلب : ",{"$f":"+J3*2","v":0}]
["اسم الصنف :",null,{"$f":"VLOOKUP(G5,Reference!A:G,3,FALSE)","v":"زيت هيدروليك 68"},null,null,"كود الصنف : ",15000]
["رقم المستند","التاريخ","الــــــــــــــــــوارد",null,null,"المنصــــــــــــــــــرف",null,null,"الرصيـــــد","ملاحظــــــات"]
[null,null,"مشتريات","الانتاج","مرتجع","التشغيل","الفروع","موردين"]
[null,null,null,null,null,null,null,null,{"$f":"+C8+D8+E8+-F8-G8-G8","v":0},"رصيد اول المده "]
[null,null,null,null,null,null,null,null,{"$f":"+(I8+C9+D9+E9)-F9-G9-H9","v":0}]
[null,null,null,null,null,null,null,null,{"$f":"+(I9+C10+D10+E10)-F10-G10-H10","v":0}]
[null,null,null,null,null,null,null,null,0]
[null,null,null,null,null,null,null,null,0]
[null,null,null,null,null,null,null,null,0]
[null,null,null,null,null,null,null,null,0]
[null,null,null,null,null,null,null,null,0]
{"$rows_left_out":31}
{"sheet":"15011","index":12,"n_rows":45,"n_cols":10,"rows_kept":45,"cut":false,"hidden":false,"merged":[[4,0,4,1],[4,2,4,4],[4,6,4,7],[4,8,4,9],[5,0,6,0],[5,1,6,1],[5,2,5,4],[5,5,5,7],[5,8,6,8],[5,9,6,9]]}
[]
[]
[null,null,null,null,null,null,null,null,"حد الطلب : ",{"$f":"VLOOKUP(G5,Reference!A:G,4,FALSE)/8","v":0}]
["اسم المجموعه /",{"$f":"VLOOKUP(G5,Reference!A:G,2,FALSE)","v":"زيوت"},null,null,null,null,null,null,"كمية الطلب : ",{"$f":"+J3*2","v":0}]
["اسم الصنف :",null,{"$f":"VLOOKUP(G5,Reference!A:G,3,FALSE)","v":"زيت تسخين 100  ( محطات الاسفلت ) 0 "},null,null,"كود الصنف : ",15011]
["رقم المستند","التاريخ","الــــــــــــــــــوارد",null,null,"المنصــــــــــــــــــرف",null,null,"الرصيـــــد","ملاحظــــــات"]
[null,null,"مشتريات","الانتاج","مرتجع","التشغيل","الفروع","موردين"]
[null,null,null,null,null,null,null,null,{"$f":"+C8+D8+E8+-F8-G8-G8","v":0},"رصيد اول المده "]
[null,null,null,null,null,null,null,null,{"$f":"+(I8+C9+D9+E9)-F9-G9-H9","v":0}]
[null,null,null,null,null,null,null,null,{"$f":"+(I9+C10+D10+E10)-F10-G10-H10","v":0}]
[null,null,null,null,null,null,null,null,0]
[null,null,null,null,null,null,null,null,0]
[null,null,null,null,null,null,null,null,0]
[null,null,null,null,null,null,null,null,0]
[null,null,null,null,null,null,null,null,0]
{"$rows_left_out":31}
{"sheet":"15020","index":13,"n_rows":45,"n_cols":10,"rows_kept":45,"cut":false,"hidden":false,"merged":[[4,0,4,1],[4,2,4,4],[4,6,4,7],[4,8,4,9],[5,0,6,0],[5,1,6,1],[5,2,5,4],[5,5,5,7],[5,8,6,8],[5,9,6,9]]}
[]
[]
[null,null,null,null,null,null,null,null,"حد الطلب : ",{"$f":"VLOOKUP(G5,Reference!A:G,4,FALSE)/8","v":0}]
["اسم المجموعه /",{"$f":"VLOOKUP(G5,Reference!A:G,2,FALSE)","v":"زيوت"},null,null,null,null,null,null,"كمية الطلب : ",{"$f":"+J3*2","v":0}]
["اسم الصنف :",null,{"$f":"VLOOKUP(G5,Reference!A:G,3,FALSE)","v":"زيت موبيل سوبر 1000"},null,null,"كود الصنف : ",15020]
["رقم المستند","التاريخ","الــــــــــــــــــوارد",null,null,"المنصــــــــــــــــــرف",null,null,"الرصيـــــد","ملاحظــــــات"]
[null,null,"مشتريات","الانتاج","مرتجع","التشغيل","الفروع","موردين"]
[null,null,null,null,null,null,null,null,{"$f":"+C8+D8+E8+-F8-G8-G8","v":0},"رصيد اول المده "]
[null,null,null,null,null,null,null,null,{"$f":"+(I8+C9+D9+E9)-F9-G9-H9","v":0}]
[null,null,null,null,null,null,null,null,{"$f":"+(I9+C10+D10+E10)-F10-G10-H10","v":0}]
[null,null,null,null,null,null,null,null,0]
[null,null,null,null,null,null,null,null,0]
[null,null,null,null,null,null,null,null,0]
[null,null,null,null,null,null,null,null,0]
[null,null,null,null,null,null,null,null,0]
{"$rows_left_out":31}
{"sheet":"15021","index":14,"n_rows":45,"n_cols":10,"rows_kept":45,"cut":false,"hidden":false,"merged":[[4,0,4,1],[4,2,4,4],[4,6,4,7],[4,8,4,9],[5,0,6,0],[5,1,6,1],[5,2,5,4],[5,5,5,7],[5,8,6,8],[5,9,6,9]]}
[]
[]
[null,null,null,null,null,null,null,null,"حد الطلب : ",{"$f":"VLOOKUP(G5,Reference!A:G,4,FALSE)/8","v":0}]
["اسم المجموعه /",{"$f":"VLOOKUP(G5,Reference!A:G,2,FALSE)","v":"زيوت"},null,null,null,null,null,null,"كمية الطلب : ",{"$f":"+J3*2","v":0}]
["اسم الصنف :",null,{"$f":"VLOOKUP(G5,Reference!A:G,3,FALSE)","v":"زيت موبيل دلفاك shc-5 w 40."},null,null,"كود الصنف : ",15021]
["رقم المستند","التاريخ","الــــــــــــــــــوارد",null,null,"المنصــــــــــــــــــرف",null,null,"الرصيـــــد","ملاحظــــــات"]
[null,null,"مشتريات","الانتاج","مرتجع","التشغيل","الفروع","موردين"]
[null,null,null,null,null,null,null,null,{"$f":"+C8+D8+E8+-F8-G8-G8","v":0},"رصيد اول المده "]
[null,null,null,null,null,null,null,null,{"$f":"+(I8+C9+D9+E9)-F9-G9-H9","v":0}]
[null,null,null,null,null,null,null,null,{"$f":"+(I9+C10+D10+E10)-F10-G10-H10","v":0}]
[null,null,null,null,null,null,null,null,0]
[null,null,null,null,null,null,null,null,0]
[null,null,null,null,null,null,null,null,0]
[null,null,null,null,null,null,null,null,0]
[null,null,null,null,null,null,null,null,0]
{"$rows_left_out":31}
{"sheet":"15019","index":15,"n_rows":45,"n_cols":10,"rows_kept":45,"cut":false,"hidden":false,"merged":[[4,0,4,1],[4,2,4,4],[4,6,4,7],[4,8,4,9],[5,0,6,0],[5,1,6,1],[5,2,5,4],[5,5,5,7],[5,8,6,8],[5,9,6,9]]}
[]
[]
[null,null,null,null,null,null,null,null,"حد الطلب : ",{"$f":"VLOOKUP(G5,Reference!A:G,4,FALSE)/8","v":0}]
["اسم المجموعه /",{"$f":"VLOOKUP(G5,Reference!A:G,2,FALSE)","v":"زيوت"},null,null,null,null,null,null,"كمية الطلب : ",{"$f":"+J3*2","v":0}]
["اسم الصنف :",null,{"$f":"VLOOKUP(G5,Reference!A:G,3,FALSE)","v":"زيت موبيل جركن 20 لتر  15w40"},null,null,"كود الصنف : ",15019]
["رقم المستند","التاريخ","الــــــــــــــــــوارد",null,null,"المنصــــــــــــــــــرف",null,null,"الرصيـــــد","ملاحظــــــات"]
[null,null,"مشتريات","الانتاج","مرتجع","التشغيل","الفروع","موردين"]
[null,null,null,null,null,null,null,null,{"$f":"+C8+D8+E8+-F8-G8-G8","v":0},"رصيد اول المده "]
[null,null,null,null,null,null,null,null,{"$f":"+(I8+C9+D9+E9)-F9-G9-H9","v":0}]
[null,null,null,null,null,null,null,null,{"$f":"+(I9+C10+D10+E10)-F10-G10-H10","v":0}]
[null,null,null,null,null,null,null,null,0]
[null,null,null,null,null,null,null,null,0]
[null,null,null,null,null,null,null,null,0]
[null,null,null,null,null,null,null,null,0]
[null,null,null,null,null,null,null,null,0]
{"$rows_left_out":31}
{"sheet":"15022","index":16,"n_rows":45,"n_cols":10,"rows_kept":45,"cut":false,"hidden":false,"merged":[[4,0,4,1],[4,2,4,4],[4,6,4,7],[4,8,4,9],[5,0,6,0],[5,1,6,1],[5,2,5,4],[5,5,5,7],[5,8,6,8],[5,9,6,9]]}
[]
[]
[null,null,null,null,null,null,null,null,"حد الطلب : ",{"$f":"VLOOKUP(G5,Reference!A:G,4,FALSE)/8","v":0}]
["اسم المجموعه /",{"$f":"VLOOKUP(G5,Reference!A:G,2,FALSE)","v":"زيوت"},null,null,null,null,null,null,"كمية الطلب : ",{"$f":"+J3*2","v":0}]
["اسم الصنف :",null,{"$f":"VLOOKUP(G5,Reference!A:G,3,FALSE)","v":"زيت فتيس TDT50 "},null,null,"كود الصنف : ",15022]
["رقم المستند","التاريخ","الــــــــــــــــــوارد",null,null,"المنصــــــــــــــــــرف",null,null,"الرصيـــــد","ملاحظــــــات"]
[null,null,"مشتريات","الانتاج","مرتجع","التشغيل","الفروع","موردين"]
[null,null,null,null,null,null,null,null,{"$f":"+C8+D8+E8+-F8-G8-G8","v":0},"رصيد اول المده "]
[null,null,null,null,null,null,null,null,{"$f":"+(I8+C9+D9+E9)-F9-G9-H9","v":0}]
[null,null,null,null,null,null,null,null,{"$f":"+(I9+C10+D10+E10)-F10-G10-H10","v":0}]
[null,null,null,null,null,null,null,null,0]
[null,null,null,null,null,null,null,null,0]
[null,null,null,null,null,null,null,null,0]
[null,null,null,null,null,null,null,null,0]
[null,null,null,null,null,null,null,null,0]
{"$rows_left_out":31}
{"sheet":"15025","index":17,"n_rows":45,"n_cols":10,"rows_kept":45,"cut":false,"hidden":false,"merged":[[4,0,4,1],[4,2,4,4],[4,6,4,7],[4,8,4,9],[5,0,6,0],[5,1,6,1],[5,2,5,4],[5,5,5,7],[5,8,6,8],[5,9,6,9]]}
[]
[]
[null,null,null,null,null,null,null,null,"حد الطلب : ",{"$f":"VLOOKUP(G5,Reference!A:G,4,FALSE)/8","v":0}]
["اسم المجموعه /",{"$f":"VLOOKUP(G5,Reference!A:G,2,FALSE)","v":"زيوت"},null,null,null,null,null,null,"كمية الطلب : ",{"$f":"+J3*2","v":0}]
["اسم الصنف :",null,{"$f":"VLOOKUP(G5,Reference!A:G,3,FALSE)","v":"زيت MX 15-40 دلفاك"},null,null,"كود الصنف : ",15025]
["رقم المستند","التاريخ","الــــــــــــــــــوارد",null,null,"المنصــــــــــــــــــرف",null,null,"الرصيـــــد","ملاحظــــــات"]
[null,null,"مشتريات","الانتاج","مرتجع","التشغيل","الفروع","موردين"]
[null,null,null,null,null,null,null,null,{"$f":"+C8+D8+E8+-F8-G8-G8","v":0},"رصيد اول المده "]
[null,null,null,null,null,null,null,null,{"$f":"+(I8+C9+D9+E9)-F9-G9-H9","v":0}]
[null,null,null,null,null,null,null,null,{"$f":"+(I9+C10+D10+E10)-F10-G10-H10","v":0}]
[null,null,null,null,null,null,null,null,0]
[null,null,null,null,null,null,null,null,0]
[null,null,null,null,null,null,null,null,0]
[null,null,null,null,null,null,null,null,0]
[null,null,null,null,null,null,null,null,0]
{"$rows_left_out":31}
{"sheet":"18005","index":18,"n_rows":45,"n_cols":10,"rows_kept":45,"cut":false,"hidden":false,"merged":[[4,0,4,1],[4,2,4,4],[4,6,4,7],[4,8,4,9],[5,0,6,0],[5,1,6,1],[5,2,5,4],[5,5,5,7],[5,8,6,8],[5,9,6,9]]}
[]
[]
[null,null,null,null,null,null,null,null,"حد الطلب : ",{"$f":"VLOOKUP(G5,Reference!A:G,4,FALSE)/8","v":0}]
["اسم المجموعه /",{"$f":"VLOOKUP(G5,Reference!A:G,2,FALSE)","v":"شحوم"},null,null,null,null,null,null,"كمية الطلب : ",{"$f":"+J3*2","v":0}]
["اسم الصنف :",null,{"$f":"VLOOKUP(G5,Reference!A:G,3,FALSE)","v":"شحم موبيل MP"},null,null,"كود الصنف : ",18005]
["رقم المستند","التاريخ","الــــــــــــــــــوارد",null,null,"المنصــــــــــــــــــرف",null,null,"الرصيـــــد","ملاحظــــــات"]
[null,null,"مشتريات","الانتاج","مرتجع","التشغيل","الفروع","موردين"]
[null,null,null,null,null,null,null,null,{"$f":"+C8+D8+E8+-F8-G8-G8","v":0},"رصيد اول المده "]
[null,null,null,null,null,null,null,null,{"$f":"+(I8+C9+D9+E9)-F9-G9-H9","v":0}]
[null,null,null,null,null,null,null,null,{"$f":"+(I9+C10+D10+E10)-F10-G10-H10","v":0}]
[null,null,null,null,null,null,null,null,0]
[null,null,null,null,null,null,null,null,0]
[null,null,null,null,null,null,null,null,0]
[null,null,null,null,null,null,null,null,0]
[null,null,null,null,null,null,null,null,0]
{"$rows_left_out":30}