{"text_format":"1","workbook":"xlsx","n_sheets":3,"sheets":["بينات التلاميد","أسماء التلاميذ","التقرير اليومي"],"not_rendered":{"charts":0,"images":0,"macros":1,"external_links":1,"defined_names":73,"comments":0,"pivot_tables":0},"unopened":[],"bounds":{"document_bytes":16777216,"sheet_cells":100000,"rows_first":2000,"rows_last":500,"rows_between":2000,"halvings":0,"cell_chars":16384,"cell_head_chars":4096},"cells_cut":0,"cells_raw":0,"read":"whole","date_system":"1900"}

{"sheet":"بينات التلاميد","index":0,"n_rows":54,"n_cols":17,"rows_kept":54,"cut":false,"hidden":false,"merged":[[2,12,3,12],[2,13,3,13],[2,14,2,15],[2,6,3,6],[2,7,3,7],[2,8,3,8],[2,9,3,9],[2,10,3,10],[2,11,3,11],[2,5,3,5],[2,0,3,0],[2,1,3,1],[2,2,3,2],[2,3,3,3],[2,4,3,4]]}
[]
[]
["رقم التسجيل","اللقب و الاســم","تاريخ الميلاد","مكان الميلاد","الجنس","الصفة","القسم","إسم الولي","مهنة الولي","العنوان","القسم بالاحرف","ر ت ","تاريخ الخروج","تاريخ الدخول","أكتوبر"]
[null,null,null,null,null,null,null,null,null,null,null,null,null,null,"دخول","خروج"]
[2,"أحمد1","2000-05-04","مغنية","ذ","م2","3ت ر","الهاشمي1",null,"قرية عقيد عباس","السنة الثالثة ثانوي تقني رياضي",2,"//////",null,null,null,{"$f":"COUNTIF($B$2:$B$56,\"?*\")","v":48}]
[1,"أحمد2","2000-08-30","مغنية","أ","م2","3ت ر","الهاشمي2",null,"حي الركيزة حمام بوغرارة 13320","السنة الثالثة ثانوي تقني رياضي",1,"//////",null,"د ن1"]
[3,"أحمد3","2000-07-06","مغنية","أ","م2","3ت ر","الهاشمي3",null,"قرية البخاتة مغنية","السنة الثالثة ثانوي تقني رياضي",3,"//////"]
[5,"أحمد4","2000-07-25","مغنية","أ","خ2","3ت ر","الهاشمي4",null,"شارع01 رقم 34 حي الشهداء ـ مغنية ","السنة الثالثة ثانوي تقني رياضي",5,"//////"]
[6,"أحمد5","2001-12-10","مغنية","ذ","خ1","3ت ر","الهاشمي5",null,"عمارة A06  حي القاضي - مغنية ","السنة الثالثة ثانوي تقني رياضي",6,"//////"]
[7,"أحمد6","1999-01-13","مغنية","أ","م2","3ت ر","الهاشمي6",null,"الطريق الوطني رقم 35 الكفاف ـ مغنية ","السنة الثالثة ثانوي تقني رياضي",7,"//////"]
[9,"أحمد7","1999-09-02","مغنية","ذ","خ1","3ت ر","الهاشمي7","ع1","حي الشهداء ـ مغنية ","السنة الثالثة ثانوي تقني رياضي",9,"//////"]
[10,"أحمد8","2000-02-07","مغنية","ذ","م1","3ت ر","الهاشمي8",null,"قرية اولاد الشارف ـ مغنية ","السنة الثالثة ثانوي تقني رياضي",10]
[11,"أحمد9","2000-04-04","مغنية","أ","م2","3ت ر","الهاشمي9",null,"قرية بوسدرة البخاتة ، مغنية ","السنة الثالثة ثانوي تقني رياضي",11,"//////",null,"ص ن1","ص خ خ1"]
[13,"أحمد10","2000-05-08","مغنية","ذ","م1","3ت ر","الهاشمي10",null,"قرية المصامدة ، مغنية ","السنة الثالثة ثانوي تقني رياضي",13,"//////"]
[14,"أحمد11","1999-09-30","الغزوات","ذ","خ1","3ت ر","الهاشمي11","ع1","حي الشهداء ـ مغنية ","السنة الثالثة ثانوي تقني رياضي",14,"//////"]
[15,"أحمد12","1997-07-08","مغنية","ذ","خ1","3ت ر","الهاشمي12","ع1","حي الشهداء ـ مغنية ","السنة الثالثة ثانوي تقني رياضي",15,"//////"]
[16,"أحمد13","2000-05-02","مغنية","ذ","م1","3ت ر","الهاشمي13",null,"حي الركيزة حمام بوغرارة 13320","السنة الثالثة ثانوي تقني رياضي",16,"//////"]
[18,"أحمد14","2000-07-27","مغنية","أ","م2","3ت ر","الهاشمي14",null,"قرية المصامدة  ، مغنية ","السنة الثالثة ثانوي تقني رياضي",18,"//////"]
[19,"أحمد15","1997-04-09","مغنية","ذ","ن1","3ت ر","الهاشمي15","ع1","حمام بوغرارة 13320","السنة الثالثة ثانوي تقني رياضي",19,"//////"]
[16,"أحمد16","2000-04-28","مغنية","ذ","م1","3ت ر","الهاشمي16",null,"قرية العقيد عباس ـ مغنية ","السنة الثالثة ثانوي تقني رياضي",4,"//////"]
[17,"أحمد17","1997-04-06","مغنية","ذ","ن1","3ت ر","الهاشمي17","ع1","حمام بوغرارة 13320","السنة الثالثة ثانوي تقني رياضي",8,"//////"]
[18,"أحمد18","2000-04-12","مغنية","ذ","م1","3ت ر","الهاشمي18",null,"قرية لكفاف","السنة الثالثة ثانوي تقني رياضي",12,"//////"]
[19,"أحمد19","2000-11-16","مغنية","ذ","م1","3ت ر","الهاشمي19",null,"حمام بوغرارة","السنة الثالثة ثانوي تقني رياضي",17,"//////"]
[4,"أحمد20","1999-03-03","مغنية","ذ","خ1","3ت ر","الهاشمي20","ع1","حي الشهداء حي جابر رقم 17 مغنية ","السنة الثالثة ثانوي علوم تجريبية ",20,"//////"]
[8,"أحمد21","2000-07-30","مغنية","ذ","م1","3ت ر","الهاشمي21",null,"قرية اولاد الشارف مغنية","السنة الثالثة ثانوي علوم تجريبية ",21,"//////"]
[12,"أحمد22","2000-02-19","مغنية","أ","خ2","3ت ر","الهاشمي22",null,"حي الشهداء رقم 10","السنة الثالثة ثانوي علوم تجريبية ",22,"//////"]
[17]
[29]
[30]
[23,"سعاد1","2000-08-28","مغنية","أ","م2","3ع ت01","ايمن1",null,"قرية المصامدة ـ مغنية ","السنة الثالثة ثانوي علوم تجريبية ",23,"//////"]
[24,"سعاد2","1998-01-28","مغنية","أ","م2","3ع ت01","ايمن2",null,"قرية العقيد عباس ، مغنية ","السنة الثالثة ثانوي علوم تجريبية ",24,"//////"]
[25,"سعاد3","2000-03-01","مغنية","ذ","م1","3ع ت01","ايمن3",null,"مزرعة الشرقاي العيد ، مغنية ","السنة الثالثة ثانوي علوم تجريبية ",25,"//////"]
[26,"سعاد4","1998-11-08","مغنية","ذ","خ1","3ع ت01","ايمن4","ع1","حي الشهداء ، مغنية ","السنة الثالثة ثانوي علوم تجريبية ",26,"//////"]
[27,"سعاد5","1998-04-12","مغنية","ذ","م1","3ع ت01","ايمن5",null,"الطريق الوطني رقم 35 الكفاف ، مغنية ","السنة الثالثة ثانوي علوم تجريبية ",27,"//////"]
[28,"سعاد6","2000-01-15","مغنية","أ","م2","3ع ت01","ايمن6",null,"قرية أولاد الشارف ، مغنية ","السنة الثالثة ثانوي علوم تجريبية ",28,"//////"]
[29,"سعاد7","1999-06-26","مغنية","ذ","م1","3ع ت01","ايمن7",null,"قرية بوسدرة البخاتة ـ مغنية ","السنة الثالثة ثانوي علوم تجريبية ",29,"//////"]
[30,"سعاد8","2000-04-24","مغنية","أ","م2","3ع ت01","ايمن8",null,"حي الباطوار شارع 17 الباب 06 مغنية ","السنة الثالثة ثانوي علوم تجريبية ",30,"//////"]
[31,"سعاد9","1999-11-03","مغنية","أ","ن2","3ع ت01","ايمن9","ع2","قرية بوسدرة البخاتة ، مغنية ","السنة الثالثة ثانوي علوم تجريبية ",31,"//////"]
[32,"سعاد10","2000-06-04","مغنية","أ","م2","3ع ت01","ايمن10",null,"العقيد عباس","السنة الثالثة ثانوي علوم تجريبية ",32,"//////"]
[33,"سعاد11","1999-08-08","عين الترك","ذ","ن1","3ع ت01","ايمن11","ع1","حي أولاد بن صابر ، مغنية ","السنة الثالثة ثانوي علوم تجريبية ",33,"//////"]
[34,"سعاد12","2000-05-28","مغنية","ذ","م1","3ع ت01","ايمن12",null,"قرية لكفاف مغنية","السنة الثالثة ثانوي علوم تجريبية ",34,"//////"]
[35,"سعاد13","2000-08-31","مغنية","ذ","م1","3ع ت01","ايمن13",null,"اولاد الشارف مغنية تلمسان","السنة الثالثة ثانوي علوم تجريبية ",35,"//////"]
[36,"سعاد14","2000-02-24","مغنية","ذ","م1","3ع ت01","ايمن14",null,"قرية العقيد لطيفي L4 B2  مغنية ","السنة الثالثة ثانوي علوم تجريبية ",36,"//////"]
[37,"سعاد15","1999-08-31","مغنية","ذ","خ1","3ع ت01","ايمن15","ع1","شارع 25 حي الشهداء ـ مغنية ","السنة الثالثة ثانوي علوم تجريبية ",37,"//////"]
[38,"سعاد16","2000-04-11","مغنية","أ","خ2","3ع ت01","ايمن16",null,"حي بلال  العمارة رقم04 الطابق3","السنة الثالثة ثانوي علوم تجريبية ",38,"//////"]
[39,"سعاد17","1999-10-12","أولاد ميمون","أ","ن2","3ع ت01","ايمن17","ع2","الطريق الوطني رقم 35 الكفاف ، مغنية ","السنة الثالثة ثانوي علوم تجريبية ",39,"//////"]
[40,"سعاد18","1999-04-21","بشار","ذ","ن1","3ع ت01","ايمن18","ع1","قرية المصامدة ـ مغنية ","السنة الثالثة ثانوي علوم تجريبية ",40,"//////"]
[41,"سعاد19","2000-06-18","مغنية","ذ","خ1","3ع ت01","ايمن19",null,"","السنة الثالثة ثانوي علوم تجريبية ",41,"//////"]
[42,"سعاد20","1999-03-28","مغنية","ذ","خ1","3ع ت01","ايمن20","ع1","رقم 16 شارع محطة القطار ، مغنية ","السنة الثالثة ثانوي علوم تجريبية ",42,"//////"]
[43,"سعاد21","2000-11-14","حسين داي","أ","خ2","3ع ت01","ايمن21",null,"27حي 240 مسكن حي الغابات مغنية","السنة الثالثة ثانوي علوم تجريبية ",43,"//////"]
[44,"سعاد22","2000-06-06","مغنية","ذ","م1","3ع ت01","ايمن22",null,"اولاد قدور الصغار مغنية","السنة الثالثة ثانوي علوم تجريبية ",44,"//////"]
[45,"سعاد23","2000-03-16","مغنية","أ","م2","3ع ت01","ايمن23",null,"قرية البخاتة بوسدرة","السنة الثالثة ثانوي علوم تجريبية ",45,"//////"]
[46,"سعاد24","2000-08-16","مغنية","أ","خ2","3ع ت01","ايمن24",null,"حي الشهداء رقم39","السنة الثالثة ثانوي علوم تجريبية ",46,"//////"]
[47,"سعاد25","1997-10-16","مغنية","أ","خ2","3ع ت01","ايمن25",null,"حي بلال رقم 41 ، مغنية ","السنة الثالثة ثانوي علوم تجريبية ",47,"//////"]

{"sheet":"أسماء التلاميذ","index":1,"n_rows":1376,"n_cols":5,"rows_kept":1376,"cut":false,"hidden":false,"merged":[]}
[null,"أسماء التلاميذ"]
[{"$f":"IFERROR(VLOOKUP(C2,$D$2:$E$20,2,0),\"\")","v":"Classe1"},{"$f":"IFERROR(IF(ROWS($B$2:B2)>'بينات التلاميد'!$Q$5,\"\",INDEX('بينات التلاميد'!$B$5:$B$56,SMALL(IF('بينات التلاميد'!$B$5:$B$56<>\"\",ROW('بينات التلاميد'!$B$5:$B$56)-ROW($B$5)+1),ROWS($B$2:B2)))),\"\")","v":"أحمد1"},{"$f":"IFERROR(VLOOKUP(B2,'بينات التلاميد'!$B$5:$G$56,6,0),\"\")","v":"3ت ر"},"3ت ر","Classe1"]
["Classe1",{"$f":"IFERROR(IF(ROWS($B$2:B3)>'بينات التلاميد'!$Q$5,\"\",INDEX('بينات التلاميد'!$B$5:$B$56,SMALL(IF('بينات التلاميد'!$B$5:$B$56<>\"\",ROW('بينات التلاميد'!$B$5:$B$56)-ROW($B$5)+1),ROWS($B$2:B3)))),\"\")","v":"أحمد2"},{"$f":"IFERROR(VLOOKUP(B3,'بينات التلاميد'!$B$5:$G$56,6,0),\"\")","v":"3ت ر"},"3ع ت01","Classe2"]
["Classe1",{"$f":"IFERROR(IF(ROWS($B$2:B4)>'بينات التلاميد'!$Q$5,\"\",INDEX('بينات التلاميد'!$B$5:$B$56,SMALL(IF('بينات التلاميد'!$B$5:$B$56<>\"\",ROW('بينات التلاميد'!$B$5:$B$56)-ROW($B$5)+1),ROWS($B$2:B4)))),\"\")","v":"أحمد3"},{"$f":"IFERROR(VLOOKUP(B4,'بينات التلاميد'!$B$5:$G$56,6,0),\"\")","v":"3ت ر"},"3ع ت02","Classe3"]
["Classe1",{"$f":"IFERROR(IF(ROWS($B$2:B5)>'بينات التلاميد'!$Q$5,\"\",INDEX('بينات التلاميد'!$B$5:$B$56,SMALL(IF('بينات التلاميد'!$B$5:$B$56<>\"\",ROW('بينات التلاميد'!$B$5:$B$56)-ROW($B$5)+1),ROWS($B$2:B5)))),\"\")","v":"أحمد4"},{"$f":"IFERROR(VLOOKUP(B5,'بينات التلاميد'!$B$5:$G$56,6,0),\"\")","v":"3ت ر"},"3ت إ","Classe4"]
["Classe1",{"$f":"IFERROR(IF(ROWS($B$2:B6)>'بينات التلاميد'!$Q$5,\"\",INDEX('بينات التلاميد'!$B$5:$B$56,SMALL(IF('بينات التلاميد'!$B$5:$B$56<>\"\",ROW('بينات التلاميد'!$B$5:$B$56)-ROW($B$5)+1),ROWS($B$2:B6)))),\"\")","v":"أحمد5"},{"$f":"IFERROR(VLOOKUP(B6,'بينات التلاميد'!$B$5:$G$56,6,0),\"\")","v":"3ت ر"},"3أ ف","Classe5"]
["Classe1",{"$f":"IFERROR(IF(ROWS($B$2:B7)>'بينات التلاميد'!$Q$5,\"\",INDEX('بينات التلاميد'!$B$5:$B$56,SMALL(IF('بينات التلاميد'!$B$5:$B$56<>\"\",ROW('بينات التلاميد'!$B$5:$B$56)-ROW($B$5)+1),ROWS($B$2:B7)))),\"\")","v":"أحمد6"},{"$f":"IFERROR(VLOOKUP(B7,'بينات التلاميد'!$B$5:$G$56,6,0),\"\")","v":"3ت ر"},"3لغات","Classe6"]
["Classe1",{"$f":"IFERROR(IF(ROWS($B$2:B8)>'بينات التلاميد'!$Q$5,\"\",INDEX('بينات التلاميد'!$B$5:$B$56,SMALL(IF('بينات التلاميد'!$B$5:$B$56<>\"\",ROW('بينات التلاميد'!$B$5:$B$56)-ROW($B$5)+1),ROWS($B$2:B8)))),\"\")","v":"أحمد7"},{"$f":"IFERROR(VLOOKUP(B8,'بينات التلاميد'!$B$5:$G$56,6,0),\"\")","v":"3ت ر"},"2ع ت01","Classe7"]
["Classe1",{"$f":"IFERROR(IF(ROWS($B$2:B9)>'بينات التلاميد'!$Q$5,\"\",INDEX('بينات التلاميد'!$B$5:$B$56,SMALL(IF('بينات التلاميد'!$B$5:$B$56<>\"\",ROW('بينات التلاميد'!$B$5:$B$56)-ROW($B$5)+1),ROWS($B$2:B9)))),\"\")","v":"أحمد8"},{"$f":"IFERROR(VLOOKUP(B9,'بينات التلاميد'!$B$5:$G$56,6,0),\"\")","v":"3ت ر"},"2ع ت02","Classe8"]
["Classe1",{"$f":"IFERROR(IF(ROWS($B$2:B10)>'بينات التلاميد'!$Q$5,\"\",INDEX('بينات التلاميد'!$B$5:$B$56,SMALL(IF('بينات التلاميد'!$B$5:$B$56<>\"\",ROW('بينات التلاميد'!$B$5:$B$56)-ROW($B$5)+1),ROWS($B$2:B10)))),\"\")","v":"أحمد9"},{"$f":"IFERROR(VLOOKUP(B10,'بينات التلاميد'!$B$5:$G$56,6,0),\"\")","v":"3ت ر"},"2ت إ","Classe9"]
["Classe1",{"$f":"IFERROR(IF(ROWS($B$2:B11)>'بينات التلاميد'!$Q$5,\"\",INDEX('بينات التلاميد'!$B$5:$B$56,SMALL(IF('بينات التلاميد'!$B$5:$B$56<>\"\",ROW('بينات التلاميد'!$B$5:$B$56)-ROW($B$5)+1),ROWS($B$2:B11)))),\"\")","v":"أحمد10"},{"$f":"IFERROR(VLOOKUP(B11,'بينات التلاميد'!$B$5:$G$56,6,0),\"\")","v":"3ت ر"},"2أ ف","Classe10"]
["Classe1",{"$f":"IFERROR(IF(ROWS($B$2:B12)>'بينات التلاميد'!$Q$5,\"\",INDEX('بينات التلاميد'!$B$5:$B$56,SMALL(IF('بينات التلاميد'!$B$5:$B$56<>\"\",ROW('بينات التلاميد'!$B$5:$B$56)-ROW($B$5)+1),ROWS($B$2:B12)))),\"\")","v":"أحمد11"},{"$f":"IFERROR(VLOOKUP(B12,'بينات التلاميد'!$B$5:$G$56,6,0),\"\")","v":"3ت ر"},"2لغات","Classe11"]
["Classe1",{"$f":"IFERROR(IF(ROWS($B$2:B13)>'بينات التلاميد'!$Q$5,\"\",INDEX('بينات التلاميد'!$B$5:$B$56,SMALL(IF('بينات التلاميد'!$B$5:$B$56<>\"\",ROW('بينات التلاميد'!$B$5:$B$56)-ROW($B$5)+1),ROWS($B$2:B13)))),\"\")","v":"أحمد12"},{"$f":"IFERROR(VLOOKUP(B13,'بينات التلاميد'!$B$5:$G$56,6,0),\"\")","v":"3ت ر"},"2ت ر","Classe19"]
["Classe1",{"$f":"IFERROR(IF(ROWS($B$2:B14)>'بينات التلاميد'!$Q$5,\"\",INDEX('بينات التلاميد'!$B$5:$B$56,SMALL(IF('بينات التلاميد'!$B$5:$B$56<>\"\",ROW('بينات التلاميد'!$B$5:$B$56)-ROW($B$5)+1),ROWS($B$2:B14)))),\"\")","v":"أحمد13"},{"$f":"IFERROR(VLOOKUP(B14,'بينات التلاميد'!$B$5:$G$56,6,0),\"\")","v":"3ت ر"},"1ع1","Classe12"]
["Classe1",{"$f":"IFERROR(IF(ROWS($B$2:B15)>'بينات التلاميد'!$Q$5,\"\",INDEX('بينات التلاميد'!$B$5:$B$56,SMALL(IF('بينات التلاميد'!$B$5:$B$56<>\"\",ROW('بينات التلاميد'!$B$5:$B$56)-ROW($B$5)+1),ROWS($B$2:B15)))),\"\")","v":"أحمد14"},{"$f":"IFERROR(VLOOKUP(B15,'بينات التلاميد'!$B$5:$G$56,6,0),\"\")","v":"3ت ر"},"1ع2","Classe13"]
["Classe1",{"$f":"IFERROR(IF(ROWS($B$2:B16)>'بينات التلاميد'!$Q$5,\"\",INDEX('بينات التلاميد'!$B$5:$B$56,SMALL(IF('بينات التلاميد'!$B$5:$B$56<>\"\",ROW('بينات التلاميد'!$B$5:$B$56)-ROW($B$5)+1),ROWS($B$2:B16)))),\"\")","v":"أحمد15"},{"$f":"IFERROR(VLOOKUP(B16,'بينات التلاميد'!$B$5:$G$56,6,0),\"\")","v":"3ت ر"},"1ع3","Classe14"]
["Classe1",{"$f":"IFERROR(IF(ROWS($B$2:B17)>'بينات التلاميد'!$Q$5,\"\",INDEX('بينات التلاميد'!$B$5:$B$56,SMALL(IF('بينات التلاميد'!$B$5:$B$56<>\"\",ROW('بينات التلاميد'!$B$5:$B$56)-ROW($B$5)+1),ROWS($B$2:B17)))),\"\")","v":"أحمد16"},{"$f":"IFERROR(VLOOKUP(B17,'بينات التلاميد'!$B$5:$G$56,6,0),\"\")","v":"3ت ر"},"1ع4","Classe15"]
["Classe1",{"$f":"IFERROR(IF(ROWS($B$2:B18)>'بينات التلاميد'!$Q$5,\"\",INDEX('بينات التلاميد'!$B$5:$B$56,SMALL(IF('بينات التلاميد'!$B$5:$B$56<>\"\",ROW('بينات التلاميد'!$B$5:$B$56)-ROW($B$5)+1),ROWS($B$2:B18)))),\"\")","v":"أحمد17"},{"$f":"IFERROR(VLOOKUP(B18,'بينات التلاميد'!$B$5:$G$56,6,0),\"\")","v":"3ت ر"},"1ع5","Classe16"]
["Classe1",{"$f":"IFERROR(IF(ROWS($B$2:B19)>'بينات التلاميد'!$Q$5,\"\",INDEX('بينات التلاميد'!$B$5:$B$56,SMALL(IF('بينات التلاميد'!$B$5:$B$56<>\"\",ROW('بينات التلاميد'!$B$5:$B$56)-ROW($B$5)+1),ROWS($B$2:B19)))),\"\")","v":"أحمد18"},{"$f":"IFERROR(VLOOKUP(B19,'بينات التلاميد'!$B$5:$G$56,6,0),\"\")","v":"3ت ر"},"1أ1","Classe17"]
["Classe1",{"$f":"IFERROR(IF(ROWS($B$2:B20)>'بينات التلاميد'!$Q$5,\"\",INDEX('بينات التلاميد'!$B$5:$B$56,SMALL(IF('بينات التلاميد'!$B$5:$B$56<>\"\",ROW('بينات التلاميد'!$B$5:$B$56)-ROW($B$5)+1),ROWS($B$2:B20)))),\"\")","v":"أحمد19"},{"$f":"IFERROR(VLOOKUP(B20,'بينات التلاميد'!$B$5:$G$56,6,0),\"\")","v":"3ت ر"},"1أ2","Classe18"]
["Classe1",{"$f":"IFERROR(IF(ROWS($B$2:B21)>'بينات التلاميد'!$Q$5,\"\",INDEX('بينات التلاميد'!$B$5:$B$56,SMALL(IF('بينات التلاميد'!$B$5:$B$56<>\"\",ROW('بينات التلاميد'!$B$5:$B$56)-ROW($B$5)+1),ROWS($B$2:B21)))),\"\")","v":"أحمد20"},{"$f":"IFERROR(VLOOKUP(B21,'بينات التلاميد'!$B$5:$G$56,6,0),\"\")","v":"3ت ر"}]
["Classe1",{"$f":"IFERROR(IF(ROWS($B$2:B22)>'بينات التلاميد'!$Q$5,\"\",INDEX('بينات التلاميد'!$B$5:$B$56,SMALL(IF('بينات التلاميد'!$B$5:$B$56<>\"\",ROW('بينات التلاميد'!$B$5:$B$56)-ROW($B$5)+1),ROWS($B$2:B22)))),\"\")","v":"أحمد21"},{"$f":"IFERROR(VLOOKUP(B22,'بينات التلاميد'!$B$5:$G$56,6,0),\"\")","v":"3ت ر"}]
["Classe1",{"$f":"IFERROR(IF(ROWS($B$2:B23)>'بينات التلاميد'!$Q$5,\"\",INDEX('بينات التلاميد'!$B$5:$B$56,SMALL(IF('بينات التلاميد'!$B$5:$B$56<>\"\",ROW('بينات التلاميد'!$B$5:$B$56)-ROW($B$5)+1),ROWS($B$2:B23)))),\"\")","v":"أحمد22"},{"$f":"IFERROR(VLOOKUP(B23,'بينات التلاميد'!$B$5:$G$56,6,0),\"\")","v":"3ت ر"}]
["Classe2",{"$f":"IFERROR(IF(ROWS($B$2:B24)>'بينات التلاميد'!$Q$5,\"\",INDEX('بينات التلاميد'!$B$5:$B$56,SMALL(IF('بينات التلاميد'!$B$5:$B$56<>\"\",ROW('بينات التلاميد'!$B$5:$B$56)-ROW($B$5)+1),ROWS($B$2:B24)))),\"\")","v":"سعاد1"},{"$f":"IFERROR(VLOOKUP(B24,'بينات التلاميد'!$B$5:$G$56,6,0),\"\")","v":"3ع ت01"}]
["Classe2",{"$f":"IFERROR(IF(ROWS($B$2:B25)>'بينات التلاميد'!$Q$5,\"\",INDEX('بينات التلاميد'!$B$5:$B$56,SMALL(IF('بينات التلاميد'!$B$5:$B$56<>\"\",ROW('بينات التلاميد'!$B$5:$B$56)-ROW($B$5)+1),ROWS($B$2:B25)))),\"\")","v":"سعاد2"},{"$f":"IFERROR(VLOOKUP(B25,'بينات التلاميد'!$B$5:$G$56,6,0),\"\")","v":"3ع ت01"}]
["Classe2",{"$f":"IFERROR(IF(ROWS($B$2:B26)>'بينات التلاميد'!$Q$5,\"\",INDEX('بينات التلاميد'!$B$5:$B$56,SMALL(IF('بينات التلاميد'!$B$5:$B$56<>\"\",ROW('بينات التلاميد'!$B$5:$B$56)-ROW($B$5)+1),ROWS($B$2:B26)))),\"\")","v":"سعاد3"},{"$f":"IFERROR(VLOOKUP(B26,'بينات التلاميد'!$B$5:$G$56,6,0),\"\")","v":"3ع ت01"}]
["Classe2",{"$f":"IFERROR(IF(ROWS($B$2:B27)>'بينات التلاميد'!$Q$5,\"\",INDEX('بينات التلاميد'!$B$5:$B$56,SMALL(IF('بينات التلاميد'!$B$5:$B$56<>\"\",ROW('بينات التلاميد'!$B$5:$B$56)-ROW($B$5)+1),ROWS($B$2:B27)))),\"\")","v":"سعاد4"},{"$f":"IFERROR(VLOOKUP(B27,'بينات التلاميد'!$B$5:$G$56,6,0),\"\")","v":"3ع ت01"}]
["Classe2",{"$f":"IFERROR(IF(ROWS($B$2:B28)>'بينات التلاميد'!$Q$5,\"\",INDEX('بينات التلاميد'!$B$5:$B$56,SMALL(IF('بينات التلاميد'!$B$5:$B$56<>\"\",ROW('بينات التلاميد'!$B$5:$B$56)-ROW($B$5)+1),ROWS($B$2:B28)))),\"\")","v":"سعاد5"},{"$f":"IFERROR(VLOOKUP(B28,'بينات التلاميد'!$B$5:$G$56,6,0),\"\")","v":"3ع ت01"}]
["Classe2",{"$f":"IFERROR(IF(ROWS($B$2:B29)>'بينات التلاميد'!$Q$5,\"\",INDEX('بينات التلاميد'!$B$5:$B$56,SMALL(IF('بينات التلاميد'!$B$5:$B$56<>\"\",ROW('بينات التلاميد'!$B$5:$B$56)-ROW($B$5)+1),ROWS($B$2:B29)))),\"\")","v":"سعاد6"},{"$f":"IFERROR(VLOOKUP(B29,'بينات التلاميد'!$B$5:$G$56,6,0),\"\")","v":"3ع ت01"}]
["Classe2",{"$f":"IFERROR(IF(ROWS($B$2:B30)>'بينات التلاميد'!$Q$5,\"\",INDEX('بينات التلاميد'!$B$5:$B$56,SMALL(IF('بينات التلاميد'!$B$5:$B$56<>\"\",ROW('بينات التلاميد'!$B$5:$B$56)-ROW($B$5)+1),ROWS($B$2:B30)))),\"\")","v":"سعاد7"},{"$f":"IFERROR(VLOOKUP(B30,'بينات التلاميد'!$B$5:$G$56,6,0),\"\")","v":"3ع ت01"}]
["Classe2",{"$f":"IFERROR(IF(ROWS($B$2:B31)>'بينات التلاميد'!$Q$5,\"\",INDEX('بينات التلاميد'!$B$5:$B$56,SMALL(IF('بينات التلاميد'!$B$5:$B$56<>\"\",ROW('بينات التلاميد'!$B$5:$B$56)-ROW($B$5)+1),ROWS($B$2:B31)))),\"\")","v":"سعاد8"},{"$f":"IFERROR(VLOOKUP(B31,'بينات التلاميد'!$B$5:$G$56,6,0),\"\")","v":"3ع ت01"}]
["Classe2",{"$f":"IFERROR(IF(ROWS($B$2:B32)>'بينات التلاميد'!$Q$5,\"\",INDEX('بينات التلاميد'!$B$5:$B$56,SMALL(IF('بينات التلاميد'!$B$5:$B$56<>\"\",ROW('بينات التلاميد'!$B$5:$B$56)-ROW($B$5)+1),ROWS($B$2:B32)))),\"\")","v":"سعاد9"},{"$f":"IFERROR(VLOOKUP(B32,'بينات التلاميد'!$B$5:$G$56,6,0),\"\")","v":"3ع ت01"}]
["Classe2",{"$f":"IFERROR(IF(ROWS($B$2:B33)>'بينات التلاميد'!$Q$5,\"\",INDEX('بينات التلاميد'!$B$5:$B$56,SMALL(IF('بينات التلاميد'!$B$5:$B$56<>\"\",ROW('بينات التلاميد'!$B$5:$B$56)-ROW($B$5)+1),ROWS($B$2:B33)))),\"\")","v":"سعاد10"},{"$f":"IFERROR(VLOOKUP(B33,'بينات التلاميد'!$B$5:$G$56,6,0),\"\")","v":"3ع ت01"}]
["Classe2",{"$f":"IFERROR(IF(ROWS($B$2:B34)>'بينات التلاميد'!$Q$5,\"\",INDEX('بينات التلاميد'!$B$5:$B$56,SMALL(IF('بينات التلاميد'!$B$5:$B$56<>\"\",ROW('بينات التلاميد'!$B$5:$B$56)-ROW($B$5)+1),ROWS($B$2:B34)))),\"\")","v":"سعاد11"},{"$f":"IFERROR(VLOOKUP(B34,'بينات التلاميد'!$B$5:$G$56,6,0),\"\")","v":"3ع ت01"}]
["Classe2",{"$f":"IFERROR(IF(ROWS($B$2:B35)>'بينات التلاميد'!$Q$5,\"\",INDEX('بينات التلاميد'!$B$5:$B$56,SMALL(IF('بينات التلاميد'!$B$5:$B$56<>\"\",ROW('بينات التلاميد'!$B$5:$B$56)-ROW($B$5)+1),ROWS($B$2:B35)))),\"\")","v":"سعاد12"},{"$f":"IFERROR(VLOOKUP(B35,'بينات التلاميد'!$B$5:$G$56,6,0),\"\")","v":"3ع ت01"}]
["Classe2",{"$f":"IFERROR(IF(ROWS($B$2:B36)>'بينات التلاميد'!$Q$5,\"\",INDEX('بينات التلاميد'!$B$5:$B$56,SMALL(IF('بينات التلاميد'!$B$5:$B$56<>\"\",ROW('بينات التلاميد'!$B$5:$B$56)-ROW($B$5)+1),ROWS($B$2:B36)))),\"\")","v":"سعاد13"},{"$f":"IFERROR(VLOOKUP(B36,'بينات التلاميد'!$B$5:$G$56,6,0),\"\")","v":"3ع ت01"}]
["Classe2",{"$f":"IFERROR(IF(ROWS($B$2:B37)>'بينات التلاميد'!$Q$5,\"\",INDEX('بينات التلاميد'!$B$5:$B$56,SMALL(IF('بينات التلاميد'!$B$5:$B$56<>\"\",ROW('بينات التلاميد'!$B$5:$B$56)-ROW($B$5)+1),ROWS($B$2:B37)))),\"\")","v":"سعاد14"},{"$f":"IFERROR(VLOOKUP(B37,'بينات التلاميد'!$B$5:$G$56,6,0),\"\")","v":"3ع ت01"}]
["Classe2",{"$f":"IFERROR(IF(ROWS($B$2:B38)>'بينات التلاميد'!$Q$5,\"\",INDEX('بينات التلاميد'!$B$5:$B$56,SMALL(IF('بينات التلاميد'!$B$5:$B$56<>\"\",ROW('بينات التلاميد'!$B$5:$B$56)-ROW($B$5)+1),ROWS($B$2:B38)))),\"\")","v":"سعاد15"},{"$f":"IFERROR(VLOOKUP(B38,'بينات التلاميد'!$B$5:$G$56,6,0),\"\")","v":"3ع ت01"}]
["Classe2",{"$f":"IFERROR(IF(ROWS($B$2:B39)>'بينات التلاميد'!$Q$5,\"\",INDEX('بينات التلاميد'!$B$5:$B$56,SMALL(IF('بينات التلاميد'!$B$5:$B$56<>\"\",ROW('بينات التلاميد'!$B$5:$B$56)-ROW($B$5)+1),ROWS($B$2:B39)))),\"\")","v":"سعاد16"},{"$f":"IFERROR(VLOOKUP(B39,'بينات التلاميد'!$B$5:$G$56,6,0),\"\")","v":"3ع ت01"}]
["Classe2",{"$f":"IFERROR(IF(ROWS($B$2:B40)>'بينات التلاميد'!$Q$5,\"\",INDEX('بينات التلاميد'!$B$5:$B$56,SMALL(IF('بينات التلاميد'!$B$5:$B$56<>\"\",ROW('بينات التلاميد'!$B$5:$B$56)-ROW($B$5)+1),ROWS($B$2:B40)))),\"\")","v":"سعاد17"},{"$f":"IFERROR(VLOOKUP(B40,'بينات التلاميد'!$B$5:$G$56,6,0),\"\")","v":"3ع ت01"}]
["Classe2",{"$f":"IFERROR(IF(ROWS($B$2:B41)>'بينات التلاميد'!$Q$5,\"\",INDEX('بينات التلاميد'!$B$5:$B$56,SMALL(IF('بينات التلاميد'!$B$5:$B$56<>\"\",ROW('بينات التلاميد'!$B$5:$B$56)-ROW($B$5)+1),ROWS($B$2:B41)))),\"\")","v":"سعاد18"},{"$f":"IFERROR(VLOOKUP(B41,'بينات التلاميد'!$B$5:$G$56,6,0),\"\")","v":"3ع ت01"}]
["Classe2",{"$f":"IFERROR(IF(ROWS($B$2:B42)>'بينات التلاميد'!$Q$5,\"\",INDEX('بينات التلاميد'!$B$5:$B$56,SMALL(IF('بينات التلاميد'!$B$5:$B$56<>\"\",ROW('بينات التلاميد'!$B$5:$B$56)-ROW($B$5)+1),ROWS($B$2:B42)))),\"\")","v":"سعاد19"},{"$f":"IFERROR(VLOOKUP(B42,'بينات التلاميد'!$B$5:$G$56,6,0),\"\")","v":"3ع ت01"}]
["Classe2",{"$f":"IFERROR(IF(ROWS($B$2:B43)>'بينات التلاميد'!$Q$5,\"\",INDEX('بينات التلاميد'!$B$5:$B$56,SMALL(IF('بينات التلاميد'!$B$5:$B$56<>\"\",ROW('بينات التلاميد'!$B$5:$B$56)-ROW($B$5)+1),ROWS($B$2:B43)))),\"\")","v":"سعاد20"},{"$f":"IFERROR(VLOOKUP(B43,'بينات التلاميد'!$B$5:$G$56,6,0),\"\")","v":"3ع ت01"}]
["Classe2",{"$f":"IFERROR(IF(ROWS($B$2:B44)>'بينات التلاميد'!$Q$5,\"\",INDEX('بينات التلاميد'!$B$5:$B$56,SMALL(IF('بينات التلاميد'!$B$5:$B$56<>\"\",ROW('بينات التلاميد'!$B$5:$B$56)-ROW($B$5)+1),ROWS($B$2:B44)))),\"\")","v":"سعاد21"},{"$f":"IFERROR(VLOOKUP(B44,'بينات التلاميد'!$B$5:$G$56,6,0),\"\")","v":"3ع ت01"}]
["Classe2",{"$f":"IFERROR(IF(ROWS($B$2:B45)>'بينات التلاميد'!$Q$5,\"\",INDEX('بينات التلاميد'!$B$5:$B$56,SMALL(IF('بينات التلاميد'!$B$5:$B$56<>\"\",ROW('بينات التلاميد'!$B$5:$B$56)-ROW($B$5)+1),ROWS($B$2:B45)))),\"\")","v":"سعاد22"},{"$f":"IFERROR(VLOOKUP(B45,'بينات التلاميد'!$B$5:$G$56,6,0),\"\")","v":"3ع ت01"}]
["Classe2",{"$f":"IFERROR(IF(ROWS($B$2:B46)>'بينات التلاميد'!$Q$5,\"\",INDEX('بينات التلاميد'!$B$5:$B$56,SMALL(IF('بينات التلاميد'!$B$5:$B$56<>\"\",ROW('بينات التلاميد'!$B$5:$B$56)-ROW($B$5)+1),ROWS($B$2:B46)))),\"\")","v":"سعاد23"},{"$f":"IFERROR(VLOOKUP(B46,'بينات التلاميد'!$B$5:$G$56,6,0),\"\")","v":"3ع ت01"}]
["Classe2",{"$f":"IFERROR(IF(ROWS($B$2:B47)>'بينات التلاميد'!$Q$5,\"\",INDEX('بينات التلاميد'!$B$5:$B$56,SMALL(IF('بينات التلاميد'!$B$5:$B$56<>\"\",ROW('بينات التلاميد'!$B$5:$B$56)-ROW($B$5)+1),ROWS($B$2:B47)))),\"\")","v":"سعاد24"},{"$f":"IFERROR(VLOOKUP(B47,'بينات التلاميد'!$B$5:$G$56,6,0),\"\")","v":"3ع ت01"}]
["Classe2",{"$f":"IFERROR(IF(ROWS($B$2:B48)>'بينات التلاميد'!$Q$5,\"\",INDEX('بينات التلاميد'!$B$5:$B$56,SMALL(IF('بينات التلاميد'!$B$5:$B$56<>\"\",ROW('بينات التلاميد'!$B$5:$B$56)-ROW($B$5)+1),ROWS($B$2:B48)))),\"\")","v":"سعاد25"},{"$f":"IFERROR(VLOOKUP(B48,'بينات التلاميد'!$B$5:$G$56,6,0),\"\")","v":"3ع ت01"}]
["",{"$f":"IFERROR(IF(ROWS($B$2:B49)>'بينات التلاميد'!$Q$5,\"\",INDEX('بينات التلاميد'!$B$5:$B$56,SMALL(IF('بينات التلاميد'!$B$5:$B$56<>\"\",ROW('بينات التلاميد'!$B$5:$B$56)-ROW($B$5)+1),ROWS($B$2:B49)))),\"\")","v":""},{"$f":"IFERROR(VLOOKUP(B49,'بينات التلاميد'!$B$5:$G$56,6,0),\"\")","v":""}]
["",{"$f":"IFERROR(IF(ROWS($B$2:B50)>'بينات التلاميد'!$Q$5,\"\",INDEX('بينات التلاميد'!$B$5:$B$56,SMALL(IF('بينات التلاميد'!$B$5:$B$56<>\"\",ROW('بينات التلاميد'!$B$5:$B$56)-ROW($B$5)+1),ROWS($B$2:B50)))),\"\")","v":""},{"$f":"IFERROR(VLOOKUP(B50,'بينات التلاميد'!$B$5:$G$56,6,0),\"\")","v":""}]
["",{"$f":"IFERROR(IF(ROWS($B$2:B51)>'بينات التلاميد'!$Q$5,\"\",INDEX('بينات التلاميد'!$B$5:$B$56,SMALL(IF('بينات التلاميد'!$B$5:$B$56<>\"\",ROW('بينات التلاميد'!$B$5:$B$56)-ROW($B$5)+1),ROWS($B$2:B51)))),\"\")","v":""},{"$f":"IFERROR(VLOOKUP(B51,'بينات التلاميد'!$B$5:$G$56,6,0),\"\")","v":""}]
["",{"$f":"IFERROR(IF(ROWS($B$2:B52)>'بينات التلاميد'!$Q$5,\"\",INDEX('بينات التلاميد'!$B$5:$B$56,SMALL(IF('بينات التلاميد'!$B$5:$B$56<>\"\",ROW('بينات التلاميد'!$B$5:$B$56)-ROW($B$5)+1),ROWS($B$2:B52)))),\"\")","v":""},{"$f":"IFERROR(VLOOKUP(B52,'بينات التلاميد'!$B$5:$G$56,6,0),\"\")","v":""}]
["",{"$f":"IFERROR(IF(ROWS($B$2:B53)>'بينات التلاميد'!$Q$5,\"\",INDEX('بينات التلاميد'!$B$5:$B$56,SMALL(IF('بينات التلاميد'!$B$5:$B$56<>\"\",ROW('بينات التلاميد'!$B$5:$B$56)-ROW($B$5)+1),ROWS($B$2:B53)))),\"\")","v":""},{"$f":"IFERROR(VLOOKUP(B53,'بينات التلاميد'!$B$5:$G$56,6,0),\"\")","v":""}]
["",{"$f":"IFERROR(IF(ROWS($B$2:B54)>'بينات التلاميد'!$Q$5,\"\",INDEX('بينات التلاميد'!$B$5:$B$56,SMALL(IF('بينات التلاميد'!$B$5:$B$56<>\"\",ROW('بينات التلاميد'!$B$5:$B$56)-ROW($B$5)+1),ROWS($B$2:B54)))),\"\")","v":""},{"$f":"IFERROR(VLOOKUP(B54,'بينات التلاميد'!$B$5:$G$56,6,0),\"\")","v":""}]
["",{"$f":"IFERROR(IF(ROWS($B$2:B55)>'بينات التلاميد'!$Q$5,\"\",INDEX('بينات التلاميد'!$B$5:$B$56,SMALL(IF('بينات التلاميد'!$B$5:$B$56<>\"\",ROW('بينات التلاميد'!$B$5:$B$56)-ROW($B$5)+1),ROWS($B$2:B55)))),\"\")","v":""},{"$f":"IFERROR(VLOOKUP(B55,'بينات التلاميد'!$B$5:$G$56,6,0),\"\")","v":""}]
["",{"$f":"IFERROR(IF(ROWS($B$2:B56)>'بينات التلاميد'!$Q$5,\"\",INDEX('بينات التلاميد'!$B$5:$B$56,SMALL(IF('بينات التلاميد'!$B$5:$B$56<>\"\",ROW('بينات التلاميد'!$B$5:$B$56)-ROW($B$5)+1),ROWS($B$2:B56)))),\"\")","v":""},{"$f":"IFERROR(VLOOKUP(B56,'بينات التلاميد'!$B$5:$G$56,6,0),\"\")","v":""}]
["",{"$f":"IFERROR(IF(ROWS($B$2:B57)>'بينات التلاميد'!$Q$5,\"\",INDEX('بينات التلاميد'!$B$5:$B$56,SMALL(IF('بينات التلاميد'!$B$5:$B$56<>\"\",ROW('بينات التلاميد'!$B$5:$B$56)-ROW($B$5)+1),ROWS($B$2:B57)))),\"\")","v":""},{"$f":"IFERROR(VLOOKUP(B57,'بينات التلاميد'!$B$5:$G$56,6,0),\"\")","v":""}]
["",{"$f":"IFERROR(IF(ROWS($B$2:B58)>'بينات التلاميد'!$Q$5,\"\",INDEX('بينات التلاميد'!$B$5:$B$56,SMALL(IF('بينات التلاميد'!$B$5:$B$56<>\"\",ROW('بينات التلاميد'!$B$5:$B$56)-ROW($B$5)+1),ROWS($B$2:B58)))),\"\")","v":""},{"$f":"IFERROR(VLOOKUP(B58,'بينات التلاميد'!$B$5:$G$56,6,0),\"\")","v":""}]
["",{"$f":"IFERROR(IF(ROWS($B$2:B59)>'بينات التلاميد'!$Q$5,\"\",INDEX('بينات التلاميد'!$B$5:$B$56,SMALL(IF('بينات التلاميد'!$B$5:$B$56<>\"\",ROW('بينات التلاميد'!$B$5:$B$56)-ROW($B$5)+1),ROWS($B$2:B59)))),\"\")","v":""},{"$f":"IFERROR(VLOOKUP(B59,'بينات التلاميد'!$B$5:$G$56,6,0),\"\")","v":""}]
["",{"$f":"IFERROR(IF(ROWS($B$2:B60)>'بينات التلاميد'!$Q$5,\"\",INDEX('بينات التلاميد'!$B$5:$B$56,SMALL(IF('بينات التلاميد'!$B$5:$B$56<>\"\",ROW('بينات التلاميد'!$B$5:$B$56)-ROW($B$5)+1),ROWS($B$2:B60)))),\"\")","v":""},{"$f":"IFERROR(VLOOKUP(B60,'بينات التلاميد'!$B$5:$G$56,6,0),\"\")","v":""}]
["",{"$f":"IFERROR(IF(ROWS($B$2:B61)>'بينات التلاميد'!$Q$5,\"\",INDEX('بينات التلاميد'!$B$5:$B$56,SMALL(IF('بينات التلاميد'!$B$5:$B$56<>\"\",ROW('بينات التلاميد'!$B$5:$B$56)-ROW($B$5)+1),ROWS($B$2:B61)))),\"\")","v":""},{"$f":"IFERROR(VLOOKUP(B61,'بينات التلاميد'!$B$5:$G$56,6,0),\"\")","v":""}]
["",{"$f":"IFERROR(IF(ROWS($B$2:B62)>'بينات التلاميد'!$Q$5,\"\",INDEX('بينات التلاميد'!$B$5:$B$56,SMALL(IF('بينات التلاميد'!$B$5:$B$56<>\"\",ROW('بينات التلاميد'!$B$5:$B$56)-ROW($B$5)+1),ROWS($B$2:B62)))),\"\")","v":""},{"$f":"IFERROR(VLOOKUP(B62,'بينات التلاميد'!$B$5:$G$56,6,0),\"\")","v":""}]
["",{"$f":"IFERROR(IF(ROWS($B$2:B63)>'بينات التلاميد'!$Q$5,\"\",INDEX('بينات التلاميد'!$B$5:$B$56,SMALL(IF('بينات التلاميد'!$B$5:$B$56<>\"\",ROW('بينات التلاميد'!$B$5:$B$56)-ROW($B$5)+1),ROWS($B$2:B63)))),\"\")","v":""},{"$f":"IFERROR(VLOOKUP(B63,'بينات التلاميد'!$B$5:$G$56,6,0),\"\")","v":""}]
["",{"$f":"IFERROR(IF(ROWS($B$2:B64)>'بينات التلاميد'!$Q$5,\"\",INDEX('بينات التلاميد'!$B$5:$B$56,SMALL(IF('بينات التلاميد'!$B$5:$B$56<>\"\",ROW('بينات التلاميد'!$B$5:$B$56)-ROW($B$5)+1),ROWS($B$2:B64)))),\"\")","v":""},{"$f":"IFERROR(VLOOKUP(B64,'بينات التلاميد'!$B$5:$G$56,6,0),\"\")","v":""}]
["",{"$f":"IFERROR(IF(ROWS($B$2:B65)>'بينات التلاميد'!$Q$5,\"\",INDEX('بينات التلاميد'!$B$5:$B$56,SMALL(IF('بينات التلاميد'!$B$5:$B$56<>\"\",ROW('بينات التلاميد'!$B$5:$B$56)-ROW($B$5)+1),ROWS($B$2:B65)))),\"\")","v":""},{"$f":"IFERROR(VLOOKUP(B65,'بينات التلاميد'!$B$5:$G$56,6,0),\"\")","v":""}]
[{"$f":"IFERROR(VLOOKUP(C66,$D$2:$E$20,2,0),\"\")","v":""},{"$f":"IFERROR(IF(ROWS($B$2:B66)>'بينات التلاميد'!$Q$5,\"\",INDEX('بينات التلاميد'!$B$5:$B$56,SMALL(IF('بينات التلاميد'!$B$5:$B$56<>\"\",ROW('بينات التلاميد'!$B$5:$B$56)-ROW($B$5)+1),ROWS($B$2:B66)))),\"\")","v":""},{"$f":"IFERROR(VLOOKUP(B66,'بينات التلاميد'!$B$5:$G$56,6,0),\"\")","v":""}]
["",{"$f":"IFERROR(IF(ROWS($B$2:B67)>'بينات التلاميد'!$Q$5,\"\",INDEX('بينات التلاميد'!$B$5:$B$56,SMALL(IF('بينات التلاميد'!$B$5:$B$56<>\"\",ROW('بينات التلاميد'!$B$5:$B$56)-ROW($B$5)+1),ROWS($B$2:B67)))),\"\")","v":""},{"$f":"IFERROR(VLOOKUP(B67,'بينات التلاميد'!$B$5:$G$56,6,0),\"\")","v":""}]
["",{"$f":"IFERROR(IF(ROWS($B$2:B68)>'بينات التلاميد'!$Q$5,\"\",INDEX('بينات التلاميد'!$B$5:$B$56,SMALL(IF('بينات التلاميد'!$B$5:$B$56<>\"\",ROW('بينات التلاميد'!$B$5:$B$56)-ROW($B$5)+1),ROWS($B$2:B68)))),\"\")","v":""},{"$f":"IFERROR(VLOOKUP(B68,'بينات التلاميد'!$B$5:$G$56,6,0),\"\")","v":""}]
["",{"$f":"IFERROR(IF(ROWS($B$2:B69)>'بينات التلاميد'!$Q$5,\"\",INDEX('بينات التلاميد'!$B$5:$B$56,SMALL(IF('بينات التلاميد'!$B$5:$B$56<>\"\",ROW('بينات التلاميد'!$B$5:$B$56)-ROW($B$5)+1),ROWS($B$2:B69)))),\"\")","v":""},{"$f":"IFERROR(VLOOKUP(B69,'بينات التلاميد'!$B$5:$G$56,6,0),\"\")","v":""}]
["",{"$f":"IFERROR(IF(ROWS($B$2:B70)>'بينات التلاميد'!$Q$5,\"\",INDEX('بينات التلاميد'!$B$5:$B$56,SMALL(IF('بينات التلاميد'!$B$5:$B$56<>\"\",ROW('بينات التلاميد'!$B$5:$B$56)-ROW($B$5)+1),ROWS($B$2:B70)))),\"\")","v":""},{"$f":"IFERROR(VLOOKUP(B70,'بينات التلاميد'!$B$5:$G$56,6,0),\"\")","v":""}]
["",{"$f":"IFERROR(IF(ROWS($B$2:B71)>'بينات التلاميد'!$Q$5,\"\",INDEX('بينات التلاميد'!$B$5:$B$56,SMALL(IF('بينات التلاميد'!$B$5:$B$56<>\"\",ROW('بينات التلاميد'!$B$5:$B$56)-ROW($B$5)+1),ROWS($B$2:B71)))),\"\")","v":""},{"$f":"IFERROR(VLOOKUP(B71,'بينات التلاميد'!$B$5:$G$56,6,0),\"\")","v":""}]
["",{"$f":"IFERROR(IF(ROWS($B$2:B72)>'بينات التلاميد'!$Q$5,\"\",INDEX('بينات التلاميد'!$B$5:$B$56,SMALL(IF('بينات التلاميد'!$B$5:$B$56<>\"\",ROW('بينات التلاميد'!$B$5:$B$56)-ROW($B$5)+1),ROWS($B$2:B72)))),\"\")","v":""},{"$f":"IFERROR(VLOOKUP(B72,'بينات التلاميد'!$B$5:$G$56,6,0),\"\")","v":""}]
["",{"$f":"IFERROR(IF(ROWS($B$2:B73)>'بينات التلاميد'!$Q$5,\"\",INDEX('بينات التلاميد'!$B$5:$B$56,SMALL(IF('بينات التلاميد'!$B$5:$B$56<>\"\",ROW('بينات التلاميد'!$B$5:$B$56)-ROW($B$5)+1),ROWS($B$2:B73)))),\"\")","v":""},{"$f":"IFERROR(VLOOKUP(B73,'بينات التلاميد'!$B$5:$G$56,6,0),\"\")","v":""}]
["",{"$f":"IFERROR(IF(ROWS($B$2:B74)>'بينات التلاميد'!$Q$5,\"\",INDEX('بينات التلاميد'!$B$5:$B$56,SMALL(IF('بينات التلاميد'!$B$5:$B$56<>\"\",ROW('بينات التلاميد'!$B$5:$B$56)-ROW($B$5)+1),ROWS($B$2:B74)))),\"\")","v":""},{"$f":"IFERROR(VLOOKUP(B74,'بينات التلاميد'!$B$5:$G$56,6,0),\"\")","v":""}]
["",{"$f":"IFERROR(IF(ROWS($B$2:B75)>'بينات التلاميد'!$Q$5,\"\",INDEX('بينات التلاميد'!$B$5:$B$56,SMALL(IF('بينات التلاميد'!$B$5:$B$56<>\"\",ROW('بينات التلاميد'!$B$5:$B$56)-ROW($B$5)+1),ROWS($B$2:B75)))),\"\")","v":""},{"$f":"IFERROR(VLOOKUP(B75,'بينات التلاميد'!$B$5:$G$56,6,0),\"\")","v":""}]
["",{"$f":"IFERROR(IF(ROWS($B$2:B76)>'بينات التلاميد'!$Q$5,\"\",INDEX('بينات التلاميد'!$B$5:$B$56,SMALL(IF('بينات التلاميد'!$B$5:$B$56<>\"\",ROW('بينات التلاميد'!$B$5:$B$56)-ROW($B$5)+1),ROWS($B$2:B76)))),\"\")","v":""},{"$f":"IFERROR(VLOOKUP(B76,'بينات التلاميد'!$B$5:$G$56,6,0),\"\")","v":""}]
["",{"$f":"IFERROR(IF(ROWS($B$2:B77)>'بينات التلاميد'!$Q$5,\"\",INDEX('بينات التلاميد'!$B$5:$B$56,SMALL(IF('بينات التلاميد'!$B$5:$B$56<>\"\",ROW('بينات التلاميد'!$B$5:$B$56)-ROW($B$5)+1),ROWS($B$2:B77)))),\"\")","v":""},{"$f":"IFERROR(VLOOKUP(B77,'بينات التلاميد'!$B$5:$G$56,6,0),\"\")","v":""}]
["",{"$f":"IFERROR(IF(ROWS($B$2:B78)>'بينات التلاميد'!$Q$5,\"\",INDEX('بينات التلاميد'!$B$5:$B$56,SMALL(IF('بينات التلاميد'!$B$5:$B$56<>\"\",ROW('بينات التلاميد'!$B$5:$B$56)-ROW($B$5)+1),ROWS($B$2:B78)))),\"\")","v":""},{"$f":"IFERROR(VLOOKUP(B78,'بينات التلاميد'!$B$5:$G$56,6,0),\"\")","v":""}]
["",{"$f":"IFERROR(IF(ROWS($B$2:B79)>'بينات التلاميد'!$Q$5,\"\",INDEX('بينات التلاميد'!$B$5:$B$56,SMALL(IF('بينات التلاميد'!$B$5:$B$56<>\"\",ROW('بينات التلاميد'!$B$5:$B$56)-ROW($B$5)+1),ROWS($B$2:B79)))),\"\")","v":""},{"$f":"IFERROR(VLOOKUP(B79,'بينات التلاميد'!$B$5:$G$56,6,0),\"\")","v":""}]
["",{"$f":"IFERROR(IF(ROWS($B$2:B80)>'بينات التلاميد'!$Q$5,\"\",INDEX('بينات التلاميد'!$B$5:$B$56,SMALL(IF('بينات التلاميد'!$B$5:$B$56<>\"\",ROW('بينات التلاميد'!$B$5:$B$56)-ROW($B$5)+1),ROWS($B$2:B80)))),\"\")","v":""},{"$f":"IFERROR(VLOOKUP(B80,'بينات التلاميد'!$B$5:$G$56,6,0),\"\")","v":""}]
["",{"$f":"IFERROR(IF(ROWS($B$2:B81)>'بينات التلاميد'!$Q$5,\"\",INDEX('بينات التلاميد'!$B$5:$B$56,SMALL(IF('بينات التلاميد'!$B$5:$B$56<>\"\",ROW('بينات التلاميد'!$B$5:$B$56)-ROW($B$5)+1),ROWS($B$2:B81)))),\"\")","v":""},{"$f":"IFERROR(VLOOKUP(B81,'بينات التلاميد'!$B$5:$G$56,6,0),\"\")","v":""}]
["",{"$f":"IFERROR(IF(ROWS($B$2:B82)>'بينات التلاميد'!$Q$5,\"\",INDEX('بينات التلاميد'!$B$5:$B$56,SMALL(IF('بينات التلاميد'!$B$5:$B$56<>\"\",ROW('بينات التلاميد'!$B$5:$B$56)-ROW($B$5)+1),ROWS($B$2:B82)))),\"\")","v":""},{"$f":"IFERROR(VLOOKUP(B82,'بينات التلاميد'!$B$5:$G$56,6,0),\"\")","v":""}]
["",{"$f":"IFERROR(IF(ROWS($B$2:B83)>'بينات التلاميد'!$Q$5,\"\",INDEX('بينات التلاميد'!$B$5:$B$56,SMALL(IF('بينات التلاميد'!$B$5:$B$56<>\"\",ROW('بينات التلاميد'!$B$5:$B$56)-ROW($B$5)+1),ROWS($B$2:B83)))),\"\")","v":""},{"$f":"IFERROR(VLOOKUP(B83,'بينات التلاميد'!$B$5:$G$56,6,0),\"\")","v":""}]
["",{"$f":"IFERROR(IF(ROWS($B$2:B84)>'بينات التلاميد'!$Q$5,\"\",INDEX('بينات التلاميد'!$B$5:$B$56,SMALL(IF('بينات التلاميد'!$B$5:$B$56<>\"\",ROW('بينات التلاميد'!$B$5:$B$56)-ROW($B$5)+1),ROWS($B$2:B84)))),\"\")","v":""},{"$f":"IFERROR(VLOOKUP(B84,'بينات التلاميد'!$B$5:$G$56,6,0),\"\")","v":""}]
["",{"$f":"IFERROR(IF(ROWS($B$2:B85)>'بينات التلاميد'!$Q$5,\"\",INDEX('بينات التلاميد'!$B$5:$B$56,SMALL(IF('بينات التلاميد'!$B$5:$B$56<>\"\",ROW('بينات التلاميد'!$B$5:$B$56)-ROW($B$5)+1),ROWS($B$2:B85)))),\"\")","v":""},{"$f":"IFERROR(VLOOKUP(B85,'بينات التلاميد'!$B$5:$G$56,6,0),\"\")","v":""}]
["",{"$f":"IFERROR(IF(ROWS($B$2:B86)>'بينات التلاميد'!$Q$5,\"\",INDEX('بينات التلاميد'!$B$5:$B$56,SMALL(IF('بينات التلاميد'!$B$5:$B$56<>\"\",ROW('بينات التلاميد'!$B$5:$B$56)-ROW($B$5)+1),ROWS($B$2:B86)))),\"\")","v":""},{"$f":"IFERROR(VLOOKUP(B86,'بينات التلاميد'!$B$5:$G$56,6,0),\"\")","v":""}]
["",{"$f":"IFERROR(IF(ROWS($B$2:B87)>'بينات التلاميد'!$Q$5,\"\",INDEX('بينات التلاميد'!$B$5:$B$56,SMALL(IF('بينات التلاميد'!$B$5:$B$56<>\"\",ROW('بينات التلاميد'!$B$5:$B$56)-ROW($B$5)+1),ROWS($B$2:B87)))),\"\")","v":""},{"$f":"IFERROR(VLOOKUP(B87,'بينات التلاميد'!$B$5:$G$56,6,0),\"\")","v":""}]
["",{"$f":"IFERROR(IF(ROWS($B$2:B88)>'بينات التلاميد'!$Q$5,\"\",INDEX('بينات التلاميد'!$B$5:$B$56,SMALL(IF('بينات التلاميد'!$B$5:$B$56<>\"\",ROW('بينات التلاميد'!$B$5:$B$56)-ROW($B$5)+1),ROWS($B$2:B88)))),\"\")","v":""},{"$f":"IFERROR(VLOOKUP(B88,'بينات التلاميد'!$B$5:$G$56,6,0),\"\")","v":""}]
["",{"$f":"IFERROR(IF(ROWS($B$2:B89)>'بينات التلاميد'!$Q$5,\"\",INDEX('بينات التلاميد'!$B$5:$B$56,SMALL(IF('بينات التلاميد'!$B$5:$B$56<>\"\",ROW('بينات التلاميد'!$B$5:$B$56)-ROW($B$5)+1),ROWS($B$2:B89)))),\"\")","v":""},{"$f":"IFERROR(VLOOKUP(B89,'بينات التلاميد'!$B$5:$G$56,6,0),\"\")","v":""}]
["",{"$f":"IFERROR(IF(ROWS($B$2:B90)>'بينات التلاميد'!$Q$5,\"\",INDEX('بينات التلاميد'!$B$5:$B$56,SMALL(IF('بينات التلاميد'!$B$5:$B$56<>\"\",ROW('بينات التلاميد'!$B$5:$B$56)-ROW($B$5)+1),ROWS($B$2:B90)))),\"\")","v":""},{"$f":"IFERROR(VLOOKUP(B90,'بينات التلاميد'!$B$5:$G$56,6,0),\"\")","v":""}]
["",{"$f":"IFERROR(IF(ROWS($B$2:B91)>'بينات التلاميد'!$Q$5,\"\",INDEX('بينات التلاميد'!$B$5:$B$56,SMALL(IF('بينات التلاميد'!$B$5:$B$56<>\"\",ROW('بينات التلاميد'!$B$5:$B$56)-ROW($B$5)+1),ROWS($B$2:B91)))),\"\")","v":""},{"$f":"IFERROR(VLOOKUP(B91,'بينات التلاميد'!$B$5:$G$56,6,0),\"\")","v":""}]
["",{"$f":"IFERROR(IF(ROWS($B$2:B92)>'بينات التلاميد'!$Q$5,\"\",INDEX('بينات التلاميد'!$B$5:$B$56,SMALL(IF('بينات التلاميد'!$B$5:$B$56<>\"\",ROW('بينات التلاميد'!$B$5:$B$56)-ROW($B$5)+1),ROWS($B$2:B92)))),\"\")","v":""},{"$f":"IFERROR(VLOOKUP(B92,'بينات التلاميد'!$B$5:$G$56,6,0),\"\")","v":""}]
["",{"$f":"IFERROR(IF(ROWS($B$2:B93)>'بينات التلاميد'!$Q$5,\"\",INDEX('بينات التلاميد'!$B$5:$B$56,SMALL(IF('بينات التلاميد'!$B$5:$B$56<>\"\",ROW('بينات التلاميد'!$B$5:$B$56)-ROW($B$5)+1),ROWS($B$2:B93)))),\"\")","v":""},{"$f":"IFERROR(VLOOKUP(B93,'بينات التلاميد'!$B$5:$G$56,6,0),\"\")","v":""}]
["",{"$f":"IFERROR(IF(ROWS($B$2:B94)>'بينات التلاميد'!$Q$5,\"\",INDEX('بينات التلاميد'!$B$5:$B$56,SMALL(IF('بينات التلاميد'!$B$5:$B$56<>\"\",ROW('بينات التلاميد'!$B$5:$B$56)-ROW($B$5)+1),ROWS($B$2:B94)))),\"\")","v":""},{"$f":"IFERROR(VLOOKUP(B94,'بينات التلاميد'!$B$5:$G$56,6,0),\"\")","v":""}]
["",{"$f":"IFERROR(IF(ROWS($B$2:B95)>'بينات التلاميد'!$Q$5,\"\",INDEX('بينات التلاميد'!$B$5:$B$56,SMALL(IF('بينات التلاميد'!$B$5:$B$56<>\"\",ROW('بينات التلاميد'!$B$5:$B$56)-ROW($B$5)+1),ROWS($B$2:B95)))),\"\")","v":""},{"$f":"IFERROR(VLOOKUP(B95,'بينات التلاميد'!$B$5:$G$56,6,0),\"\")","v":""}]
["",{"$f":"IFERROR(IF(ROWS($B$2:B96)>'بينات التلاميد'!$Q$5,\"\",INDEX('بينات التلاميد'!$B$5:$B$56,SMALL(IF('بينات التلاميد'!$B$5:$B$56<>\"\",ROW('بينات التلاميد'!$B$5:$B$56)-ROW($B$5)+1),ROWS($B$2:B96)))),\"\")","v":""},{"$f":"IFERROR(VLOOKUP(B96,'بينات التلاميد'!$B$5:$G$56,6,0),\"\")","v":""}]
["",{"$f":"IFERROR(IF(ROWS($B$2:B97)>'بينات التلاميد'!$Q$5,\"\",INDEX('بينات التلاميد'!$B$5:$B$56,SMALL(IF('بينات التلاميد'!$B$5:$B$56<>\"\",ROW('بينات التلاميد'!$B$5:$B$56)-ROW($B$5)+1),ROWS($B$2:B97)))),\"\")","v":""},{"$f":"IFERROR(VLOOKUP(B97,'بينات التلاميد'!$B$5:$G$56,6,0),\"\")","v":""}]
["",{"$f":"IFERROR(IF(ROWS($B$2:B98)>'بينات التلاميد'!$Q$5,\"\",INDEX('بينات التلاميد'!$B$5:$B$56,SMALL(IF('بينات التلاميد'!$B$5:$B$56<>\"\",ROW('بينات التلاميد'!$B$5:$B$56)-ROW($B$5)+1),ROWS($B$2:B98)))),\"\")","v":""},{"$f":"IFERROR(VLOOKUP(B98,'بينات التلاميد'!$B$5:$G$56,6,0),\"\")","v":""}]
["",{"$f":"IFERROR(IF(ROWS($B$2:B99)>'بينات التلاميد'!$Q$5,\"\",INDEX('بينات التلاميد'!$B$5:$B$56,SMALL(IF('بينات التلاميد'!$B$5:$B$56<>\"\",ROW('بينات التلاميد'!$B$5:$B$56)-ROW($B$5)+1),ROWS($B$2:B99)))),\"\")","v":""},{"$f":"IFERROR(VLOOKUP(B99,'بينات التلاميد'!$B$5:$G$56,6,0),\"\")","v":""}]
["",{"$f":"IFERROR(IF(ROWS($B$2:B100)>'بينات التلاميد'!$Q$5,\"\",INDEX('بينات التلاميد'!$B$5:$B$56,SMALL(IF('بينات التلاميد'!$B$5:$B$56<>\"\",ROW('بينات التلاميد'!$B$5:$B$56)-ROW($B$5)+1),ROWS($B$2:B100)))),\"\")","v":""},{"$f":"IFERROR(VLOOKUP(B100,'بينات التلاميد'!$B$5:$G$56,6,0),\"\")","v":""}]
["",{"$f":"IFERROR(IF(ROWS($B$2:B101)>'بينات التلاميد'!$Q$5,\"\",INDEX('بينات التلاميد'!$B$5:$B$56,SMALL(IF('بينات التلاميد'!$B$5:$B$56<>\"\",ROW('بينات التلاميد'!$B$5:$B$56)-ROW($B$5)+1),ROWS($B$2:B101)))),\"\")","v":""},{"$f":"IFERROR(VLOOKUP(B101,'بينات التلاميد'!$B$5:$G$56,6,0),\"\")","v":""}]
["",{"$f":"IFERROR(IF(ROWS($B$2:B102)>'بينات التلاميد'!$Q$5,\"\",INDEX('بينات التلاميد'!$B$5:$B$56,SMALL(IF('بينات التلاميد'!$B$5:$B$56<>\"\",ROW('بينات التلاميد'!$B$5:$B$56)-ROW($B$5)+1),ROWS($B$2:B102)))),\"\")","v":""},{"$f":"IFERROR(VLOOKUP(B102,'بينات التلاميد'!$B$5:$G$56,6,0),\"\")","v":""}]
["",{"$f":"IFERROR(IF(ROWS($B$2:B103)>'بينات التلاميد'!$Q$5,\"\",INDEX('بينات التلاميد'!$B$5:$B$56,SMALL(IF('بينات التلاميد'!$B$5:$B$56<>\"\",ROW('بينات التلاميد'!$B$5:$B$56)-ROW($B$5)+1),ROWS($B$2:B103)))),\"\")","v":""},{"$f":"IFERROR(VLOOKUP(B103,'بينات التلاميد'!$B$5:$G$56,6,0),\"\")","v":""}]
["",{"$f":"IFERROR(IF(ROWS($B$2:B104)>'بينات التلاميد'!$Q$5,\"\",INDEX('بينات التلاميد'!$B$5:$B$56,SMALL(IF('بينات التلاميد'!$B$5:$B$56<>\"\",ROW('بينات التلاميد'!$B$5:$B$56)-ROW($B$5)+1),ROWS($B$2:B104)))),\"\")","v":""},{"$f":"IFERROR(VLOOKUP(B104,'بينات التلاميد'!$B$5:$G$56,6,0),\"\")","v":""}]
["",{"$f":"IFERROR(IF(ROWS($B$2:B105)>'بينات التلاميد'!$Q$5,\"\",INDEX('بينات التلاميد'!$B$5:$B$56,SMALL(IF('بينات التلاميد'!$B$5:$B$56<>\"\",ROW('بينات التلاميد'!$B$5:$B$56)-ROW($B$5)+1),ROWS($B$2:B105)))),\"\")","v":""},{"$f":"IFERROR(VLOOKUP(B105,'بينات التلاميد'!$B$5:$G$56,6,0),\"\")","v":""}]
["",{"$f":"IFERROR(IF(ROWS($B$2:B106)>'بينات التلاميد'!$Q$5,\"\",INDEX('بينات التلاميد'!$B$5:$B$56,SMALL(IF('بينات التلاميد'!$B$5:$B$56<>\"\",ROW('بينات التلاميد'!$B$5:$B$56)-ROW($B$5)+1),ROWS($B$2:B106)))),\"\")","v":""},{"$f":"IFERROR(VLOOKUP(B106,'بينات التلاميد'!$B$5:$G$56,6,0),\"\")","v":""}]
["",{"$f":"IFERROR(IF(ROWS($B$2:B107)>'بينات التلاميد'!$Q$5,\"\",INDEX('بينات التلاميد'!$B$5:$B$56,SMALL(IF('بينات التلاميد'!$B$5:$B$56<>\"\",ROW('بينات التلاميد'!$B$5:$B$56)-ROW($B$5)+1),ROWS($B$2:B107)))),\"\")","v":""},{"$f":"IFERROR(VLOOKUP(B107,'بينات التلاميد'!$B$5:$G$56,6,0),\"\")","v":""}]
["",{"$f":"IFERROR(IF(ROWS($B$2:B108)>'بينات التلاميد'!$Q$5,\"\",INDEX('بينات التلاميد'!$B$5:$B$56,SMALL(IF('بينات التلاميد'!$B$5:$B$56<>\"\",ROW('بينات التلاميد'!$B$5:$B$56)-ROW($B$5)+1),ROWS($B$2:B108)))),\"\")","v":""},{"$f":"IFERROR(VLOOKUP(B108,'بينات التلاميد'!$B$5:$G$56,6,0),\"\")","v":""}]
["",{"$f":"IFERROR(IF(ROWS($B$2:B109)>'بينات التلاميد'!$Q$5,\"\",INDEX('بينات التلاميد'!$B$5:$B$56,SMALL(IF('بينات التلاميد'!$B$5:$B$56<>\"\",ROW('بينات التلاميد'!$B$5:$B$56)-ROW($B$5)+1),ROWS($B$2:B109)))),\"\")","v":""},{"$f":"IFERROR(VLOOKUP(B109,'بينات التلاميد'!$B$5:$G$56,6,0),\"\")","v":""}]
["",{"$f":"IFERROR(IF(ROWS($B$2:B110)>'بينات التلاميد'!$Q$5,\"\",INDEX('بينات التلاميد'!$B$5:$B$56,SMALL(IF('بينات التلاميد'!$B$5:$B$56<>\"\",ROW('بينات التلاميد'!$B$5:$B$56)-ROW($B$5)+1),ROWS($B$2:B110)))),\"\")","v":""},{"$f":"IFERROR(VLOOKUP(B110,'بينات التلاميد'!$B$5:$G$56,6,0),\"\")","v":""}]
["",{"$f":"IFERROR(IF(ROWS($B$2:B111)>'بينات التلاميد'!$Q$5,\"\",INDEX('بينات التلاميد'!$B$5:$B$56,SMALL(IF('بينات التلاميد'!$B$5:$B$56<>\"\",ROW('بينات التلاميد'!$B$5:$B$56)-ROW($B$5)+1),ROWS($B$2:B111)))),\"\")","v":""},{"$f":"IFERROR(VLOOKUP(B111,'بينات التلاميد'!$B$5:$G$56,6,0),\"\")","v":""}]
["",{"$f":"IFERROR(IF(ROWS($B$2:B112)>'بينات التلاميد'!$Q$5,\"\",INDEX('بينات التلاميد'!$B$5:$B$56,SMALL(IF('بينات التلاميد'!$B$5:$B$56<>\"\",ROW('بينات التلاميد'!$B$5:$B$56)-ROW($B$5)+1),ROWS($B$2:B112)))),\"\")","v":""},{"$f":"IFERROR(VLOOKUP(B112,'بينات التلاميد'!$B$5:$G$56,6,0),\"\")","v":""}]
["",{"$f":"IFERROR(IF(ROWS($B$2:B113)>'بينات التلاميد'!$Q$5,\"\",INDEX('بينات التلاميد'!$B$5:$B$56,SMALL(IF('بينات التلاميد'!$B$5:$B$56<>\"\",ROW('بينات التلاميد'!$B$5:$B$56)-ROW($B$5)+1),ROWS($B$2:B113)))),\"\")","v":""},{"$f":"IFERROR(VLOOKUP(B113,'بينات التلاميد'!$B$5:$G$56,6,0),\"\")","v":""}]
["",{"$f":"IFERROR(IF(ROWS($B$2:B114)>'بينات التلاميد'!$Q$5,\"\",INDEX('بينات التلاميد'!$B$5:$B$56,SMALL(IF('بينات التلاميد'!$B$5:$B$56<>\"\",ROW('بينات التلاميد'!$B$5:$B$56)-ROW($B$5)+1),ROWS($B$2:B114)))),\"\")","v":""},{"$f":"IFERROR(VLOOKUP(B114,'بينات التلاميد'!$B$5:$G$56,6,0),\"\")","v":""}]
["",{"$f":"IFERROR(IF(ROWS($B$2:B115)>'بينات التلاميد'!$Q$5,\"\",INDEX('بينات التلاميد'!$B$5:$B$56,SMALL(IF('بينات التلاميد'!$B$5:$B$56<>\"\",ROW('بينات التلاميد'!$B$5:$B$56)-ROW($B$5)+1),ROWS($B$2:B115)))),\"\")","v":""},{"$f":"IFERROR(VLOOKUP(B115,'بينات التلاميد'!$B$5:$G$56,6,0),\"\")","v":""}]
["",{"$f":"IFERROR(IF(ROWS($B$2:B116)>'بينات التلاميد'!$Q$5,\"\",INDEX('بينات التلاميد'!$B$5:$B$56,SMALL(IF('بينات التلاميد'!$B$5:$B$56<>\"\",ROW('بينات التلاميد'!$B$5:$B$56)-ROW($B$5)+1),ROWS($B$2:B116)))),\"\")","v":""},{"$f":"IFERROR(VLOOKUP(B116,'بينات التلاميد'!$B$5:$G$56,6,0),\"\")","v":""}]
["",{"$f":"IFERROR(IF(ROWS($B$2:B117)>'بينات التلاميد'!$Q$5,\"\",INDEX('بينات التلاميد'!$B$5:$B$56,SMALL(IF('بينات التلاميد'!$B$5:$B$56<>\"\",ROW('بينات التلاميد'!$B$5:$B$56)-ROW($B$5)+1),ROWS($B$2:B117)))),\"\")","v":""},{"$f":"IFERROR(VLOOKUP(B117,'بينات التلاميد'!$B$5:$G$56,6,0),\"\")","v":""}]
["",{"$f":"IFERROR(IF(ROWS($B$2:B118)>'بينات التلاميد'!$Q$5,\"\",INDEX('بينات التلاميد'!$B$5:$B$56,SMALL(IF('بينات التلاميد'!$B$5:$B$56<>\"\",ROW('بينات التلاميد'!$B$5:$B$56)-ROW($B$5)+1),ROWS($B$2:B118)))),\"\")","v":""},{"$f":"IFERROR(VLOOKUP(B118,'بينات التلاميد'!$B$5:$G$56,6,0),\"\")","v":""}]
["",{"$f":"IFERROR(IF(ROWS($B$2:B119)>'بينات التلاميد'!$Q$5,\"\",INDEX('بينات التلاميد'!$B$5:$B$56,SMALL(IF('بينات التلاميد'!$B$5:$B$56<>\"\",ROW('بينات التلاميد'!$B$5:$B$56)-ROW($B$5)+1),ROWS($B$2:B119)))),\"\")","v":""},{"$f":"IFERROR(VLOOKUP(B119,'بينات التلاميد'!$B$5:$G$56,6,0),\"\")","v":""}]
["",{"$f":"IFERROR(IF(ROWS($B$2:B120)>'بينات التلاميد'!$Q$5,\"\",INDEX('بينات التلاميد'!$B$5:$B$56,SMALL(IF('بينات التلاميد'!$B$5:$B$56<>\"\",ROW('بينات التلاميد'!$B$5:$B$56)-ROW($B$5)+1),ROWS($B$2:B120)))),\"\")","v":""},{"$f":"IFERROR(VLOOKUP(B120,'بينات التلاميد'!$B$5:$G$56,6,0),\"\")","v":""}]
["",{"$f":"IFERROR(IF(ROWS($B$2:B121)>'بينات التلاميد'!$Q$5,\"\",INDEX('بينات التلاميد'!$B$5:$B$56,SMALL(IF('بينات التلاميد'!$B$5:$B$56<>\"\",ROW('بينات التلاميد'!$B$5:$B$56)-ROW($B$5)+1),ROWS($B$2:B121)))),\"\")","v":""},{"$f":"IFERROR(VLOOKUP(B121,'بينات التلاميد'!$B$5:$G$56,6,0),\"\")","v":""}]
["",{"$f":"IFERROR(IF(ROWS($B$2:B122)>'بينات التلاميد'!$Q$5,\"\",INDEX('بينات التلاميد'!$B$5:$B$56,SMALL(IF('بينات التلاميد'!$B$5:$B$56<>\"\",ROW('بينات التلاميد'!$B$5:$B$56)-ROW($B$5)+1),ROWS($B$2:B122)))),\"\")","v":""},{"$f":"IFERROR(VLOOKUP(B122,'بينات التلاميد'!$B$5:$G$56,6,0),\"\")","v":""}]
["",{"$f":"IFERROR(IF(ROWS($B$2:B123)>'بينات التلاميد'!$Q$5,\"\",INDEX('بينات التلاميد'!$B$5:$B$56,SMALL(IF('بينات التلاميد'!$B$5:$B$56<>\"\",ROW('بينات التلاميد'!$B$5:$B$56)-ROW($B$5)+1),ROWS($B$2:B123)))),\"\")","v":""},{"$f":"IFERROR(VLOOKUP(B123,'بينات التلاميد'!$B$5:$G$56,6,0),\"\")","v":""}]
["",{"$f":"IFERROR(IF(ROWS($B$2:B124)>'بينات التلاميد'!$Q$5,\"\",INDEX('بينات التلاميد'!$B$5:$B$56,SMALL(IF('بينات التلاميد'!$B$5:$B$56<>\"\",ROW('بينات التلاميد'!$B$5:$B$56)-ROW($B$5)+1),ROWS($B$2:B124)))),\"\")","v":""},{"$f":"IFERROR(VLOOKUP(B124,'بينات التلاميد'!$B$5:$G$56,6,0),\"\")","v":""}]
["",{"$f":"IFERROR(IF(ROWS($B$2:B125)>'بينات التلاميد'!$Q$5,\"\",INDEX('بينات التلاميد'!$B$5:$B$56,SMALL(IF('بينات التلاميد'!$B$5:$B$56<>\"\",ROW('بينات التلاميد'!$B$5:$B$56)-ROW($B$5)+1),ROWS($B$2:B125)))),\"\")","v":""},{"$f":"IFERROR(VLOOKUP(B125,'بينات التلاميد'!$B$5:$G$56,6,0),\"\")","v":""}]
["",{"$f":"IFERROR(IF(ROWS($B$2:B126)>'بينات التلاميد'!$Q$5,\"\",INDEX('بينات التلاميد'!$B$5:$B$56,SMALL(IF('بينات التلاميد'!$B$5:$B$56<>\"\",ROW('بينات التلاميد'!$B$5:$B$56)-ROW($B$5)+1),ROWS($B$2:B126)))),\"\")","v":""},{"$f":"IFERROR(VLOOKUP(B126,'بينات التلاميد'!$B$5:$G$56,6,0),\"\")","v":""}]
["",{"$f":"IFERROR(IF(ROWS($B$2:B127)>'بينات التلاميد'!$Q$5,\"\",INDEX('بينات التلاميد'!$B$5:$B$56,SMALL(IF('بينات التلاميد'!$B$5:$B$56<>\"\",ROW('بينات التلاميد'!$B$5:$B$56)-ROW($B$5)+1),ROWS($B$2:B127)))),\"\")","v":""},{"$f":"IFERROR(VLOOKUP(B127,'بينات التلاميد'!$B$5:$G$56,6,0),\"\")","v":""}]
["",{"$f":"IFERROR(IF(ROWS($B$2:B128)>'بينات التلاميد'!$Q$5,\"\",INDEX('بينات التلاميد'!$B$5:$B$56,SMALL(IF('بينات التلاميد'!$B$5:$B$56<>\"\",ROW('بينات التلاميد'!$B$5:$B$56)-ROW($B$5)+1),ROWS($B$2:B128)))),\"\")","v":""},{"$f":"IFERROR(VLOOKUP(B128,'بينات التلاميد'!$B$5:$G$56,6,0),\"\")","v":""}]
["",{"$f":"IFERROR(IF(ROWS($B$2:B129)>'بينات التلاميد'!$Q$5,\"\",INDEX('بينات التلاميد'!$B$5:$B$56,SMALL(IF('بينات التلاميد'!$B$5:$B$56<>\"\",ROW('بينات التلاميد'!$B$5:$B$56)-ROW($B$5)+1),ROWS($B$2:B129)))),\"\")","v":""},{"$f":"IFERROR(VLOOKUP(B129,'بينات التلاميد'!$B$5:$G$56,6,0),\"\")","v":""}]
[{"$f":"IFERROR(VLOOKUP(C130,$D$2:$E$20,2,0),\"\")","v":""},{"$f":"IFERROR(IF(ROWS($B$2:B130)>'بينات التلاميد'!$Q$5,\"\",INDEX('بينات التلاميد'!$B$5:$B$56,SMALL(IF('بينات التلاميد'!$B$5:$B$56<>\"\",ROW('بينات التلاميد'!$B$5:$B$56)-ROW($B$5)+1),ROWS($B$2:B130)))),\"\")","v":""},{"$f":"IFERROR(VLOOKUP(B130,'بينات التلاميد'!$B$5:$G$56,6,0),\"\")","v":""}]
["",{"$f":"IFERROR(IF(ROWS($B$2:B131)>'بينات التلاميد'!$Q$5,\"\",INDEX('بينات التلاميد'!$B$5:$B$56,SMALL(IF('بينات التلاميد'!$B$5:$B$56<>\"\",ROW('بينات التلاميد'!$B$5:$B$56)-ROW($B$5)+1),ROWS($B$2:B131)))),\"\")","v":""},{"$f":"IFERROR(VLOOKUP(B131,'بينات التلاميد'!$B$5:$G$56,6,0),\"\")","v":""}]
["",{"$f":"IFERROR(IF(ROWS($B$2:B132)>'بينات التلاميد'!$Q$5,\"\",INDEX('بينات التلاميد'!$B$5:$B$56,SMALL(IF('بينات التلاميد'!$B$5:$B$56<>\"\",ROW('بينات التلاميد'!$B$5:$B$56)-ROW($B$5)+1),ROWS($B$2:B132)))),\"\")","v":""},{"$f":"IFERROR(VLOOKUP(B132,'بينات التلاميد'!$B$5:$G$56,6,0),\"\")","v":""}]
["",{"$f":"IFERROR(IF(ROWS($B$2:B133)>'بينات التلاميد'!$Q$5,\"\",INDEX('بينات التلاميد'!$B$5:$B$56,SMALL(IF('بينات التلاميد'!$B$5:$B$56<>\"\",ROW('بينات التلاميد'!$B$5:$B$56)-ROW($B$5)+1),ROWS($B$2:B133)))),\"\")","v":""},{"$f":"IFERROR(VLOOKUP(B133,'بينات التلاميد'!$B$5:$G$56,6,0),\"\")","v":""}]
["",{"$f":"IFERROR(IF(ROWS($B$2:B134)>'بينات التلاميد'!$Q$5,\"\",INDEX('بينات التلاميد'!$B$5:$B$56,SMALL(IF('بينات التلاميد'!$B$5:$B$56<>\"\",ROW('بينات التلاميد'!$B$5:$B$56)-ROW($B$5)+1),ROWS($B$2:B134)))),\"\")","v":""},{"$f":"IFERROR(VLOOKUP(B134,'بينات التلاميد'!$B$5:$G$56,6,0),\"\")","v":""}]
["",{"$f":"IFERROR(IF(ROWS($B$2:B135)>'بينات التلاميد'!$Q$5,\"\",INDEX('بينات التلاميد'!$B$5:$B$56,SMALL(IF('بينات التلاميد'!$B$5:$B$56<>\"\",ROW('بينات التلاميد'!$B$5:$B$56)-ROW($B$5)+1),ROWS($B$2:B135)))),\"\")","v":""},{"$f":"IFERROR(VLOOKUP(B135,'بينات التلاميد'!$B$5:$G$56,6,0),\"\")","v":""}]
["",{"$f":"IFERROR(IF(ROWS($B$2:B136)>'بينات التلاميد'!$Q$5,\"\",INDEX('بينات التلاميد'!$B$5:$B$56,SMALL(IF('بينات التلاميد'!$B$5:$B$56<>\"\",ROW('بينات التلاميد'!$B$5:$B$56)-ROW($B$5)+1),ROWS($B$2:B136)))),\"\")","v":""},{"$f":"IFERROR(VLOOKUP(B136,'بينات التلاميد'!$B$5:$G$56,6,0),\"\")","v":""}]
["",{"$f":"IFERROR(IF(ROWS($B$2:B137)>'بينات التلاميد'!$Q$5,\"\",INDEX('بينات التلاميد'!$B$5:$B$56,SMALL(IF('بينات التلاميد'!$B$5:$B$56<>\"\",ROW('بينات التلاميد'!$B$5:$B$56)-ROW($B$5)+1),ROWS($B$2:B137)))),\"\")","v":""},{"$f":"IFERROR(VLOOKUP(B137,'بينات التلاميد'!$B$5:$G$56,6,0),\"\")","v":""}]
["",{"$f":"IFERROR(IF(ROWS($B$2:B138)>'بينات التلاميد'!$Q$5,\"\",INDEX('بينات التلاميد'!$B$5:$B$56,SMALL(IF('بينات التلاميد'!$B$5:$B$56<>\"\",ROW('بينات التلاميد'!$B$5:$B$56)-ROW($B$5)+1),ROWS($B$2:B138)))),\"\")","v":""},{"$f":"IFERROR(VLOOKUP(B138,'بينات التلاميد'!$B$5:$G$56,6,0),\"\")","v":""}]
["",{"$f":"IFERROR(IF(ROWS($B$2:B139)>'بينات التلاميد'!$Q$5,\"\",INDEX('بينات التلاميد'!$B$5:$B$56,SMALL(IF('بينات التلاميد'!$B$5:$B$56<>\"\",ROW('بينات التلاميد'!$B$5:$B$56)-ROW($B$5)+1),ROWS($B$2:B139)))),\"\")","v":""},{"$f":"IFERROR(VLOOKUP(B139,'بينات التلاميد'!$B$5:$G$56,6,0),\"\")","v":""}]
["",{"$f":"IFERROR(IF(ROWS($B$2:B140)>'بينات التلاميد'!$Q$5,\"\",INDEX('بينات التلاميد'!$B$5:$B$56,SMALL(IF('بينات التلاميد'!$B$5:$B$56<>\"\",ROW('بينات التلاميد'!$B$5:$B$56)-ROW($B$5)+1),ROWS($B$2:B140)))),\"\")","v":""},{"$f":"IFERROR(VLOOKUP(B140,'بينات التلاميد'!$B$5:$G$56,6,0),\"\")","v":""}]
["",{"$f":"IFERROR(IF(ROWS($B$2:B141)>'بينات التلاميد'!$Q$5,\"\",INDEX('بينات التلاميد'!$B$5:$B$56,SMALL(IF('بينات التلاميد'!$B$5:$B$56<>\"\",ROW('بينات التلاميد'!$B$5:$B$56)-ROW($B$5)+1),ROWS($B$2:B141)))),\"\")","v":""},{"$f":"IFERROR(VLOOKUP(B141,'بينات التلاميد'!$B$5:$G$56,6,0),\"\")","v":""}]
["",{"$f":"IFERROR(IF(ROWS($B$2:B142)>'بينات التلاميد'!$Q$5,\"\",INDEX('بينات التلاميد'!$B$5:$B$56,SMALL(IF('بينات التلاميد'!$B$5:$B$56<>\"\",ROW('بينات التلاميد'!$B$5:$B$56)-ROW($B$5)+1),ROWS($B$2:B142)))),\"\")","v":""},{"$f":"IFERROR(VLOOKUP(B142,'بينات التلاميد'!$B$5:$G$56,6,0),\"\")","v":""}]
["",{"$f":"IFERROR(IF(ROWS($B$2:B143)>'بينات التلاميد'!$Q$5,\"\",INDEX('بينات التلاميد'!$B$5:$B$56,SMALL(IF('بينات التلاميد'!$B$5:$B$56<>\"\",ROW('بينات التلاميد'!$B$5:$B$56)-ROW($B$5)+1),ROWS($B$2:B143)))),\"\")","v":""},{"$f":"IFERROR(VLOOKUP(B143,'بينات التلاميد'!$B$5:$G$56,6,0),\"\")","v":""}]
["",{"$f":"IFERROR(IF(ROWS($B$2:B144)>'بينات التلاميد'!$Q$5,\"\",INDEX('بينات التلاميد'!$B$5:$B$56,SMALL(IF('بينات التلاميد'!$B$5:$B$56<>\"\",ROW('بينات التلاميد'!$B$5:$B$56)-ROW($B$5)+1),ROWS($B$2:B144)))),\"\")","v":""},{"$f":"IFERROR(VLOOKUP(B144,'بينات التلاميد'!$B$5:$G$56,6,0),\"\")","v":""}]
["",{"$f":"IFERROR(IF(ROWS($B$2:B145)>'بينات التلاميد'!$Q$5,\"\",INDEX('بينات التلاميد'!$B$5:$B$56,SMALL(IF('بينات التلاميد'!$B$5:$B$56<>\"\",ROW('بينات التلاميد'!$B$5:$B$56)-ROW($B$5)+1),ROWS($B$2:B145)))),\"\")","v":""},{"$f":"IFERROR(VLOOKUP(B145,'بينات التلاميد'!$B$5:$G$56,6,0),\"\")","v":""}]
["",{"$f":"IFERROR(IF(ROWS($B$2:B146)>'بينات التلاميد'!$Q$5,\"\",INDEX('بينات التلاميد'!$B$5:$B$56,SMALL(IF('بينات التلاميد'!$B$5:$B$56<>\"\",ROW('بينات التلاميد'!$B$5:$B$56)-ROW($B$5)+1),ROWS($B$2:B146)))),\"\")","v":""},{"$f":"IFERROR(VLOOKUP(B146,'بينات التلاميد'!$B$5:$G$56,6,0),\"\")","v":""}]
["",{"$f":"IFERROR(IF(ROWS($B$2:B147)>'بينات التلاميد'!$Q$5,\"\",INDEX('بينات التلاميد'!$B$5:$B$56,SMALL(IF('بينات التلاميد'!$B$5:$B$56<>\"\",ROW('بينات التلاميد'!$B$5:$B$56)-ROW($B$5)+1),ROWS($B$2:B147)))),\"\")","v":""},{"$f":"IFERROR(VLOOKUP(B147,'بينات التلاميد'!$B$5:$G$56,6,0),\"\")","v":""}]
["",{"$f":"IFERROR(IF(ROWS($B$2:B148)>'بينات التلاميد'!$Q$5,\"\",INDEX('بينات التلاميد'!$B$5:$B$56,SMALL(IF('بينات التلاميد'!$B$5:$B$56<>\"\",ROW('بينات التلاميد'!$B$5:$B$56)-ROW($B$5)+1),ROWS($B$2:B148)))),\"\")","v":""},{"$f":"IFERROR(VLOOKUP(B148,'بينات التلاميد'!$B$5:$G$56,6,0),\"\")","v":""}]
["",{"$f":"IFERROR(IF(ROWS($B$2:B149)>'بينات التلاميد'!$Q$5,\"\",INDEX('بينات التلاميد'!$B$5:$B$56,SMALL(IF('بينات التلاميد'!$B$5:$B$56<>\"\",ROW('بينات التلاميد'!$B$5:$B$56)-ROW($B$5)+1),ROWS($B$2:B149)))),\"\")","v":""},{"$f":"IFERROR(VLOOKUP(B149,'بينات التلاميد'!$B$5:$G$56,6,0),\"\")","v":""}]
["",{"$f":"IFERROR(IF(ROWS($B$2:B150)>'بينات التلاميد'!$Q$5,\"\",INDEX('بينات التلاميد'!$B$5:$B$56,SMALL(IF('بينات التلاميد'!$B$5:$B$56<>\"\",ROW('بينات التلاميد'!$B$5:$B$56)-ROW($B$5)+1),ROWS($B$2:B150)))),\"\")","v":""},{"$f":"IFERROR(VLOOKUP(B150,'بينات التلاميد'!$B$5:$G$56,6,0),\"\")","v":""}]
["",{"$f":"IFERROR(IF(ROWS($B$2:B151)>'بينات التلاميد'!$Q$5,\"\",INDEX('بينات التلاميد'!$B$5:$B$56,SMALL(IF('بينات التلاميد'!$B$5:$B$56<>\"\",ROW('بينات التلاميد'!$B$5:$B$56)-ROW($B$5)+1),ROWS($B$2:B151)))),\"\")","v":""},{"$f":"IFERROR(VLOOKUP(B151,'بينات التلاميد'!$B$5:$G$56,6,0),\"\")","v":""}]
["",{"$f":"IFERROR(IF(ROWS($B$2:B152)>'بينات التلاميد'!$Q$5,\"\",INDEX('بينات التلاميد'!$B$5:$B$56,SMALL(IF('بينات التلاميد'!$B$5:$B$56<>\"\",ROW('بينات التلاميد'!$B$5:$B$56)-ROW($B$5)+1),ROWS($B$2:B152)))),\"\")","v":""},{"$f":"IFERROR(VLOOKUP(B152,'بينات التلاميد'!$B$5:$G$56,6,0),\"\")","v":""}]
["",{"$f":"IFERROR(IF(ROWS($B$2:B153)>'بينات التلاميد'!$Q$5,\"\",INDEX('بينات التلاميد'!$B$5:$B$56,SMALL(IF('بينات التلاميد'!$B$5:$B$56<>\"\",ROW('بينات التلاميد'!$B$5:$B$56)-ROW($B$5)+1),ROWS($B$2:B153)))),\"\")","v":""},{"$f":"IFERROR(VLOOKUP(B153,'بينات التلاميد'!$B$5:$G$56,6,0),\"\")","v":""}]
["",{"$f":"IFERROR(IF(ROWS($B$2:B154)>'بينات التلاميد'!$Q$5,\"\",INDEX('بينات التلاميد'!$B$5:$B$56,SMALL(IF('بينات التلاميد'!$B$5:$B$56<>\"\",ROW('بينات التلاميد'!$B$5:$B$56)-ROW($B$5)+1),ROWS($B$2:B154)))),\"\")","v":""},{"$f":"IFERROR(VLOOKUP(B154,'بينات التلاميد'!$B$5:$G$56,6,0),\"\")","v":""}]
["",{"$f":"IFERROR(IF(ROWS($B$2:B155)>'بينات التلاميد'!$Q$5,\"\",INDEX('بينات التلاميد'!$B$5:$B$56,SMALL(IF('بينات التلاميد'!$B$5:$B$56<>\"\",ROW('بينات التلاميد'!$B$5:$B$56)-ROW($B$5)+1),ROWS($B$2:B155)))),\"\")","v":""},{"$f":"IFERROR(VLOOKUP(B155,'بينات التلاميد'!$B$5:$G$56,6,0),\"\")","v":""}]
["",{"$f":"IFERROR(IF(ROWS($B$2:B156)>'بينات التلاميد'!$Q$5,\"\",INDEX('بينات التلاميد'!$B$5:$B$56,SMALL(IF('بينات التلاميد'!$B$5:$B$56<>\"\",ROW('بينات التلاميد'!$B$5:$B$56)-ROW($B$5)+1),ROWS($B$2:B156)))),\"\")","v":""},{"$f":"IFERROR(VLOOKUP(B156,'بينات التلاميد'!$B$5:$G$56,6,0),\"\")","v":""}]
["",{"$f":"IFERROR(IF(ROWS($B$2:B157)>'بينات التلاميد'!$Q$5,\"\",INDEX('بينات التلاميد'!$B$5:$B$56,SMALL(IF('بينات التلاميد'!$B$5:$B$56<>\"\",ROW('بينات التلاميد'!$B$5:$B$56)-ROW($B$5)+1),ROWS($B$2:B157)))),\"\")","v":""},{"$f":"IFERROR(VLOOKUP(B157,'بينات التلاميد'!$B$5:$G$56,6,0),\"\")","v":""}]
["",{"$f":"IFERROR(IF(ROWS($B$2:B158)>'بينات التلاميد'!$Q$5,\"\",INDEX('بينات التلاميد'!$B$5:$B$56,SMALL(IF('بينات التلاميد'!$B$5:$B$56<>\"\",ROW('بينات التلاميد'!$B$5:$B$56)-ROW($B$5)+1),ROWS($B$2:B158)))),\"\")","v":""},{"$f":"IFERROR(VLOOKUP(B158,'بينات التلاميد'!$B$5:$G$56,6,0),\"\")","v":""}]
["",{"$f":"IFERROR(IF(ROWS($B$2:B159)>'بينات التلاميد'!$Q$5,\"\",INDEX('بينات التلاميد'!$B$5:$B$56,SMALL(IF('بينات التلاميد'!$B$5:$B$56<>\"\",ROW('بينات التلاميد'!$B$5:$B$56)-ROW($B$5)+1),ROWS($B$2:B159)))),\"\")","v":""},{"$f":"IFERROR(VLOOKUP(B159,'بينات التلاميد'!$B$5:$G$56,6,0),\"\")","v":""}]
["",{"$f":"IFERROR(IF(ROWS($B$2:B160)>'بينات التلاميد'!$Q$5,\"\",INDEX('بينات التلاميد'!$B$5:$B$56,SMALL(IF('بينات التلاميد'!$B$5:$B$56<>\"\",ROW('بينات التلاميد'!$B$5:$B$56)-ROW($B$5)+1),ROWS($B$2:B160)))),\"\")","v":""},{"$f":"IFERROR(VLOOKUP(B160,'بينات التلاميد'!$B$5:$G$56,6,0),\"\")","v":""}]
["",{"$f":"IFERROR(IF(ROWS($B$2:B161)>'بينات التلاميد'!$Q$5,\"\",INDEX('بينات التلاميد'!$B$5:$B$56,SMALL(IF('بينات التلاميد'!$B$5:$B$56<>\"\",ROW('بينات التلاميد'!$B$5:$B$56)-ROW($B$5)+1),ROWS($B$2:B161)))),\"\")","v":""},{"$f":"IFERROR(VLOOKUP(B161,'بينات التلاميد'!$B$5:$G$56,6,0),\"\")","v":""}]
["",{"$f":"IFERROR(IF(ROWS($B$2:B162)>'بينات التلاميد'!$Q$5,\"\",INDEX('بينات التلاميد'!$B$5:$B$56,SMALL(IF('بينات التلاميد'!$B$5:$B$56<>\"\",ROW('بينات التلاميد'!$B$5:$B$56)-ROW($B$5)+1),ROWS($B$2:B162)))),\"\")","v":""},{"$f":"IFERROR(VLOOKUP(B162,'بينات التلاميد'!$B$5:$G$56,6,0),\"\")","v":""}]
["",{"$f":"IFERROR(IF(ROWS($B$2:B163)>'بينات التلاميد'!$Q$5,\"\",INDEX('بينات التلاميد'!$B$5:$B$56,SMALL(IF('بينات التلاميد'!$B$5:$B$56<>\"\",ROW('بينات التلاميد'!$B$5:$B$56)-ROW($B$5)+1),ROWS($B$2:B163)))),\"\")","v":""},{"$f":"IFERROR(VLOOKUP(B163,'بينات التلاميد'!$B$5:$G$56,6,0),\"\")","v":""}]
["",{"$f":"IFERROR(IF(ROWS($B$2:B164)>'بينات التلاميد'!$Q$5,\"\",INDEX('بينات التلاميد'!$B$5:$B$56,SMALL(IF('بينات التلاميد'!$B$5:$B$56<>\"\",ROW('بينات التلاميد'!$B$5:$B$56)-ROW($B$5)+1),ROWS($B$2:B164)))),\"\")","v":""},{"$f":"IFERROR(VLOOKUP(B164,'بينات التلاميد'!$B$5:$G$56,6,0),\"\")","v":""}]
["",{"$f":"IFERROR(IF(ROWS($B$2:B165)>'بينات التلاميد'!$Q$5,\"\",INDEX('بينات التلاميد'!$B$5:$B$56,SMALL(IF('بينات التلاميد'!$B$5:$B$56<>\"\",ROW('بينات التلاميد'!$B$5:$B$56)-ROW($B$5)+1),ROWS($B$2:B165)))),\"\")","v":""},{"$f":"IFERROR(VLOOKUP(B165,'بينات التلاميد'!$B$5:$G$56,6,0),\"\")","v":""}]
["",{"$f":"IFERROR(IF(ROWS($B$2:B166)>'بينات التلاميد'!$Q$5,\"\",INDEX('بينات التلاميد'!$B$5:$B$56,SMALL(IF('بينات التلاميد'!$B$5:$B$56<>\"\",ROW('بينات التلاميد'!$B$5:$B$56)-ROW($B$5)+1),ROWS($B$2:B166)))),\"\")","v":""},{"$f":"IFERROR(VLOOKUP(B166,'بينات التلاميد'!$B$5:$G$56,6,0),\"\")","v":""}]
["",{"$f":"IFERROR(IF(ROWS($B$2:B167)>'بينات التلاميد'!$Q$5,\"\",INDEX('بينات التلاميد'!$B$5:$B$56,SMALL(IF('بينات التلاميد'!$B$5:$B$56<>\"\",ROW('بينات التلاميد'!$B$5:$B$56)-ROW($B$5)+1),ROWS($B$2:B167)))),\"\")","v":""},{"$f":"IFERROR(VLOOKUP(B167,'بينات التلاميد'!$B$5:$G$56,6,0),\"\")","v":""}]
["",{"$f":"IFERROR(IF(ROWS($B$2:B168)>'بينات التلاميد'!$Q$5,\"\",INDEX('بينات التلاميد'!$B$5:$B$56,SMALL(IF('بينات التلاميد'!$B$5:$B$56<>\"\",ROW('بينات التلاميد'!$B$5:$B$56)-ROW($B$5)+1),ROWS($B$2:B168)))),\"\")","v":""},{"$f":"IFERROR(VLOOKUP(B168,'بينات التلاميد'!$B$5:$G$56,6,0),\"\")","v":""}]
["",{"$f":"IFERROR(IF(ROWS($B$2:B169)>'بينات التلاميد'!$Q$5,\"\",INDEX('بينات التلاميد'!$B$5:$B$56,SMALL(IF('بينات التلاميد'!$B$5:$B$56<>\"\",ROW('بينات التلاميد'!$B$5:$B$56)-ROW($B$5)+1),ROWS($B$2:B169)))),\"\")","v":""},{"$f":"IFERROR(VLOOKUP(B169,'بينات التلاميد'!$B$5:$G$56,6,0),\"\")","v":""}]
["",{"$f":"IFERROR(IF(ROWS($B$2:B170)>'بينات التلاميد'!$Q$5,\"\",INDEX('بينات التلاميد'!$B$5:$B$56,SMALL(IF('بينات التلاميد'!$B$5:$B$56<>\"\",ROW('بينات التلاميد'!$B$5:$B$56)-ROW($B$5)+1),ROWS($B$2:B170)))),\"\")","v":""},{"$f":"IFERROR(VLOOKUP(B170,'بينات التلاميد'!$B$5:$G$56,6,0),\"\")","v":""}]
["",{"$f":"IFERROR(IF(ROWS($B$2:B171)>'بينات التلاميد'!$Q$5,\"\",INDEX('بينات التلاميد'!$B$5:$B$56,SMALL(IF('بينات التلاميد'!$B$5:$B$56<>\"\",ROW('بينات التلاميد'!$B$5:$B$56)-ROW($B$5)+1),ROWS($B$2:B171)))),\"\")","v":""},{"$f":"IFERROR(VLOOKUP(B171,'بينات التلاميد'!$B$5:$G$56,6,0),\"\")","v":""}]
["",{"$f":"IFERROR(IF(ROWS($B$2:B172)>'بينات التلاميد'!$Q$5,\"\",INDEX('بينات التلاميد'!$B$5:$B$56,SMALL(IF('بينات التلاميد'!$B$5:$B$56<>\"\",ROW('بينات التلاميد'!$B$5:$B$56)-ROW($B$5)+1),ROWS($B$2:B172)))),\"\")","v":""},{"$f":"IFERROR(VLOOKUP(B172,'بينات التلاميد'!$B$5:$G$56,6,0),\"\")","v":""}]
["",{"$f":"IFERROR(IF(ROWS($B$2:B173)>'بينات التلاميد'!$Q$5,\"\",INDEX('بينات التلاميد'!$B$5:$B$56,SMALL(IF('بينات التلاميد'!$B$5:$B$56<>\"\",ROW('بينات التلاميد'!$B$5:$B$56)-ROW($B$5)+1),ROWS($B$2:B173)))),\"\")","v":""},{"$f":"IFERROR(VLOOKUP(B173,'بينات التلاميد'!$B$5:$G$56,6,0),\"\")","v":""}]
["",{"$f":"IFERROR(IF(ROWS($B$2:B174)>'بينات التلاميد'!$Q$5,\"\",INDEX('بينات التلاميد'!$B$5:$B$56,SMALL(IF('بينات التلاميد'!$B$5:$B$56<>\"\",ROW('بينات التلاميد'!$B$5:$B$56)-ROW($B$5)+1),ROWS($B$2:B174)))),\"\")","v":""},{"$f":"IFERROR(VLOOKUP(B174,'بينات التلاميد'!$B$5:$G$56,6,0),\"\")","v":""}]
["",{"$f":"IFERROR(IF(ROWS($B$2:B175)>'بينات التلاميد'!$Q$5,\"\",INDEX('بينات التلاميد'!$B$5:$B$56,SMALL(IF('بينات التلاميد'!$B$5:$B$56<>\"\",ROW('بينات التلاميد'!$B$5:$B$56)-ROW($B$5)+1),ROWS($B$2:B175)))),\"\")","v":""},{"$f":"IFERROR(VLOOKUP(B175,'بينات التلاميد'!$B$5:$G$56,6,0),\"\")","v":""}]
["",{"$f":"IFERROR(IF(ROWS($B$2:B176)>'بينات التلاميد'!$Q$5,\"\",INDEX('بينات التلاميد'!$B$5:$B$56,SMALL(IF('بينات التلاميد'!$B$5:$B$56<>\"\",ROW('بينات التلاميد'!$B$5:$B$56)-ROW($B$5)+1),ROWS($B$2:B176)))),\"\")","v":""},{"$f":"IFERROR(VLOOKUP(B176,'بينات التلاميد'!$B$5:$G$56,6,0),\"\")","v":""}]
["",{"$f":"IFERROR(IF(ROWS($B$2:B177)>'بينات التلاميد'!$Q$5,\"\",INDEX('بينات التلاميد'!$B$5:$B$56,SMALL(IF('بينات التلاميد'!$B$5:$B$56<>\"\",ROW('بينات التلاميد'!$B$5:$B$56)-ROW($B$5)+1),ROWS($B$2:B177)))),\"\")","v":""},{"$f":"IFERROR(VLOOKUP(B177,'بينات التلاميد'!$B$5:$G$56,6,0),\"\")","v":""}]
["",{"$f":"IFERROR(IF(ROWS($B$2:B178)>'بينات التلاميد'!$Q$5,\"\",INDEX('بينات التلاميد'!$B$5:$B$56,SMALL(IF('بينات التلاميد'!$B$5:$B$56<>\"\",ROW('بينات التلاميد'!$B$5:$B$56)-ROW($B$5)+1),ROWS($B$2:B178)))),\"\")","v":""},{"$f":"IFERROR(VLOOKUP(B178,'بينات التلاميد'!$B$5:$G$56,6,0),\"\")","v":""}]
["",{"$f":"IFERROR(IF(ROWS($B$2:B179)>'بينات التلاميد'!$Q$5,\"\",INDEX('بينات التلاميد'!$B$5:$B$56,SMALL(IF('بينات التلاميد'!$B$5:$B$56<>\"\",ROW('بينات التلاميد'!$B$5:$B$56)-ROW($B$5)+1),ROWS($B$2:B179)))),\"\")","v":""},{"$f":"IFERROR(VLOOKUP(B179,'بينات التلاميد'!$B$5:$G$56,6,0),\"\")","v":""}]
["",{"$f":"IFERROR(IF(ROWS($B$2:B180)>'بينات التلاميد'!$Q$5,\"\",INDEX('بينات التلاميد'!$B$5:$B$56,SMALL(IF('بينات التلاميد'!$B$5:$B$56<>\"\",ROW('بينات التلاميد'!$B$5:$B$56)-ROW($B$5)+1),ROWS($B$2:B180)))),\"\")","v":""},{"$f":"IFERROR(VLOOKUP(B180,'بينات التلاميد'!$B$5:$G$56,6,0),\"\")","v":""}]
["",{"$f":"IFERROR(IF(ROWS($B$2:B181)>'بينات التلاميد'!$Q$5,\"\",INDEX('بينات التلاميد'!$B$5:$B$56,SMALL(IF('بينات التلاميد'!$B$5:$B$56<>\"\",ROW('بينات التلاميد'!$B$5:$B$56)-ROW($B$5)+1),ROWS($B$2:B181)))),\"\")","v":""},{"$f":"IFERROR(VLOOKUP(B181,'بينات التلاميد'!$B$5:$G$56,6,0),\"\")","v":""}]
["",{"$f":"IFERROR(IF(ROWS($B$2:B182)>'بينات التلاميد'!$Q$5,\"\",INDEX('بينات التلاميد'!$B$5:$B$56,SMALL(IF('بينات التلاميد'!$B$5:$B$56<>\"\",ROW('بينات التلاميد'!$B$5:$B$56)-ROW($B$5)+1),ROWS($B$2:B182)))),\"\")","v":""},{"$f":"IFERROR(VLOOKUP(B182,'بينات التلاميد'!$B$5:$G$56,6,0),\"\")","v":""}]
["",{"$f":"IFERROR(IF(ROWS($B$2:B183)>'بينات التلاميد'!$Q$5,\"\",INDEX('بينات التلاميد'!$B$5:$B$56,SMALL(IF('بينات التلاميد'!$B$5:$B$56<>\"\",ROW('بينات التلاميد'!$B$5:$B$56)-ROW($B$5)+1),ROWS($B$2:B183)))),\"\")","v":""},{"$f":"IFERROR(VLOOKUP(B183,'بينات التلاميد'!$B$5:$G$56,6,0),\"\")","v":""}]
["",{"$f":"IFERROR(IF(ROWS($B$2:B184)>'بينات التلاميد'!$Q$5,\"\",INDEX('بينات التلاميد'!$B$5:$B$56,SMALL(IF('بينات التلاميد'!$B$5:$B$56<>\"\",ROW('بينات التلاميد'!$B$5:$B$56)-ROW($B$5)+1),ROWS($B$2:B184)))),\"\")","v":""},{"$f":"IFERROR(VLOOKUP(B184,'بينات التلاميد'!$B$5:$G$56,6,0),\"\")","v":""}]
["",{"$f":"IFERROR(IF(ROWS($B$2:B185)>'بينات التلاميد'!$Q$5,\"\",INDEX('بينات التلاميد'!$B$5:$B$56,SMALL(IF('بينات التلاميد'!$B$5:$B$56<>\"\",ROW('بينات التلاميد'!$B$5:$B$56)-ROW($B$5)+1),ROWS($B$2:B185)))),\"\")","v":""},{"$f":"IFERROR(VLOOKUP(B185,'بينات التلاميد'!$B$5:$G$56,6,0),\"\")","v":""}]
["",{"$f":"IFERROR(IF(ROWS($B$2:B186)>'بينات التلاميد'!$Q$5,\"\",INDEX('بينات التلاميد'!$B$5:$B$56,SMALL(IF('بينات التلاميد'!$B$5:$B$56<>\"\",ROW('بينات التلاميد'!$B$5:$B$56)-ROW($B$5)+1),ROWS($B$2:B186)))),\"\")","v":""},{"$f":"IFERROR(VLOOKUP(B186,'بينات التلاميد'!$B$5:$G$56,6,0),\"\")","v":""}]
["",{"$f":"IFERROR(IF(ROWS($B$2:B187)>'بينات التلاميد'!$Q$5,\"\",INDEX('بينات التلاميد'!$B$5:$B$56,SMALL(IF('بينات التلاميد'!$B$5:$B$56<>\"\",ROW('بينات التلاميد'!$B$5:$B$56)-ROW($B$5)+1),ROWS($B$2:B187)))),\"\")","v":""},{"$f":"IFERROR(VLOOKUP(B187,'بينات التلاميد'!$B$5:$G$56,6,0),\"\")","v":""}]
["",{"$f":"IFERROR(IF(ROWS($B$2:B188)>'بينات التلاميد'!$Q$5,\"\",INDEX('بينات التلاميد'!$B$5:$B$56,SMALL(IF('بينات التلاميد'!$B$5:$B$56<>\"\",ROW('بينات التلاميد'!$B$5:$B$56)-ROW($B$5)+1),ROWS($B$2:B188)))),\"\")","v":""},{"$f":"IFERROR(VLOOKUP(B188,'بينات التلاميد'!$B$5:$G$56,6,0),\"\")","v":""}]
["",{"$f":"IFERROR(IF(ROWS($B$2:B189)>'بينات التلاميد'!$Q$5,\"\",INDEX('بينات التلاميد'!$B$5:$B$56,SMALL(IF('بينات التلاميد'!$B$5:$B$56<>\"\",ROW('بينات التلاميد'!$B$5:$B$56)-ROW($B$5)+1),ROWS($B$2:B189)))),\"\")","v":""},{"$f":"IFERROR(VLOOKUP(B189,'بينات التلاميد'!$B$5:$G$56,6,0),\"\")","v":""}]
["",{"$f":"IFERROR(IF(ROWS($B$2:B190)>'بينات التلاميد'!$Q$5,\"\",INDEX('بينات التلاميد'!$B$5:$B$56,SMALL(IF('بينات التلاميد'!$B$5:$B$56<>\"\",ROW('بينات التلاميد'!$B$5:$B$56)-ROW($B$5)+1),ROWS($B$2:B190)))),\"\")","v":""},{"$f":"IFERROR(VLOOKUP(B190,'بينات التلاميد'!$B$5:$G$56,6,0),\"\")","v":""}]
["",{"$f":"IFERROR(IF(ROWS($B$2:B191)>'بينات التلاميد'!$Q$5,\"\",INDEX('بينات التلاميد'!$B$5:$B$56,SMALL(IF('بينات التلاميد'!$B$5:$B$56<>\"\",ROW('بينات التلاميد'!$B$5:$B$56)-ROW($B$5)+1),ROWS($B$2:B191)))),\"\")","v":""},{"$f":"IFERROR(VLOOKUP(B191,'بينات التلاميد'!$B$5:$G$56,6,0),\"\")","v":""}]
["",{"$f":"IFERROR(IF(ROWS($B$2:B192)>'بينات التلاميد'!$Q$5,\"\",INDEX('بينات التلاميد'!$B$5:$B$56,SMALL(IF('بينات التلاميد'!$B$5:$B$56<>\"\",ROW('بينات التلاميد'!$B$5:$B$56)-ROW($B$5)+1),ROWS($B$2:B192)))),\"\")","v":""},{"$f":"IFERROR(VLOOKUP(B192,'بينات التلاميد'!$B$5:$G$56,6,0),\"\")","v":""}]
["",{"$f":"IFERROR(IF(ROWS($B$2:B193)>'بينات التلاميد'!$Q$5,\"\",INDEX('بينات التلاميد'!$B$5:$B$56,SMALL(IF('بينات التلاميد'!$B$5:$B$56<>\"\",ROW('بينات التلاميد'!$B$5:$B$56)-ROW($B$5)+1),ROWS($B$2:B193)))),\"\")","v":""},{"$f":"IFERROR(VLOOKUP(B193,'بينات التلاميد'!$B$5:$G$56,6,0),\"\")","v":""}]
[{"$f":"IFERROR(VLOOKUP(C194,$D$2:$E$20,2,0),\"\")","v":""},{"$f":"IFERROR(IF(ROWS($B$2:B194)>'بينات التلاميد'!$Q$5,\"\",INDEX('بينات التلاميد'!$B$5:$B$56,SMALL(IF('بينات التلاميد'!$B$5:$B$56<>\"\",ROW('بينات التلاميد'!$B$5:$B$56)-ROW($B$5)+1),ROWS($B$2:B194)))),\"\")","v":""},{"$f":"IFERROR(VLOOKUP(B194,'بينات التلاميد'!$B$5:$G$56,6,0),\"\")","v":""}]
["",{"$f":"IFERROR(IF(ROWS($B$2:B195)>'بينات التلاميد'!$Q$5,\"\",INDEX('بينات التلاميد'!$B$5:$B$56,SMALL(IF('بينات التلاميد'!$B$5:$B$56<>\"\",ROW('بينات التلاميد'!$B$5:$B$56)-ROW($B$5)+1),ROWS($B$2:B195)))),\"\")","v":""},{"$f":"IFERROR(VLOOKUP(B195,'بينات التلاميد'!$B$5:$G$56,6,0),\"\")","v":""}]
["",{"$f":"IFERROR(IF(ROWS($B$2:B196)>'بينات التلاميد'!$Q$5,\"\",INDEX('بينات التلاميد'!$B$5:$B$56,SMALL(IF('بينات التلاميد'!$B$5:$B$56<>\"\",ROW('بينات التلاميد'!$B$5:$B$56)-ROW($B$5)+1),ROWS($B$2:B196)))),\"\")","v":""},{"$f":"IFERROR(VLOOKUP(B196,'بينات التلاميد'!$B$5:$G$56,6,0),\"\")","v":""}]
["",{"$f":"IFERROR(IF(ROWS($B$2:B197)>'بينات التلاميد'!$Q$5,\"\",INDEX('بينات التلاميد'!$B$5:$B$56,SMALL(IF('بينات التلاميد'!$B$5:$B$56<>\"\",ROW('بينات التلاميد'!$B$5:$B$56)-ROW($B$5)+1),ROWS($B$2:B197)))),\"\")","v":""},{"$f":"IFERROR(VLOOKUP(B197,'بينات التلاميد'!$B$5:$G$56,6,0),\"\")","v":""}]
["",{"$f":"IFERROR(IF(ROWS($B$2:B198)>'بينات التلاميد'!$Q$5,\"\",INDEX('بينات التلاميد'!$B$5:$B$56,SMALL(IF('بينات التلاميد'!$B$5:$B$56<>\"\",ROW('بينات التلاميد'!$B$5:$B$56)-ROW($B$5)+1),ROWS($B$2:B198)))),\"\")","v":""},{"$f":"IFERROR(VLOOKUP(B198,'بينات التلاميد'!$B$5:$G$56,6,0),\"\")","v":""}]
["",{"$f":"IFERROR(IF(ROWS($B$2:B199)>'بينات التلاميد'!$Q$5,\"\",INDEX('بينات التلاميد'!$B$5:$B$56,SMALL(IF('بينات التلاميد'!$B$5:$B$56<>\"\",ROW('بينات التلاميد'!$B$5:$B$56)-ROW($B$5)+1),ROWS($B$2:B199)))),\"\")","v":""},{"$f":"IFERROR(VLOOKUP(B199,'بينات التلاميد'!$B$5:$G$56,6,0),\"\")","v":""}]
["",{"$f":"IFERROR(IF(ROWS($B$2:B200)>'بينات التلاميد'!$Q$5,\"\",INDEX('بينات التلاميد'!$B$5:$B$56,SMALL(IF('بينات التلاميد'!$B$5:$B$56<>\"\",ROW('بينات التلاميد'!$B$5:$B$56)-ROW($B$5)+1),ROWS($B$2:B200)))),\"\")","v":""},{"$f":"IFERROR(VLOOKUP(B200,'بينات التلاميد'!$B$5:$G$56,6,0),\"\")","v":""}]
["",{"$f":"IFERROR(IF(ROWS($B$2:B201)>'بينات التلاميد'!$Q$5,\"\",INDEX('بينات التلاميد'!$B$5:$B$56,SMALL(IF('بينات التلاميد'!$B$5:$B$56<>\"\",ROW('بينات التلاميد'!$B$5:$B$56)-ROW($B$5)+1),ROWS($B$2:B201)))),\"\")","v":""},{"$f":"IFERROR(VLOOKUP(B201,'بينات التلاميد'!$B$5:$G$56,6,0),\"\")","v":""}]
["",{"$f":"IFERROR(IF(ROWS($B$2:B202)>'بينات التلاميد'!$Q$5,\"\",INDEX('بينات التلاميد'!$B$5:$B$56,SMALL(IF('بينات التلاميد'!$B$5:$B$56<>\"\",ROW('بينات التلاميد'!$B$5:$B$56)-ROW($B$5)+1),ROWS($B$2:B202)))),\"\")","v":""},{"$f":"IFERROR(VLOOKUP(B202,'بينات التلاميد'!$B$5:$G$56,6,0),\"\")","v":""}]
["",{"$f":"IFERROR(IF(ROWS($B$2:B203)>'بينات التلاميد'!$Q$5,\"\",INDEX('بينات التلاميد'!$B$5:$B$56,SMALL(IF('بينات التلاميد'!$B$5:$B$56<>\"\",ROW('بينات التلاميد'!$B$5:$B$56)-ROW($B$5)+1),ROWS($B$2:B203)))),\"\")","v":""},{"$f":"IFERROR(VLOOKUP(B203,'بينات التلاميد'!$B$5:$G$56,6,0),\"\")","v":""}]
["",{"$f":"IFERROR(IF(ROWS($B$2:B204)>'بينات التلاميد'!$Q$5,\"\",INDEX('بينات التلاميد'!$B$5:$B$56,SMALL(IF('بينات التلاميد'!$B$5:$B$56<>\"\",ROW('بينات التلاميد'!$B$5:$B$56)-ROW($B$5)+1),ROWS($B$2:B204)))),\"\")","v":""},{"$f":"IFERROR(VLOOKUP(B204,'بينات التلاميد'!$B$5:$G$56,6,0),\"\")","v":""}]
["",{"$f":"IFERROR(IF(ROWS($B$2:B205)>'بينات التلاميد'!$Q$5,\"\",INDEX('بينات التلاميد'!$B$5:$B$56,SMALL(IF('بينات التلاميد'!$B$5:$B$56<>\"\",ROW('بينات التلاميد'!$B$5:$B$56)-ROW($B$5)+1),ROWS($B$2:B205)))),\"\")","v":""},{"$f":"IFERROR(VLOOKUP(B205,'بينات التلاميد'!$B$5:$G$56,6,0),\"\")","v":""}]
["",{"$f":"IFERROR(IF(ROWS($B$2:B206)>'بينات التلاميد'!$Q$5,\"\",INDEX('بينات التلاميد'!$B$5:$B$56,SMALL(IF('بينات التلاميد'!$B$5:$B$56<>\"\",ROW('بينات التلاميد'!$B$5:$B$56)-ROW($B$5)+1),ROWS($B$2:B206)))),\"\")","v":""},{"$f":"IFERROR(VLOOKUP(B206,'بينات التلاميد'!$B$5:$G$56,6,0),\"\")","v":""}]
["",{"$f":"IFERROR(IF(ROWS($B$2:B207)>'بينات التلاميد'!$Q$5,\"\",INDEX('بينات التلاميد'!$B$5:$B$56,SMALL(IF('بينات التلاميد'!$B$5:$B$56<>\"\",ROW('بينات التلاميد'!$B$5:$B$56)-ROW($B$5)+1),ROWS($B$2:B207)))),\"\")","v":""},{"$f":"IFERROR(VLOOKUP(B207,'بينات التلاميد'!$B$5:$G$56,6,0),\"\")","v":""}]
["",{"$f":"IFERROR(IF(ROWS($B$2:B208)>'بينات التلاميد'!$Q$5,\"\",INDEX('بينات التلاميد'!$B$5:$B$56,SMALL(IF('بينات التلاميد'!$B$5:$B$56<>\"\",ROW('بينات التلاميد'!$B$5:$B$56)-ROW($B$5)+1),ROWS($B$2:B208)))),\"\")","v":""},{"$f":"IFERROR(VLOOKUP(B208,'بينات التلاميد'!$B$5:$G$56,6,0),\"\")","v":""}]
["",{"$f":"IFERROR(IF(ROWS($B$2:B209)>'بينات التلاميد'!$Q$5,\"\",INDEX('بينات التلاميد'!$B$5:$B$56,SMALL(IF('بينات التلاميد'!$B$5:$B$56<>\"\",ROW('بينات التلاميد'!$B$5:$B$56)-ROW($B$5)+1),ROWS($B$2:B209)))),\"\")","v":""},{"$f":"IFERROR(VLOOKUP(B209,'بينات التلاميد'!$B$5:$G$56,6,0),\"\")","v":""}]
["",{"$f":"IFERROR(IF(ROWS($B$2:B210)>'بينات التلاميد'!$Q$5,\"\",INDEX('بينات التلاميد'!$B$5:$B$56,SMALL(IF('بينات التلاميد'!$B$5:$B$56<>\"\",ROW('بينات التلاميد'!$B$5:$B$56)-ROW($B$5)+1),ROWS($B$2:B210)))),\"\")","v":""},{"$f":"IFERROR(VLOOKUP(B210,'بينات التلاميد'!$B$5:$G$56,6,0),\"\")","v":""}]
["",{"$f":"IFERROR(IF(ROWS($B$2:B211)>'بينات التلاميد'!$Q$5,\"\",INDEX('بينات التلاميد'!$B$5:$B$56,SMALL(IF('بينات التلاميد'!$B$5:$B$56<>\"\",ROW('بينات التلاميد'!$B$5:$B$56)-ROW($B$5)+1),ROWS($B$2:B211)))),\"\")","v":""},{"$f":"IFERROR(VLOOKUP(B211,'بينات التلاميد'!$B$5:$G$56,6,0),\"\")","v":""}]
["",{"$f":"IFERROR(IF(ROWS($B$2:B212)>'بينات التلاميد'!$Q$5,\"\",INDEX('بينات التلاميد'!$B$5:$B$56,SMALL(IF('بينات التلاميد'!$B$5:$B$56<>\"\",ROW('بينات التلاميد'!$B$5:$B$56)-ROW($B$5)+1),ROWS($B$2:B212)))),\"\")","v":""},{"$f":"IFERROR(VLOOKUP(B212,'بينات التلاميد'!$B$5:$G$56,6,0),\"\")","v":""}]
["",{"$f":"IFERROR(IF(ROWS($B$2:B213)>'بينات التلاميد'!$Q$5,\"\",INDEX('بينات التلاميد'!$B$5:$B$56,SMALL(IF('بينات التلاميد'!$B$5:$B$56<>\"\",ROW('بينات التلاميد'!$B$5:$B$56)-ROW($B$5)+1),ROWS($B$2:B213)))),\"\")","v":""},{"$f":"IFERROR(VLOOKUP(B213,'بينات التلاميد'!$B$5:$G$56,6,0),\"\")","v":""}]
["",{"$f":"IFERROR(IF(ROWS($B$2:B214)>'بينات التلاميد'!$Q$5,\"\",INDEX('بينات التلاميد'!$B$5:$B$56,SMALL(IF('بينات التلاميد'!$B$5:$B$56<>\"\",ROW('بينات التلاميد'!$B$5:$B$56)-ROW($B$5)+1),ROWS($B$2:B214)))),\"\")","v":""},{"$f":"IFERROR(VLOOKUP(B214,'بينات التلاميد'!$B$5:$G$56,6,0),\"\")","v":""}]
["",{"$f":"IFERROR(IF(ROWS($B$2:B215)>'بينات التلاميد'!$Q$5,\"\",INDEX('بينات التلاميد'!$B$5:$B$56,SMALL(IF('بينات التلاميد'!$B$5:$B$56<>\"\",ROW('بينات التلاميد'!$B$5:$B$56)-ROW($B$5)+1),ROWS($B$2:B215)))),\"\")","v":""},{"$f":"IFERROR(VLOOKUP(B215,'بينات التلاميد'!$B$5:$G$56,6,0),\"\")","v":""}]
["",{"$f":"IFERROR(IF(ROWS($B$2:B216)>'بينات التلاميد'!$Q$5,\"\",INDEX('بينات التلاميد'!$B$5:$B$56,SMALL(IF('بينات التلاميد'!$B$5:$B$56<>\"\",ROW('بينات التلاميد'!$B$5:$B$56)-ROW($B$5)+1),ROWS($B$2:B216)))),\"\")","v":""},{"$f":"IFERROR(VLOOKUP(B216,'بينات التلاميد'!$B$5:$G$56,6,0),\"\")","v":""}]
["",{"$f":"IFERROR(IF(ROWS($B$2:B217)>'بينات التلاميد'!$Q$5,\"\",INDEX('بينات التلاميد'!$B$5:$B$56,SMALL(IF('بينات التلاميد'!$B$5:$B$56<>\"\",ROW('بينات التلاميد'!$B$5:$B$56)-ROW($B$5)+1),ROWS($B$2:B217)))),\"\")","v":""},{"$f":"IFERROR(VLOOKUP(B217,'بينات التلاميد'!$B$5:$G$56,6,0),\"\")","v":""}]
["",{"$f":"IFERROR(IF(ROWS($B$2:B218)>'بينات التلاميد'!$Q$5,\"\",INDEX('بينات التلاميد'!$B$5:$B$56,SMALL(IF('بينات التلاميد'!$B$5:$B$56<>\"\",ROW('بينات التلاميد'!$B$5:$B$56)-ROW($B$5)+1),ROWS($B$2:B218)))),\"\")","v":""},{"$f":"IFERROR(VLOOKUP(B218,'بينات التلاميد'!$B$5:$G$56,6,0),\"\")","v":""}]
["",{"$f":"IFERROR(IF(ROWS($B$2:B219)>'بينات التلاميد'!$Q$5,\"\",INDEX('بينات التلاميد'!$B$5:$B$56,SMALL(IF('بينات التلاميد'!$B$5:$B$56<>\"\",ROW('بينات التلاميد'!$B$5:$B$56)-ROW($B$5)+1),ROWS($B$2:B219)))),\"\")","v":""},{"$f":"IFERROR(VLOOKUP(B219,'بينات التلاميد'!$B$5:$G$56,6,0),\"\")","v":""}]
["",{"$f":"IFERROR(IF(ROWS($B$2:B220)>'بينات التلاميد'!$Q$5,\"\",INDEX('بينات التلاميد'!$B$5:$B$56,SMALL(IF('بينات التلاميد'!$B$5:$B$56<>\"\",ROW('بينات التلاميد'!$B$5:$B$56)-ROW($B$5)+1),ROWS($B$2:B220)))),\"\")","v":""},{"$f":"IFERROR(VLOOKUP(B220,'بينات التلاميد'!$B$5:$G$56,6,0),\"\")","v":""}]
["",{"$f":"IFERROR(IF(ROWS($B$2:B221)>'بينات التلاميد'!$Q$5,\"\",INDEX('بينات التلاميد'!$B$5:$B$56,SMALL(IF('بينات التلاميد'!$B$5:$B$56<>\"\",ROW('بينات التلاميد'!$B$5:$B$56)-ROW($B$5)+1),ROWS($B$2:B221)))),\"\")","v":""},{"$f":"IFERROR(VLOOKUP(B221,'بينات التلاميد'!$B$5:$G$56,6,0),\"\")","v":""}]
["",{"$f":"IFERROR(IF(ROWS($B$2:B222)>'بينات التلاميد'!$Q$5,\"\",INDEX('بينات التلاميد'!$B$5:$B$56,SMALL(IF('بينات التلاميد'!$B$5:$B$56<>\"\",ROW('بينات التلاميد'!$B$5:$B$56)-ROW($B$5)+1),ROWS($B$2:B222)))),\"\")","v":""},{"$f":"IFERROR(VLOOKUP(B222,'بينات التلاميد'!$B$5:$G$56,6,0),\"\")","v":""}]
["",{"$f":"IFERROR(IF(ROWS($B$2:B223)>'بينات التلاميد'!$Q$5,\"\",INDEX('بينات التلاميد'!$B$5:$B$56,SMALL(IF('بينات التلاميد'!$B$5:$B$56<>\"\",ROW('بينات التلاميد'!$B$5:$B$56)-ROW($B$5)+1),ROWS($B$2:B223)))),\"\")","v":""},{"$f":"IFERROR(VLOOKUP(B223,'بينات التلاميد'!$B$5:$G$56,6,0),\"\")","v":""}]
["",{"$f":"IFERROR(IF(ROWS($B$2:B224)>'بينات التلاميد'!$Q$5,\"\",INDEX('بينات التلاميد'!$B$5:$B$56,SMALL(IF('بينات التلاميد'!$B$5:$B$56<>\"\",ROW('بينات التلاميد'!$B$5:$B$56)-ROW($B$5)+1),ROWS($B$2:B224)))),\"\")","v":""},{"$f":"IFERROR(VLOOKUP(B224,'بينات التلاميد'!$B$5:$G$56,6,0),\"\")","v":""}]
["",{"$f":"IFERROR(IF(ROWS($B$2:B225)>'بينات التلاميد'!$Q$5,\"\",INDEX('بينات التلاميد'!$B$5:$B$56,SMALL(IF('بينات التلاميد'!$B$5:$B$56<>\"\",ROW('بينات التلاميد'!$B$5:$B$56)-ROW($B$5)+1),ROWS($B$2:B225)))),\"\")","v":""},{"$f":"IFERROR(VLOOKUP(B225,'بينات التلاميد'!$B$5:$G$56,6,0),\"\")","v":""}]
["",{"$f":"IFERROR(IF(ROWS($B$2:B226)>'بينات التلاميد'!$Q$5,\"\",INDEX('بينات التلاميد'!$B$5:$B$56,SMALL(IF('بينات التلاميد'!$B$5:$B$56<>\"\",ROW('بينات التلاميد'!$B$5:$B$56)-ROW($B$5)+1),ROWS($B$2:B226)))),\"\")","v":""},{"$f":"IFERROR(VLOOKUP(B226,'بينات التلاميد'!$B$5:$G$56,6,0),\"\")","v":""}]
["",{"$f":"IFERROR(IF(ROWS($B$2:B227)>'بينات التلاميد'!$Q$5,\"\",INDEX('بينات التلاميد'!$B$5:$B$56,SMALL(IF('بينات التلاميد'!$B$5:$B$56<>\"\",ROW('بينات التلاميد'!$B$5:$B$56)-ROW($B$5)+1),ROWS($B$2:B227)))),\"\")","v":""},{"$f":"IFERROR(VLOOKUP(B227,'بينات التلاميد'!$B$5:$G$56,6,0),\"\")","v":""}]
["",{"$f":"IFERROR(IF(ROWS($B$2:B228)>'بينات التلاميد'!$Q$5,\"\",INDEX('بينات التلاميد'!$B$5:$B$56,SMALL(IF('بينات التلاميد'!$B$5:$B$56<>\"\",ROW('بينات التلاميد'!$B$5:$B$56)-ROW($B$5)+1),ROWS($B$2:B228)))),\"\")","v":""},{"$f":"IFERROR(VLOOKUP(B228,'بينات التلاميد'!$B$5:$G$56,6,0),\"\")","v":""}]
["",{"$f":"IFERROR(IF(ROWS($B$2:B229)>'بينات التلاميد'!$Q$5,\"\",INDEX('بينات التلاميد'!$B$5:$B$56,SMALL(IF('بينات التلاميد'!$B$5:$B$56<>\"\",ROW('بينات التلاميد'!$B$5:$B$56)-ROW($B$5)+1),ROWS($B$2:B229)))),\"\")","v":""},{"$f":"IFERROR(VLOOKUP(B229,'بينات التلاميد'!$B$5:$G$56,6,0),\"\")","v":""}]
["",{"$f":"IFERROR(IF(ROWS($B$2:B230)>'بينات التلاميد'!$Q$5,\"\",INDEX('بينات التلاميد'!$B$5:$B$56,SMALL(IF('بينات التلاميد'!$B$5:$B$56<>\"\",ROW('بينات التلاميد'!$B$5:$B$56)-ROW($B$5)+1),ROWS($B$2:B230)))),\"\")","v":""},{"$f":"IFERROR(VLOOKUP(B230,'بينات التلاميد'!$B$5:$G$56,6,0),\"\")","v":""}]
["",{"$f":"IFERROR(IF(ROWS($B$2:B231)>'بينات التلاميد'!$Q$5,\"\",INDEX('بينات التلاميد'!$B$5:$B$56,SMALL(IF('بينات التلاميد'!$B$5:$B$56<>\"\",ROW('بينات التلاميد'!$B$5:$B$56)-ROW($B$5)+1),ROWS($B$2:B231)))),\"\")","v":""},{"$f":"IFERROR(VLOOKUP(B231,'بينات التلاميد'!$B$5:$G$56,6,0),\"\")","v":""}]
["",{"$f":"IFERROR(IF(ROWS($B$2:B232)>'بينات التلاميد'!$Q$5,\"\",INDEX('بينات التلاميد'!$B$5:$B$56,SMALL(IF('بينات التلاميد'!$B$5:$B$56<>\"\",ROW('بينات التلاميد'!$B$5:$B$56)-ROW($B$5)+1),ROWS($B$2:B232)))),\"\")","v":""},{"$f":"IFERROR(VLOOKUP(B232,'بينات التلاميد'!$B$5:$G$56,6,0),\"\")","v":""}]
["",{"$f":"IFERROR(IF(ROWS($B$2:B233)>'بينات التلاميد'!$Q$5,\"\",INDEX('بينات التلاميد'!$B$5:$B$56,SMALL(IF('بينات التلاميد'!$B$5:$B$56<>\"\",ROW('بينات التلاميد'!$B$5:$B$56)-ROW($B$5)+1),ROWS($B$2:B233)))),\"\")","v":""},{"$f":"IFERROR(VLOOKUP(B233,'بينات التلاميد'!$B$5:$G$56,6,0),\"\")","v":""}]
["",{"$f":"IFERROR(IF(ROWS($B$2:B234)>'بينات التلاميد'!$Q$5,\"\",INDEX('بينات التلاميد'!$B$5:$B$56,SMALL(IF('بينات التلاميد'!$B$5:$B$56<>\"\",ROW('بينات التلاميد'!$B$5:$B$56)-ROW($B$5)+1),ROWS($B$2:B234)))),\"\")","v":""},{"$f":"IFERROR(VLOOKUP(B234,'بينات التلاميد'!$B$5:$G$56,6,0),\"\")","v":""}]
["",{"$f":"IFERROR(IF(ROWS($B$2:B235)>'بينات التلاميد'!$Q$5,\"\",INDEX('بينات التلاميد'!$B$5:$B$56,SMALL(IF('بينات التلاميد'!$B$5:$B$56<>\"\",ROW('بينات التلاميد'!$B$5:$B$56)-ROW($B$5)+1),ROWS($B$2:B235)))),\"\")","v":""},{"$f":"IFERROR(VLOOKUP(B235,'بينات التلاميد'!$B$5:$G$56,6,0),\"\")","v":""}]
["",{"$f":"IFERROR(IF(ROWS($B$2:B236)>'بينات التلاميد'!$Q$5,\"\",INDEX('بينات التلاميد'!$B$5:$B$56,SMALL(IF('بينات التلاميد'!$B$5:$B$56<>\"\",ROW('بينات التلاميد'!$B$5:$B$56)-ROW($B$5)+1),ROWS($B$2:B236)))),\"\")","v":""},{"$f":"IFERROR(VLOOKUP(B236,'بينات التلاميد'!$B$5:$G$56,6,0),\"\")","v":""}]
["",{"$f":"IFERROR(IF(ROWS($B$2:B237)>'بينات التلاميد'!$Q$5,\"\",INDEX('بينات التلاميد'!$B$5:$B$56,SMALL(IF('بينات التلاميد'!$B$5:$B$56<>\"\",ROW('بينات التلاميد'!$B$5:$B$56)-ROW($B$5)+1),ROWS($B$2:B237)))),\"\")","v":""},{"$f":"IFERROR(VLOOKUP(B237,'بينات التلاميد'!$B$5:$G$56,6,0),\"\")","v":""}]
["",{"$f":"IFERROR(IF(ROWS($B$2:B238)>'بينات التلاميد'!$Q$5,\"\",INDEX('بينات التلاميد'!$B$5:$B$56,SMALL(IF('بينات التلاميد'!$B$5:$B$56<>\"\",ROW('بينات التلاميد'!$B$5:$B$56)-ROW($B$5)+1),ROWS($B$2:B238)))),\"\")","v":""},{"$f":"IFERROR(VLOOKUP(B238,'بينات التلاميد'!$B$5:$G$56,6,0),\"\")","v":""}]
["",{"$f":"IFERROR(IF(ROWS($B$2:B239)>'بينات التلاميد'!$Q$5,\"\",INDEX('بينات التلاميد'!$B$5:$B$56,SMALL(IF('بينات التلاميد'!$B$5:$B$56<>\"\",ROW('بينات التلاميد'!$B$5:$B$56)-ROW($B$5)+1),ROWS($B$2:B239)))),\"\")","v":""},{"$f":"IFERROR(VLOOKUP(B239,'بينات التلاميد'!$B$5:$G$56,6,0),\"\")","v":""}]
["",{"$f":"IFERROR(IF(ROWS($B$2:B240)>'بينات التلاميد'!$Q$5,\"\",INDEX('بينات التلاميد'!$B$5:$B$56,SMALL(IF('بينات التلاميد'!$B$5:$B$56<>\"\",ROW('بينات التلاميد'!$B$5:$B$56)-ROW($B$5)+1),ROWS($B$2:B240)))),\"\")","v":""},{"$f":"IFERROR(VLOOKUP(B240,'بينات التلاميد'!$B$5:$G$56,6,0),\"\")","v":""}]
["",{"$f":"IFERROR(IF(ROWS($B$2:B241)>'بينات التلاميد'!$Q$5,\"\",INDEX('بينات التلاميد'!$B$5:$B$56,SMALL(IF('بينات التلاميد'!$B$5:$B$56<>\"\",ROW('بينات التلاميد'!$B$5:$B$56)-ROW($B$5)+1),ROWS($B$2:B241)))),\"\")","v":""},{"$f":"IFERROR(VLOOKUP(B241,'بينات التلاميد'!$B$5:$G$56,6,0),\"\")","v":""}]
["",{"$f":"IFERROR(IF(ROWS($B$2:B242)>'بينات التلاميد'!$Q$5,\"\",INDEX('بينات التلاميد'!$B$5:$B$56,SMALL(IF('بينات التلاميد'!$B$5:$B$56<>\"\",ROW('بينات التلاميد'!$B$5:$B$56)-ROW($B$5)+1),ROWS($B$2:B242)))),\"\")","v":""},{"$f":"IFERROR(VLOOKUP(B242,'بينات التلاميد'!$B$5:$G$56,6,0),\"\")","v":""}]
["",{"$f":"IFERROR(IF(ROWS($B$2:B243)>'بينات التلاميد'!$Q$5,\"\",INDEX('بينات التلاميد'!$B$5:$B$56,SMALL(IF('بينات التلاميد'!$B$5:$B$56<>\"\",ROW('بينات التلاميد'!$B$5:$B$56)-ROW($B$5)+1),ROWS($B$2:B243)))),\"\")","v":""},{"$f":"IFERROR(VLOOKUP(B243,'بينات التلاميد'!$B$5:$G$56,6,0),\"\")","v":""}]
["",{"$f":"IFERROR(IF(ROWS($B$2:B244)>'بينات التلاميد'!$Q$5,\"\",INDEX('بينات التلاميد'!$B$5:$B$56,SMALL(IF('بينات التلاميد'!$B$5:$B$56<>\"\",ROW('بينات التلاميد'!$B$5:$B$56)-ROW($B$5)+1),ROWS($B$2:B244)))),\"\")","v":""},{"$f":"IFERROR(VLOOKUP(B244,'بينات التلاميد'!$B$5:$G$56,6,0),\"\")","v":""}]
["",{"$f":"IFERROR(IF(ROWS($B$2:B245)>'بينات التلاميد'!$Q$5,\"\",INDEX('بينات التلاميد'!$B$5:$B$56,SMALL(IF('بينات التلاميد'!$B$5:$B$56<>\"\",ROW('بينات التلاميد'!$B$5:$B$56)-ROW($B$5)+1),ROWS($B$2:B245)))),\"\")","v":""},{"$f":"IFERROR(VLOOKUP(B245,'بينات التلاميد'!$B$5:$G$56,6,0),\"\")","v":""}]
["",{"$f":"IFERROR(IF(ROWS($B$2:B246)>'بينات التلاميد'!$Q$5,\"\",INDEX('بينات التلاميد'!$B$5:$B$56,SMALL(IF('بينات التلاميد'!$B$5:$B$56<>\"\",ROW('بينات التلاميد'!$B$5:$B$56)-ROW($B$5)+1),ROWS($B$2:B246)))),\"\")","v":""},{"$f":"IFERROR(VLOOKUP(B246,'بينات التلاميد'!$B$5:$G$56,6,0),\"\")","v":""}]
["",{"$f":"IFERROR(IF(ROWS($B$2:B247)>'بينات التلاميد'!$Q$5,\"\",INDEX('بينات التلاميد'!$B$5:$B$56,SMALL(IF('بينات التلاميد'!$B$5:$B$56<>\"\",ROW('بينات التلاميد'!$B$5:$B$56)-ROW($B$5)+1),ROWS($B$2:B247)))),\"\")","v":""},{"$f":"IFERROR(VLOOKUP(B247,'بينات التلاميد'!$B$5:$G$56,6,0),\"\")","v":""}]
["",{"$f":"IFERROR(IF(ROWS($B$2:B248)>'بينات التلاميد'!$Q$5,\"\",INDEX('بينات التلاميد'!$B$5:$B$56,SMALL(IF('بينات التلاميد'!$B$5:$B$56<>\"\",ROW('بينات التلاميد'!$B$5:$B$56)-ROW($B$5)+1),ROWS($B$2:B248)))),\"\")","v":""},{"$f":"IFERROR(VLOOKUP(B248,'بينات التلاميد'!$B$5:$G$56,6,0),\"\")","v":""}]
["",{"$f":"IFERROR(IF(ROWS($B$2:B249)>'بينات التلاميد'!$Q$5,\"\",INDEX('بينات التلاميد'!$B$5:$B$56,SMALL(IF('بينات التلاميد'!$B$5:$B$56<>\"\",ROW('بينات التلاميد'!$B$5:$B$56)-ROW($B$5)+1),ROWS($B$2:B249)))),\"\")","v":""},{"$f":"IFERROR(VLOOKUP(B249,'بينات التلاميد'!$B$5:$G$56,6,0),\"\")","v":""}]
["",{"$f":"IFERROR(IF(ROWS($B$2:B250)>'بينات التلاميد'!$Q$5,\"\",INDEX('بينات التلاميد'!$B$5:$B$56,SMALL(IF('بينات التلاميد'!$B$5:$B$56<>\"\",ROW('بينات التلاميد'!$B$5:$B$56)-ROW($B$5)+1),ROWS($B$2:B250)))),\"\")","v":""},{"$f":"IFERROR(VLOOKUP(B250,'بينات التلاميد'!$B$5:$G$56,6,0),\"\")","v":""}]
["",{"$f":"IFERROR(IF(ROWS($B$2:B251)>'بينات التلاميد'!$Q$5,\"\",INDEX('بينات التلاميد'!$B$5:$B$56,SMALL(IF('بينات التلاميد'!$B$5:$B$56<>\"\",ROW('بينات التلاميد'!$B$5:$B$56)-ROW($B$5)+1),ROWS($B$2:B251)))),\"\")","v":""},{"$f":"IFERROR(VLOOKUP(B251,'بينات التلاميد'!$B$5:$G$56,6,0),\"\")","v":""}]
["",{"$f":"IFERROR(IF(ROWS($B$2:B252)>'بينات التلاميد'!$Q$5,\"\",INDEX('بينات التلاميد'!$B$5:$B$56,SMALL(IF('بينات التلاميد'!$B$5:$B$56<>\"\",ROW('بينات التلاميد'!$B$5:$B$56)-ROW($B$5)+1),ROWS($B$2:B252)))),\"\")","v":""},{"$f":"IFERROR(VLOOKUP(B252,'بينات التلاميد'!$B$5:$G$56,6,0),\"\")","v":""}]
["",{"$f":"IFERROR(IF(ROWS($B$2:B253)>'بينات التلاميد'!$Q$5,\"\",INDEX('بينات التلاميد'!$B$5:$B$56,SMALL(IF('بينات التلاميد'!$B$5:$B$56<>\"\",ROW('بينات التلاميد'!$B$5:$B$56)-ROW($B$5)+1),ROWS($B$2:B253)))),\"\")","v":""},{"$f":"IFERROR(VLOOKUP(B253,'بينات التلاميد'!$B$5:$G$56,6,0),\"\")","v":""}]
["",{"$f":"IFERROR(IF(ROWS($B$2:B254)>'بينات التلاميد'!$Q$5,\"\",INDEX('بينات التلاميد'!$B$5:$B$56,SMALL(IF('بينات التلاميد'!$B$5:$B$56<>\"\",ROW('بينات التلاميد'!$B$5:$B$56)-ROW($B$5)+1),ROWS($B$2:B254)))),\"\")","v":""},{"$f":"IFERROR(VLOOKUP(B254,'بينات التلاميد'!$B$5:$G$56,6,0),\"\")","v":""}]
["",{"$f":"IFERROR(IF(ROWS($B$2:B255)>'بينات التلاميد'!$Q$5,\"\",INDEX('بينات التلاميد'!$B$5:$B$56,SMALL(IF('بينات التلاميد'!$B$5:$B$56<>\"\",ROW('بينات التلاميد'!$B$5:$B$56)-ROW($B$5)+1),ROWS($B$2:B255)))),\"\")","v":""},{"$f":"IFERROR(VLOOKUP(B255,'بينات التلاميد'!$B$5:$G$56,6,0),\"\")","v":""}]
["",{"$f":"IFERROR(IF(ROWS($B$2:B256)>'بينات التلاميد'!$Q$5,\"\",INDEX('بينات التلاميد'!$B$5:$B$56,SMALL(IF('بينات التلاميد'!$B$5:$B$56<>\"\",ROW('بينات التلاميد'!$B$5:$B$56)-ROW($B$5)+1),ROWS($B$2:B256)))),\"\")","v":""},{"$f":"IFERROR(VLOOKUP(B256,'بينات التلاميد'!$B$5:$G$56,6,0),\"\")","v":""}]
["",{"$f":"IFERROR(IF(ROWS($B$2:B257)>'بينات التلاميد'!$Q$5,\"\",INDEX('بينات التلاميد'!$B$5:$B$56,SMALL(IF('بينات التلاميد'!$B$5:$B$56<>\"\",ROW('بينات التلاميد'!$B$5:$B$56)-ROW($B$5)+1),ROWS($B$2:B257)))),\"\")","v":""},{"$f":"IFERROR(VLOOKUP(B257,'بينات التلاميد'!$B$5:$G$56,6,0),\"\")","v":""}]
[{"$f":"IFERROR(VLOOKUP(C258,$D$2:$E$20,2,0),\"\")","v":""},{"$f":"IFERROR(IF(ROWS($B$2:B258)>'بينات التلاميد'!$Q$5,\"\",INDEX('بينات التلاميد'!$B$5:$B$56,SMALL(IF('بينات التلاميد'!$B$5:$B$56<>\"\",ROW('بينات التلاميد'!$B$5:$B$56)-ROW($B$5)+1),ROWS($B$2:B258)))),\"\")","v":""},{"$f":"IFERROR(VLOOKUP(B258,'بينات التلاميد'!$B$5:$G$56,6,0),\"\")","v":""}]
["",{"$f":"IFERROR(IF(ROWS($B$2:B259)>'بينات التلاميد'!$Q$5,\"\",INDEX('بينات التلاميد'!$B$5:$B$56,SMALL(IF('بينات التلاميد'!$B$5:$B$56<>\"\",ROW('بينات التلاميد'!$B$5:$B$56)-ROW($B$5)+1),ROWS($B$2:B259)))),\"\")","v":""},{"$f":"IFERROR(VLOOKUP(B259,'بينات التلاميد'!$B$5:$G$56,6,0),\"\")","v":""}]
["",{"$f":"IFERROR(IF(ROWS($B$2:B260)>'بينات التلاميد'!$Q$5,\"\",INDEX('بينات التلاميد'!$B$5:$B$56,SMALL(IF('بينات التلاميد'!$B$5:$B$56<>\"\",ROW('بينات التلاميد'!$B$5:$B$56)-ROW($B$5)+1),ROWS($B$2:B260)))),\"\")","v":""},{"$f":"IFERROR(VLOOKUP(B260,'بينات التلاميد'!$B$5:$G$56,6,0),\"\")","v":""}]
["",{"$f":"IFERROR(IF(ROWS($B$2:B261)>'بينات التلاميد'!$Q$5,\"\",INDEX('بينات التلاميد'!$B$5:$B$56,SMALL(IF('بينات التلاميد'!$B$5:$B$56<>\"\",ROW('بينات التلاميد'!$B$5:$B$56)-ROW($B$5)+1),ROWS($B$2:B261)))),\"\")","v":""},{"$f":"IFERROR(VLOOKUP(B261,'بينات التلاميد'!$B$5:$G$56,6,0),\"\")","v":""}]
["",{"$f":"IFERROR(IF(ROWS($B$2:B262)>'بينات التلاميد'!$Q$5,\"\",INDEX('بينات التلاميد'!$B$5:$B$56,SMALL(IF('بينات التلاميد'!$B$5:$B$56<>\"\",ROW('بينات التلاميد'!$B$5:$B$56)-ROW($B$5)+1),ROWS($B$2:B262)))),\"\")","v":""},{"$f":"IFERROR(VLOOKUP(B262,'بينات التلاميد'!$B$5:$G$56,6,0),\"\")","v":""}]
["",{"$f":"IFERROR(IF(ROWS($B$2:B263)>'بينات التلاميد'!$Q$5,\"\",INDEX('بينات التلاميد'!$B$5:$B$56,SMALL(IF('بينات التلاميد'!$B$5:$B$56<>\"\",ROW('بينات التلاميد'!$B$5:$B$56)-ROW($B$5)+1),ROWS($B$2:B263)))),\"\")","v":""},{"$f":"IFERROR(VLOOKUP(B263,'بينات التلاميد'!$B$5:$G$56,6,0),\"\")","v":""}]
["",{"$f":"IFERROR(IF(ROWS($B$2:B264)>'بينات التلاميد'!$Q$5,\"\",INDEX('بينات التلاميد'!$B$5:$B$56,SMALL(IF('بينات التلاميد'!$B$5:$B$56<>\"\",ROW('بينات التلاميد'!$B$5:$B$56)-ROW($B$5)+1),ROWS($B$2:B264)))),\"\")","v":""},{"$f":"IFERROR(VLOOKUP(B264,'بينات التلاميد'!$B$5:$G$56,6,0),\"\")","v":""}]
["",{"$f":"IFERROR(IF(ROWS($B$2:B265)>'بينات التلاميد'!$Q$5,\"\",INDEX('بينات التلاميد'!$B$5:$B$56,SMALL(IF('بينات التلاميد'!$B$5:$B$56<>\"\",ROW('بينات التلاميد'!$B$5:$B$56)-ROW($B$5)+1),ROWS($B$2:B265)))),\"\")","v":""},{"$f":"IFERROR(VLOOKUP(B265,'بينات التلاميد'!$B$5:$G$56,6,0),\"\")","v":""}]
["",{"$f":"IFERROR(IF(ROWS($B$2:B266)>'بينات التلاميد'!$Q$5,\"\",INDEX('بينات التلاميد'!$B$5:$B$56,SMALL(IF('بينات التلاميد'!$B$5:$B$56<>\"\",ROW('بينات التلاميد'!$B$5:$B$56)-ROW($B$5)+1),ROWS($B$2:B266)))),\"\")","v":""},{"$f":"IFERROR(VLOOKUP(B266,'بينات التلاميد'!$B$5:$G$56,6,0),\"\")","v":""}]
["",{"$f":"IFERROR(IF(ROWS($B$2:B267)>'بينات التلاميد'!$Q$5,\"\",INDEX('بينات التلاميد'!$B$5:$B$56,SMALL(IF('بينات التلاميد'!$B$5:$B$56<>\"\",ROW('بينات التلاميد'!$B$5:$B$56)-ROW($B$5)+1),ROWS($B$2:B267)))),\"\")","v":""},{"$f":"IFERROR(VLOOKUP(B267,'بينات التلاميد'!$B$5:$G$56,6,0),\"\")","v":""}]
["",{"$f":"IFERROR(IF(ROWS($B$2:B268)>'بينات التلاميد'!$Q$5,\"\",INDEX('بينات التلاميد'!$B$5:$B$56,SMALL(IF('بينات التلاميد'!$B$5:$B$56<>\"\",ROW('بينات التلاميد'!$B$5:$B$56)-ROW($B$5)+1),ROWS($B$2:B268)))),\"\")","v":""},{"$f":"IFERROR(VLOOKUP(B268,'بينات التلاميد'!$B$5:$G$56,6,0),\"\")","v":""}]
["",{"$f":"IFERROR(IF(ROWS($B$2:B269)>'بينات التلاميد'!$Q$5,\"\",INDEX('بينات التلاميد'!$B$5:$B$56,SMALL(IF('بينات التلاميد'!$B$5:$B$56<>\"\",ROW('بينات التلاميد'!$B$5:$B$56)-ROW($B$5)+1),ROWS($B$2:B269)))),\"\")","v":""},{"$f":"IFERROR(VLOOKUP(B269,'بينات التلاميد'!$B$5:$G$56,6,0),\"\")","v":""}]
["",{"$f":"IFERROR(IF(ROWS($B$2:B270)>'بينات التلاميد'!$Q$5,\"\",INDEX('بينات التلاميد'!$B$5:$B$56,SMALL(IF('بينات التلاميد'!$B$5:$B$56<>\"\",ROW('بينات التلاميد'!$B$5:$B$56)-ROW($B$5)+1),ROWS($B$2:B270)))),\"\")","v":""},{"$f":"IFERROR(VLOOKUP(B270,'بينات التلاميد'!$B$5:$G$56,6,0),\"\")","v":""}]
["",{"$f":"IFERROR(IF(ROWS($B$2:B271)>'بينات التلاميد'!$Q$5,\"\",INDEX('بينات التلاميد'!$B$5:$B$56,SMALL(IF('بينات التلاميد'!$B$5:$B$56<>\"\",ROW('بينات التلاميد'!$B$5:$B$56)-ROW($B$5)+1),ROWS($B$2:B271)))),\"\")","v":""},{"$f":"IFERROR(VLOOKUP(B271,'بينات التلاميد'!$B$5:$G$56,6,0),\"\")","v":""}]
["",{"$f":"IFERROR(IF(ROWS($B$2:B272)>'بينات التلاميد'!$Q$5,\"\",INDEX('بينات التلاميد'!$B$5:$B$56,SMALL(IF('بينات التلاميد'!$B$5:$B$56<>\"\",ROW('بينات التلاميد'!$B$5:$B$56)-ROW($B$5)+1),ROWS($B$2:B272)))),\"\")","v":""},{"$f":"IFERROR(VLOOKUP(B272,'بينات التلاميد'!$B$5:$G$56,6,0),\"\")","v":""}]
["",{"$f":"IFERROR(IF(ROWS($B$2:B273)>'بينات التلاميد'!$Q$5,\"\",INDEX('بينات التلاميد'!$B$5:$B$56,SMALL(IF('بينات التلاميد'!$B$5:$B$56<>\"\",ROW('بينات التلاميد'!$B$5:$B$56)-ROW($B$5)+1),ROWS($B$2:B273)))),\"\")","v":""},{"$f":"IFERROR(VLOOKUP(B273,'بينات التلاميد'!$B$5:$G$56,6,0),\"\")","v":""}]
["",{"$f":"IFERROR(IF(ROWS($B$2:B274)>'بينات التلاميد'!$Q$5,\"\",INDEX('بينات التلاميد'!$B$5:$B$56,SMALL(IF('بينات التلاميد'!$B$5:$B$56<>\"\",ROW('بينات التلاميد'!$B$5:$B$56)-ROW($B$5)+1),ROWS($B$2:B274)))),\"\")","v":""},{"$f":"IFERROR(VLOOKUP(B274,'بينات التلاميد'!$B$5:$G$56,6,0),\"\")","v":""}]
["",{"$f":"IFERROR(IF(ROWS($B$2:B275)>'بينات التلاميد'!$Q$5,\"\",INDEX('بينات التلاميد'!$B$5:$B$56,SMALL(IF('بينات التلاميد'!$B$5:$B$56<>\"\",ROW('بينات التلاميد'!$B$5:$B$56)-ROW($B$5)+1),ROWS($B$2:B275)))),\"\")","v":""},{"$f":"IFERROR(VLOOKUP(B275,'بينات التلاميد'!$B$5:$G$56,6,0),\"\")","v":""}]
["",{"$f":"IFERROR(IF(ROWS($B$2:B276)>'بينات التلاميد'!$Q$5,\"\",INDEX('بينات التلاميد'!$B$5:$B$56,SMALL(IF('بينات التلاميد'!$B$5:$B$56<>\"\",ROW('بينات التلاميد'!$B$5:$B$56)-ROW($B$5)+1),ROWS($B$2:B276)))),\"\")","v":""},{"$f":"IFERROR(VLOOKUP(B276,'بينات التلاميد'!$B$5:$G$56,6,0),\"\")","v":""}]
["",{"$f":"IFERROR(IF(ROWS($B$2:B277)>'بينات التلاميد'!$Q$5,\"\",INDEX('بينات التلاميد'!$B$5:$B$56,SMALL(IF('بينات التلاميد'!$B$5:$B$56<>\"\",ROW('بينات التلاميد'!$B$5:$B$56)-ROW($B$5)+1),ROWS($B$2:B277)))),\"\")","v":""},{"$f":"IFERROR(VLOOKUP(B277,'بينات التلاميد'!$B$5:$G$56,6,0),\"\")","v":""}]
["",{"$f":"IFERROR(IF(ROWS($B$2:B278)>'بينات التلاميد'!$Q$5,\"\",INDEX('بينات التلاميد'!$B$5:$B$56,SMALL(IF('بينات التلاميد'!$B$5:$B$56<>\"\",ROW('بينات التلاميد'!$B$5:$B$56)-ROW($B$5)+1),ROWS($B$2:B278)))),\"\")","v":""},{"$f":"IFERROR(VLOOKUP(B278,'بينات التلاميد'!$B$5:$G$56,6,0),\"\")","v":""}]
["",{"$f":"IFERROR(IF(ROWS($B$2:B279)>'بينات التلاميد'!$Q$5,\"\",INDEX('بينات التلاميد'!$B$5:$B$56,SMALL(IF('بينات التلاميد'!$B$5:$B$56<>\"\",ROW('بينات التلاميد'!$B$5:$B$56)-ROW($B$5)+1),ROWS($B$2:B279)))),\"\")","v":""},{"$f":"IFERROR(VLOOKUP(B279,'بينات التلاميد'!$B$5:$G$56,6,0),\"\")","v":""}]
["",{"$f":"IFERROR(IF(ROWS($B$2:B280)>'بينات التلاميد'!$Q$5,\"\",INDEX('بينات التلاميد'!$B$5:$B$56,SMALL(IF('بينات التلاميد'!$B$5:$B$56<>\"\",ROW('بينات التلاميد'!$B$5:$B$56)-ROW($B$5)+1),ROWS($B$2:B280)))),\"\")","v":""},{"$f":"IFERROR(VLOOKUP(B280,'بينات التلاميد'!$B$5:$G$56,6,0),\"\")","v":""}]
["",{"$f":"IFERROR(IF(ROWS($B$2:B281)>'بينات التلاميد'!$Q$5,\"\",INDEX('بينات التلاميد'!$B$5:$B$56,SMALL(IF('بينات التلاميد'!$B$5:$B$56<>\"\",ROW('بينات التلاميد'!$B$5:$B$56)-ROW($B$5)+1),ROWS($B$2:B281)))),\"\")","v":""},{"$f":"IFERROR(VLOOKUP(B281,'بينات التلاميد'!$B$5:$G$56,6,0),\"\")","v":""}]
["",{"$f":"IFERROR(IF(ROWS($B$2:B282)>'بينات التلاميد'!$Q$5,\"\",INDEX('بينات التلاميد'!$B$5:$B$56,SMALL(IF('بينات التلاميد'!$B$5:$B$56<>\"\",ROW('بينات التلاميد'!$B$5:$B$56)-ROW($B$5)+1),ROWS($B$2:B282)))),\"\")","v":""},{"$f":"IFERROR(VLOOKUP(B282,'بينات التلاميد'!$B$5:$G$56,6,0),\"\")","v":""}]
["",{"$f":"IFERROR(IF(ROWS($B$2:B283)>'بينات التلاميد'!$Q$5,\"\",INDEX('بينات التلاميد'!$B$5:$B$56,SMALL(IF('بينات التلاميد'!$B$5:$B$56<>\"\",ROW('بينات التلاميد'!$B$5:$B$56)-ROW($B$5)+1),ROWS($B$2:B283)))),\"\")","v":""},{"$f":"IFERROR(VLOOKUP(B283,'بينات التلاميد'!$B$5:$G$56,6,0),\"\")","v":""}]
["",{"$f":"IFERROR(IF(ROWS($B$2:B284)>'بينات التلاميد'!$Q$5,\"\",INDEX('بينات التلاميد'!$B$5:$B$56,SMALL(IF('بينات التلاميد'!$B$5:$B$56<>\"\",ROW('بينات التلاميد'!$B$5:$B$56)-ROW($B$5)+1),ROWS($B$2:B284)))),\"\")","v":""},{"$f":"IFERROR(VLOOKUP(B284,'بينات التلاميد'!$B$5:$G$56,6,0),\"\")","v":""}]
["",{"$f":"IFERROR(IF(ROWS($B$2:B285)>'بينات التلاميد'!$Q$5,\"\",INDEX('بينات التلاميد'!$B$5:$B$56,SMALL(IF('بينات التلاميد'!$B$5:$B$56<>\"\",ROW('بينات التلاميد'!$B$5:$B$56)-ROW($B$5)+1),ROWS($B$2:B285)))),\"\")","v":""},{"$f":"IFERROR(VLOOKUP(B285,'بينات التلاميد'!$B$5:$G$56,6,0),\"\")","v":""}]
["",{"$f":"IFERROR(IF(ROWS($B$2:B286)>'بينات التلاميد'!$Q$5,\"\",INDEX('بينات التلاميد'!$B$5:$B$56,SMALL(IF('بينات التلاميد'!$B$5:$B$56<>\"\",ROW('بينات التلاميد'!$B$5:$B$56)-ROW($B$5)+1),ROWS($B$2:B286)))),\"\")","v":""},{"$f":"IFERROR(VLOOKUP(B286,'بينات التلاميد'!$B$5:$G$56,6,0),\"\")","v":""}]
["",{"$f":"IFERROR(IF(ROWS($B$2:B287)>'بينات التلاميد'!$Q$5,\"\",INDEX('بينات التلاميد'!$B$5:$B$56,SMALL(IF('بينات التلاميد'!$B$5:$B$56<>\"\",ROW('بينات التلاميد'!$B$5:$B$56)-ROW($B$5)+1),ROWS($B$2:B287)))),\"\")","v":""},{"$f":"IFERROR(VLOOKUP(B287,'بينات التلاميد'!$B$5:$G$56,6,0),\"\")","v":""}]
["",{"$f":"IFERROR(IF(ROWS($B$2:B288)>'بينات التلاميد'!$Q$5,\"\",INDEX('بينات التلاميد'!$B$5:$B$56,SMALL(IF('بينات التلاميد'!$B$5:$B$56<>\"\",ROW('بينات التلاميد'!$B$5:$B$56)-ROW($B$5)+1),ROWS($B$2:B288)))),\"\")","v":""},{"$f":"IFERROR(VLOOKUP(B288,'بينات التلاميد'!$B$5:$G$56,6,0),\"\")","v":""}]
["",{"$f":"IFERROR(IF(ROWS($B$2:B289)>'بينات التلاميد'!$Q$5,\"\",INDEX('بينات التلاميد'!$B$5:$B$56,SMALL(IF('بينات التلاميد'!$B$5:$B$56<>\"\",ROW('بينات التلاميد'!$B$5:$B$56)-ROW($B$5)+1),ROWS($B$2:B289)))),\"\")","v":""},{"$f":"IFERROR(VLOOKUP(B289,'بينات التلاميد'!$B$5:$G$56,6,0),\"\")","v":""}]
["",{"$f":"IFERROR(IF(ROWS($B$2:B290)>'بينات التلاميد'!$Q$5,\"\",INDEX('بينات التلاميد'!$B$5:$B$56,SMALL(IF('بينات التلاميد'!$B$5:$B$56<>\"\",ROW('بينات التلاميد'!$B$5:$B$56)-ROW($B$5)+1),ROWS($B$2:B290)))),\"\")","v":""},{"$f":"IFERROR(VLOOKUP(B290,'بينات التلاميد'!$B$5:$G$56,6,0),\"\")","v":""}]
["",{"$f":"IFERROR(IF(ROWS($B$2:B291)>'بينات التلاميد'!$Q$5,\"\",INDEX('بينات التلاميد'!$B$5:$B$56,SMALL(IF('بينات التلاميد'!$B$5:$B$56<>\"\",ROW('بينات التلاميد'!$B$5:$B$56)-ROW($B$5)+1),ROWS($B$2:B291)))),\"\")","v":""},{"$f":"IFERROR(VLOOKUP(B291,'بينات التلاميد'!$B$5:$G$56,6,0),\"\")","v":""}]
["",{"$f":"IFERROR(IF(ROWS($B$2:B292)>'بينات التلاميد'!$Q$5,\"\",INDEX('بينات التلاميد'!$B$5:$B$56,SMALL(IF('بينات التلاميد'!$B$5:$B$56<>\"\",ROW('بينات التلاميد'!$B$5:$B$56)-ROW($B$5)+1),ROWS($B$2:B292)))),\"\")","v":""},{"$f":"IFERROR(VLOOKUP(B292,'بينات التلاميد'!$B$5:$G$56,6,0),\"\")","v":""}]
["",{"$f":"IFERROR(IF(ROWS($B$2:B293)>'بينات التلاميد'!$Q$5,\"\",INDEX('بينات التلاميد'!$B$5:$B$56,SMALL(IF('بينات التلاميد'!$B$5:$B$56<>\"\",ROW('بينات التلاميد'!$B$5:$B$56)-ROW($B$5)+1),ROWS($B$2:B293)))),\"\")","v":""},{"$f":"IFERROR(VLOOKUP(B293,'بينات التلاميد'!$B$5:$G$56,6,0),\"\")","v":""}]
["",{"$f":"IFERROR(IF(ROWS($B$2:B294)>'بينات التلاميد'!$Q$5,\"\",INDEX('بينات التلاميد'!$B$5:$B$56,SMALL(IF('بينات التلاميد'!$B$5:$B$56<>\"\",ROW('بينات التلاميد'!$B$5:$B$56)-ROW($B$5)+1),ROWS($B$2:B294)))),\"\")","v":""},{"$f":"IFERROR(VLOOKUP(B294,'بينات التلاميد'!$B$5:$G$56,6,0),\"\")","v":""}]
["",{"$f":"IFERROR(IF(ROWS($B$2:B295)>'بينات التلاميد'!$Q$5,\"\",INDEX('بينات التلاميد'!$B$5:$B$56,SMALL(IF('بينات التلاميد'!$B$5:$B$56<>\"\",ROW('بينات التلاميد'!$B$5:$B$56)-ROW($B$5)+1),ROWS($B$2:B295)))),\"\")","v":""},{"$f":"IFERROR(VLOOKUP(B295,'بينات التلاميد'!$B$5:$G$56,6,0),\"\")","v":""}]
["",{"$f":"IFERROR(IF(ROWS($B$2:B296)>'بينات التلاميد'!$Q$5,\"\",INDEX('بينات التلاميد'!$B$5:$B$56,SMALL(IF('بينات التلاميد'!$B$5:$B$56<>\"\",ROW('بينات التلاميد'!$B$5:$B$56)-ROW($B$5)+1),ROWS($B$2:B296)))),\"\")","v":""},{"$f":"IFERROR(VLOOKUP(B296,'بينات التلاميد'!$B$5:$G$56,6,0),\"\")","v":""}]
["",{"$f":"IFERROR(IF(ROWS($B$2:B297)>'بينات التلاميد'!$Q$5,\"\",INDEX('بينات التلاميد'!$B$5:$B$56,SMALL(IF('بينات التلاميد'!$B$5:$B$56<>\"\",ROW('بينات التلاميد'!$B$5:$B$56)-ROW($B$5)+1),ROWS($B$2:B297)))),\"\")","v":""},{"$f":"IFERROR(VLOOKUP(B297,'بينات التلاميد'!$B$5:$G$56,6,0),\"\")","v":""}]
["",{"$f":"IFERROR(IF(ROWS($B$2:B298)>'بينات التلاميد'!$Q$5,\"\",INDEX('بينات التلاميد'!$B$5:$B$56,SMALL(IF('بينات التلاميد'!$B$5:$B$56<>\"\",ROW('بينات التلاميد'!$B$5:$B$56)-ROW($B$5)+1),ROWS($B$2:B298)))),\"\")","v":""},{"$f":"IFERROR(VLOOKUP(B298,'بينات التلاميد'!$B$5:$G$56,6,0),\"\")","v":""}]
["",{"$f":"IFERROR(IF(ROWS($B$2:B299)>'بينات التلاميد'!$Q$5,\"\",INDEX('بينات التلاميد'!$B$5:$B$56,SMALL(IF('بينات التلاميد'!$B$5:$B$56<>\"\",ROW('بينات التلاميد'!$B$5:$B$56)-ROW($B$5)+1),ROWS($B$2:B299)))),\"\")","v":""},{"$f":"IFERROR(VLOOKUP(B299,'بينات التلاميد'!$B$5:$G$56,6,0),\"\")","v":""}]
["",{"$f":"IFERROR(IF(ROWS($B$2:B300)>'بينات التلاميد'!$Q$5,\"\",INDEX('بينات التلاميد'!$B$5:$B$56,SMALL(IF('بينات التلاميد'!$B$5:$B$56<>\"\",ROW('بينات التلاميد'!$B$5:$B$56)-ROW($B$5)+1),ROWS($B$2:B300)))),\"\")","v":""},{"$f":"IFERROR(VLOOKUP(B300,'بينات التلاميد'!$B$5:$G$56,6,0),\"\")","v":""}]
["",{"$f":"IFERROR(IF(ROWS($B$2:B301)>'بينات التلاميد'!$Q$5,\"\",INDEX('بينات التلاميد'!$B$5:$B$56,SMALL(IF('بينات التلاميد'!$B$5:$B$56<>\"\",ROW('بينات التلاميد'!$B$5:$B$56)-ROW($B$5)+1),ROWS($B$2:B301)))),\"\")","v":""},{"$f":"IFERROR(VLOOKUP(B301,'بينات التلاميد'!$B$5:$G$56,6,0),\"\")","v":""}]
["",{"$f":"IFERROR(IF(ROWS($B$2:B302)>'بينات التلاميد'!$Q$5,\"\",INDEX('بينات التلاميد'!$B$5:$B$56,SMALL(IF('بينات التلاميد'!$B$5:$B$56<>\"\",ROW('بينات التلاميد'!$B$5:$B$56)-ROW($B$5)+1),ROWS($B$2:B302)))),\"\")","v":""},{"$f":"IFERROR(VLOOKUP(B302,'بينات التلاميد'!$B$5:$G$56,6,0),\"\")","v":""}]
["",{"$f":"IFERROR(IF(ROWS($B$2:B303)>'بينات التلاميد'!$Q$5,\"\",INDEX('بينات التلاميد'!$B$5:$B$56,SMALL(IF('بينات التلاميد'!$B$5:$B$56<>\"\",ROW('بينات التلاميد'!$B$5:$B$56)-ROW($B$5)+1),ROWS($B$2:B303)))),\"\")","v":""},{"$f":"IFERROR(VLOOKUP(B303,'بينات التلاميد'!$B$5:$G$56,6,0),\"\")","v":""}]
["",{"$f":"IFERROR(IF(ROWS($B$2:B304)>'بينات التلاميد'!$Q$5,\"\",INDEX('بينات التلاميد'!$B$5:$B$56,SMALL(IF('بينات التلاميد'!$B$5:$B$56<>\"\",ROW('بينات التلاميد'!$B$5:$B$56)-ROW($B$5)+1),ROWS($B$2:B304)))),\"\")","v":""},{"$f":"IFERROR(VLOOKUP(B304,'بينات التلاميد'!$B$5:$G$56,6,0),\"\")","v":""}]
["",{"$f":"IFERROR(IF(ROWS($B$2:B305)>'بينات التلاميد'!$Q$5,\"\",INDEX('بينات التلاميد'!$B$5:$B$56,SMALL(IF('بينات التلاميد'!$B$5:$B$56<>\"\",ROW('بينات التلاميد'!$B$5:$B$56)-ROW($B$5)+1),ROWS($B$2:B305)))),\"\")","v":""},{"$f":"IFERROR(VLOOKUP(B305,'بينات التلاميد'!$B$5:$G$56,6,0),\"\")","v":""}]
["",{"$f":"IFERROR(IF(ROWS($B$2:B306)>'بينات التلاميد'!$Q$5,\"\",INDEX('بينات التلاميد'!$B$5:$B$56,SMALL(IF('بينات التلاميد'!$B$5:$B$56<>\"\",ROW('بينات التلاميد'!$B$5:$B$56)-ROW($B$5)+1),ROWS($B$2:B306)))),\"\")","v":""},{"$f":"IFERROR(VLOOKUP(B306,'بينات التلاميد'!$B$5:$G$56,6,0),\"\")","v":""}]
["",{"$f":"IFERROR(IF(ROWS($B$2:B307)>'بينات التلاميد'!$Q$5,\"\",INDEX('بينات التلاميد'!$B$5:$B$56,SMALL(IF('بينات التلاميد'!$B$5:$B$56<>\"\",ROW('بينات التلاميد'!$B$5:$B$56)-ROW($B$5)+1),ROWS($B$2:B307)))),\"\")","v":""},{"$f":"IFERROR(VLOOKUP(B307,'بينات التلاميد'!$B$5:$G$56,6,0),\"\")","v":""}]
["",{"$f":"IFERROR(IF(ROWS($B$2:B308)>'بينات التلاميد'!$Q$5,\"\",INDEX('بينات التلاميد'!$B$5:$B$56,SMALL(IF('بينات التلاميد'!$B$5:$B$56<>\"\",ROW('بينات التلاميد'!$B$5:$B$56)-ROW($B$5)+1),ROWS($B$2:B308)))),\"\")","v":""},{"$f":"IFERROR(VLOOKUP(B308,'بينات التلاميد'!$B$5:$G$56,6,0),\"\")","v":""}]
["",{"$f":"IFERROR(IF(ROWS($B$2:B309)>'بينات التلاميد'!$Q$5,\"\",INDEX('بينات التلاميد'!$B$5:$B$56,SMALL(IF('بينات التلاميد'!$B$5:$B$56<>\"\",ROW('بينات التلاميد'!$B$5:$B$56)-ROW($B$5)+1),ROWS($B$2:B309)))),\"\")","v":""},{"$f":"IFERROR(VLOOKUP(B309,'بينات التلاميد'!$B$5:$G$56,6,0),\"\")","v":""}]
["",{"$f":"IFERROR(IF(ROWS($B$2:B310)>'بينات التلاميد'!$Q$5,\"\",INDEX('بينات التلاميد'!$B$5:$B$56,SMALL(IF('بينات التلاميد'!$B$5:$B$56<>\"\",ROW('بينات التلاميد'!$B$5:$B$56)-ROW($B$5)+1),ROWS($B$2:B310)))),\"\")","v":""},{"$f":"IFERROR(VLOOKUP(B310,'بينات التلاميد'!$B$5:$G$56,6,0),\"\")","v":""}]
["",{"$f":"IFERROR(IF(ROWS($B$2:B311)>'بينات التلاميد'!$Q$5,\"\",INDEX('بينات التلاميد'!$B$5:$B$56,SMALL(IF('بينات التلاميد'!$B$5:$B$56<>\"\",ROW('بينات التلاميد'!$B$5:$B$56)-ROW($B$5)+1),ROWS($B$2:B311)))),\"\")","v":""},{"$f":"IFERROR(VLOOKUP(B311,'بينات التلاميد'!$B$5:$G$56,6,0),\"\")","v":""}]
["",{"$f":"IFERROR(IF(ROWS($B$2:B312)>'بينات التلاميد'!$Q$5,\"\",INDEX('بينات التلاميد'!$B$5:$B$56,SMALL(IF('بينات التلاميد'!$B$5:$B$56<>\"\",ROW('بينات التلاميد'!$B$5:$B$56)-ROW($B$5)+1),ROWS($B$2:B312)))),\"\")","v":""},{"$f":"IFERROR(VLOOKUP(B312,'بينات التلاميد'!$B$5:$G$56,6,0),\"\")","v":""}]
["",{"$f":"IFERROR(IF(ROWS($B$2:B313)>'بينات التلاميد'!$Q$5,\"\",INDEX('بينات التلاميد'!$B$5:$B$56,SMALL(IF('بينات التلاميد'!$B$5:$B$56<>\"\",ROW('بينات التلاميد'!$B$5:$B$56)-ROW($B$5)+1),ROWS($B$2:B313)))),\"\")","v":""},{"$f":"IFERROR(VLOOKUP(B313,'بينات التلاميد'!$B$5:$G$56,6,0),\"\")","v":""}]
["",{"$f":"IFERROR(IF(ROWS($B$2:B314)>'بينات التلاميد'!$Q$5,\"\",INDEX('بينات التلاميد'!$B$5:$B$56,SMALL(IF('بينات التلاميد'!$B$5:$B$56<>\"\",ROW('بينات التلاميد'!$B$5:$B$56)-ROW($B$5)+1),ROWS($B$2:B314)))),\"\")","v":""},{"$f":"IFERROR(VLOOKUP(B314,'بينات التلاميد'!$B$5:$G$56,6,0),\"\")","v":""}]
["",{"$f":"IFERROR(IF(ROWS($B$2:B315)>'بينات التلاميد'!$Q$5,\"\",INDEX('بينات التلاميد'!$B$5:$B$56,SMALL(IF('بينات التلاميد'!$B$5:$B$56<>\"\",ROW('بينات التلاميد'!$B$5:$B$56)-ROW($B$5)+1),ROWS($B$2:B315)))),\"\")","v":""},{"$f":"IFERROR(VLOOKUP(B315,'بينات التلاميد'!$B$5:$G$56,6,0),\"\")","v":""}]
["",{"$f":"IFERROR(IF(ROWS($B$2:B316)>'بينات التلاميد'!$Q$5,\"\",INDEX('بينات التلاميد'!$B$5:$B$56,SMALL(IF('بينات التلاميد'!$B$5:$B$56<>\"\",ROW('بينات التلاميد'!$B$5:$B$56)-ROW($B$5)+1),ROWS($B$2:B316)))),\"\")","v":""},{"$f":"IFERROR(VLOOKUP(B316,'بينات التلاميد'!$B$5:$G$56,6,0),\"\")","v":""}]
["",{"$f":"IFERROR(IF(ROWS($B$2:B317)>'بينات التلاميد'!$Q$5,\"\",INDEX('بينات التلاميد'!$B$5:$B$56,SMALL(IF('بينات التلاميد'!$B$5:$B$56<>\"\",ROW('بينات التلاميد'!$B$5:$B$56)-ROW($B$5)+1),ROWS($B$2:B317)))),\"\")","v":""},{"$f":"IFERROR(VLOOKUP(B317,'بينات التلاميد'!$B$5:$G$56,6,0),\"\")","v":""}]
["",{"$f":"IFERROR(IF(ROWS($B$2:B318)>'بينات التلاميد'!$Q$5,\"\",INDEX('بينات التلاميد'!$B$5:$B$56,SMALL(IF('بينات التلاميد'!$B$5:$B$56<>\"\",ROW('بينات التلاميد'!$B$5:$B$56)-ROW($B$5)+1),ROWS($B$2:B318)))),\"\")","v":""},{"$f":"IFERROR(VLOOKUP(B318,'بينات التلاميد'!$B$5:$G$56,6,0),\"\")","v":""}]
["",{"$f":"IFERROR(IF(ROWS($B$2:B319)>'بينات التلاميد'!$Q$5,\"\",INDEX('بينات التلاميد'!$B$5:$B$56,SMALL(IF('بينات التلاميد'!$B$5:$B$56<>\"\",ROW('بينات التلاميد'!$B$5:$B$56)-ROW($B$5)+1),ROWS($B$2:B319)))),\"\")","v":""},{"$f":"IFERROR(VLOOKUP(B319,'بينات التلاميد'!$B$5:$G$56,6,0),\"\")","v":""}]
["",{"$f":"IFERROR(IF(ROWS($B$2:B320)>'بينات التلاميد'!$Q$5,\"\",INDEX('بينات التلاميد'!$B$5:$B$56,SMALL(IF('بينات التلاميد'!$B$5:$B$56<>\"\",ROW('بينات التلاميد'!$B$5:$B$56)-ROW($B$5)+1),ROWS($B$2:B320)))),\"\")","v":""},{"$f":"IFERROR(VLOOKUP(B320,'بينات التلاميد'!$B$5:$G$56,6,0),\"\")","v":""}]
["",{"$f":"IFERROR(IF(ROWS($B$2:B321)>'بينات التلاميد'!$Q$5,\"\",INDEX('بينات التلاميد'!$B$5:$B$56,SMALL(IF('بينات التلاميد'!$B$5:$B$56<>\"\",ROW('بينات التلاميد'!$B$5:$B$56)-ROW($B$5)+1),ROWS($B$2:B321)))),\"\")","v":""},{"$f":"IFERROR(VLOOKUP(B321,'بينات التلاميد'!$B$5:$G$56,6,0),\"\")","v":""}]
[{"$f":"IFERROR(VLOOKUP(C322,$D$2:$E$20,2,0),\"\")","v":""},{"$f":"IFERROR(IF(ROWS($B$2:B322)>'بينات التلاميد'!$Q$5,\"\",INDEX('بينات التلاميد'!$B$5:$B$56,SMALL(IF('بينات التلاميد'!$B$5:$B$56<>\"\",ROW('بينات التلاميد'!$B$5:$B$56)-ROW($B$5)+1),ROWS($B$2:B322)))),\"\")","v":""},{"$f":"IFERROR(VLOOKUP(B322,'بينات التلاميد'!$B$5:$G$56,6,0),\"\")","v":""}]
["",{"$f":"IFERROR(IF(ROWS($B$2:B323)>'بينات التلاميد'!$Q$5,\"\",INDEX('بينات التلاميد'!$B$5:$B$56,SMALL(IF('بينات التلاميد'!$B$5:$B$56<>\"\",ROW('بينات التلاميد'!$B$5:$B$56)-ROW($B$5)+1),ROWS($B$2:B323)))),\"\")","v":""},{"$f":"IFERROR(VLOOKUP(B323,'بينات التلاميد'!$B$5:$G$56,6,0),\"\")","v":""}]
["",{"$f":"IFERROR(IF(ROWS($B$2:B324)>'بينات التلاميد'!$Q$5,\"\",INDEX('بينات التلاميد'!$B$5:$B$56,SMALL(IF('بينات التلاميد'!$B$5:$B$56<>\"\",ROW('بينات التلاميد'!$B$5:$B$56)-ROW($B$5)+1),ROWS($B$2:B324)))),\"\")","v":""},{"$f":"IFERROR(VLOOKUP(B324,'بينات التلاميد'!$B$5:$G$56,6,0),\"\")","v":""}]
["",{"$f":"IFERROR(IF(ROWS($B$2:B325)>'بينات التلاميد'!$Q$5,\"\",INDEX('بينات التلاميد'!$B$5:$B$56,SMALL(IF('بينات التلاميد'!$B$5:$B$56<>\"\",ROW('بينات التلاميد'!$B$5:$B$56)-ROW($B$5)+1),ROWS($B$2:B325)))),\"\")","v":""},{"$f":"IFERROR(VLOOKUP(B325,'بينات التلاميد'!$B$5:$G$56,6,0),\"\")","v":""}]
["",{"$f":"IFERROR(IF(ROWS($B$2:B326)>'بينات التلاميد'!$Q$5,\"\",INDEX('بينات التلاميد'!$B$5:$B$56,SMALL(IF('بينات التلاميد'!$B$5:$B$56<>\"\",ROW('بينات التلاميد'!$B$5:$B$56)-ROW($B$5)+1),ROWS($B$2:B326)))),\"\")","v":""},{"$f":"IFERROR(VLOOKUP(B326,'بينات التلاميد'!$B$5:$G$56,6,0),\"\")","v":""}]
["",{"$f":"IFERROR(IF(ROWS($B$2:B327)>'بينات التلاميد'!$Q$5,\"\",INDEX('بينات التلاميد'!$B$5:$B$56,SMALL(IF('بينات التلاميد'!$B$5:$B$56<>\"\",ROW('بينات التلاميد'!$B$5:$B$56)-ROW($B$5)+1),ROWS($B$2:B327)))),\"\")","v":""},{"$f":"IFERROR(VLOOKUP(B327,'بينات التلاميد'!$B$5:$G$56,6,0),\"\")","v":""}]
["",{"$f":"IFERROR(IF(ROWS($B$2:B328)>'بينات التلاميد'!$Q$5,\"\",INDEX('بينات التلاميد'!$B$5:$B$56,SMALL(IF('بينات التلاميد'!$B$5:$B$56<>\"\",ROW('بينات التلاميد'!$B$5:$B$56)-ROW($B$5)+1),ROWS($B$2:B328)))),\"\")","v":""},{"$f":"IFERROR(VLOOKUP(B328,'بينات التلاميد'!$B$5:$G$56,6,0),\"\")","v":""}]
["",{"$f":"IFERROR(IF(ROWS($B$2:B329)>'بينات التلاميد'!$Q$5,\"\",INDEX('بينات التلاميد'!$B$5:$B$56,SMALL(IF('بينات التلاميد'!$B$5:$B$56<>\"\",ROW('بينات التلاميد'!$B$5:$B$56)-ROW($B$5)+1),ROWS($B$2:B329)))),\"\")","v":""},{"$f":"IFERROR(VLOOKUP(B329,'بينات التلاميد'!$B$5:$G$56,6,0),\"\")","v":""}]
["",{"$f":"IFERROR(IF(ROWS($B$2:B330)>'بينات التلاميد'!$Q$5,\"\",INDEX('بينات التلاميد'!$B$5:$B$56,SMALL(IF('بينات التلاميد'!$B$5:$B$56<>\"\",ROW('بينات التلاميد'!$B$5:$B$56)-ROW($B$5)+1),ROWS($B$2:B330)))),\"\")","v":""},{"$f":"IFERROR(VLOOKUP(B330,'بينات التلاميد'!$B$5:$G$56,6,0),\"\")","v":""}]
["",{"$f":"IFERROR(IF(ROWS($B$2:B331)>'بينات التلاميد'!$Q$5,\"\",INDEX('بينات التلاميد'!$B$5:$B$56,SMALL(IF('بينات التلاميد'!$B$5:$B$56<>\"\",ROW('بينات التلاميد'!$B$5:$B$56)-ROW($B$5)+1),ROWS($B$2:B331)))),\"\")","v":""},{"$f":"IFERROR(VLOOKUP(B331,'بينات التلاميد'!$B$5:$G$56,6,0),\"\")","v":""}]
["",{"$f":"IFERROR(IF(ROWS($B$2:B332)>'بينات التلاميد'!$Q$5,\"\",INDEX('بينات التلاميد'!$B$5:$B$56,SMALL(IF('بينات التلاميد'!$B$5:$B$56<>\"\",ROW('بينات التلاميد'!$B$5:$B$56)-ROW($B$5)+1),ROWS($B$2:B332)))),\"\")","v":""},{"$f":"IFERROR(VLOOKUP(B332,'بينات التلاميد'!$B$5:$G$56,6,0),\"\")","v":""}]
["",{"$f":"IFERROR(IF(ROWS($B$2:B333)>'بينات التلاميد'!$Q$5,\"\",INDEX('بينات التلاميد'!$B$5:$B$56,SMALL(IF('بينات التلاميد'!$B$5:$B$56<>\"\",ROW('بينات التلاميد'!$B$5:$B$56)-ROW($B$5)+1),ROWS($B$2:B333)))),\"\")","v":""},{"$f":"IFERROR(VLOOKUP(B333,'بينات التلاميد'!$B$5:$G$56,6,0),\"\")","v":""}]
["",{"$f":"IFERROR(IF(ROWS($B$2:B334)>'بينات التلاميد'!$Q$5,\"\",INDEX('بينات التلاميد'!$B$5:$B$56,SMALL(IF('بينات التلاميد'!$B$5:$B$56<>\"\",ROW('بينات التلاميد'!$B$5:$B$56)-ROW($B$5)+1),ROWS($B$2:B334)))),\"\")","v":""},{"$f":"IFERROR(VLOOKUP(B334,'بينات التلاميد'!$B$5:$G$56,6,0),\"\")","v":""}]
["",{"$f":"IFERROR(IF(ROWS($B$2:B335)>'بينات التلاميد'!$Q$5,\"\",INDEX('بينات التلاميد'!$B$5:$B$56,SMALL(IF('بينات التلاميد'!$B$5:$B$56<>\"\",ROW('بينات التلاميد'!$B$5:$B$56)-ROW($B$5)+1),ROWS($B$2:B335)))),\"\")","v":""},{"$f":"IFERROR(VLOOKUP(B335,'بينات التلاميد'!$B$5:$G$56,6,0),\"\")","v":""}]
["",{"$f":"IFERROR(IF(ROWS($B$2:B336)>'بينات التلاميد'!$Q$5,\"\",INDEX('بينات التلاميد'!$B$5:$B$56,SMALL(IF('بينات التلاميد'!$B$5:$B$56<>\"\",ROW('بينات التلاميد'!$B$5:$B$56)-ROW($B$5)+1),ROWS($B$2:B336)))),\"\")","v":""},{"$f":"IFERROR(VLOOKUP(B336,'بينات التلاميد'!$B$5:$G$56,6,0),\"\")","v":""}]
["",{"$f":"IFERROR(IF(ROWS($B$2:B337)>'بينات التلاميد'!$Q$5,\"\",INDEX('بينات التلاميد'!$B$5:$B$56,SMALL(IF('بينات التلاميد'!$B$5:$B$56<>\"\",ROW('بينات التلاميد'!$B$5:$B$56)-ROW($B$5)+1),ROWS($B$2:B337)))),\"\")","v":""},{"$f":"IFERROR(VLOOKUP(B337,'بينات التلاميد'!$B$5:$G$56,6,0),\"\")","v":""}]
["",{"$f":"IFERROR(IF(ROWS($B$2:B338)>'بينات التلاميد'!$Q$5,\"\",INDEX('بينات التلاميد'!$B$5:$B$56,SMALL(IF('بينات التلاميد'!$B$5:$B$56<>\"\",ROW('بينات التلاميد'!$B$5:$B$56)-ROW($B$5)+1),ROWS($B$2:B338)))),\"\")","v":""},{"$f":"IFERROR(VLOOKUP(B338,'بينات التلاميد'!$B$5:$G$56,6,0),\"\")","v":""}]
["",{"$f":"IFERROR(IF(ROWS($B$2:B339)>'بينات التلاميد'!$Q$5,\"\",INDEX('بينات التلاميد'!$B$5:$B$56,SMALL(IF('بينات التلاميد'!$B$5:$B$56<>\"\",ROW('بينات التلاميد'!$B$5:$B$56)-ROW($B$5)+1),ROWS($B$2:B339)))),\"\")","v":""},{"$f":"IFERROR(VLOOKUP(B339,'بينات التلاميد'!$B$5:$G$56,6,0),\"\")","v":""}]
["",{"$f":"IFERROR(IF(ROWS($B$2:B340)>'بينات التلاميد'!$Q$5,\"\",INDEX('بينات التلاميد'!$B$5:$B$56,SMALL(IF('بينات التلاميد'!$B$5:$B$56<>\"\",ROW('بينات التلاميد'!$B$5:$B$56)-ROW($B$5)+1),ROWS($B$2:B340)))),\"\")","v":""},{"$f":"IFERROR(VLOOKUP(B340,'بينات التلاميد'!$B$5:$G$56,6,0),\"\")","v":""}]
["",{"$f":"IFERROR(IF(ROWS($B$2:B341)>'بينات التلاميد'!$Q$5,\"\",INDEX('بينات التلاميد'!$B$5:$B$56,SMALL(IF('بينات التلاميد'!$B$5:$B$56<>\"\",ROW('بينات التلاميد'!$B$5:$B$56)-ROW($B$5)+1),ROWS($B$2:B341)))),\"\")","v":""},{"$f":"IFERROR(VLOOKUP(B341,'بينات التلاميد'!$B$5:$G$56,6,0),\"\")","v":""}]
["",{"$f":"IFERROR(IF(ROWS($B$2:B342)>'بينات التلاميد'!$Q$5,\"\",INDEX('بينات التلاميد'!$B$5:$B$56,SMALL(IF('بينات التلاميد'!$B$5:$B$56<>\"\",ROW('بينات التلاميد'!$B$5:$B$56)-ROW($B$5)+1),ROWS($B$2:B342)))),\"\")","v":""},{"$f":"IFERROR(VLOOKUP(B342,'بينات التلاميد'!$B$5:$G$56,6,0),\"\")","v":""}]
["",{"$f":"IFERROR(IF(ROWS($B$2:B343)>'بينات التلاميد'!$Q$5,\"\",INDEX('بينات التلاميد'!$B$5:$B$56,SMALL(IF('بينات التلاميد'!$B$5:$B$56<>\"\",ROW('بينات التلاميد'!$B$5:$B$56)-ROW($B$5)+1),ROWS($B$2:B343)))),\"\")","v":""},{"$f":"IFERROR(VLOOKUP(B343,'بينات التلاميد'!$B$5:$G$56,6,0),\"\")","v":""}]
["",{"$f":"IFERROR(IF(ROWS($B$2:B344)>'بينات التلاميد'!$Q$5,\"\",INDEX('بينات التلاميد'!$B$5:$B$56,SMALL(IF('بينات التلاميد'!$B$5:$B$56<>\"\",ROW('بينات التلاميد'!$B$5:$B$56)-ROW($B$5)+1),ROWS($B$2:B344)))),\"\")","v":""},{"$f":"IFERROR(VLOOKUP(B344,'بينات التلاميد'!$B$5:$G$56,6,0),\"\")","v":""}]
["",{"$f":"IFERROR(IF(ROWS($B$2:B345)>'بينات التلاميد'!$Q$5,\"\",INDEX('بينات التلاميد'!$B$5:$B$56,SMALL(IF('بينات التلاميد'!$B$5:$B$56<>\"\",ROW('بينات التلاميد'!$B$5:$B$56)-ROW($B$5)+1),ROWS($B$2:B345)))),\"\")","v":""},{"$f":"IFERROR(VLOOKUP(B345,'بينات التلاميد'!$B$5:$G$56,6,0),\"\")","v":""}]
["",{"$f":"IFERROR(IF(ROWS($B$2:B346)>'بينات التلاميد'!$Q$5,\"\",INDEX('بينات التلاميد'!$B$5:$B$56,SMALL(IF('بينات التلاميد'!$B$5:$B$56<>\"\",ROW('بينات التلاميد'!$B$5:$B$56)-ROW($B$5)+1),ROWS($B$2:B346)))),\"\")","v":""},{"$f":"IFERROR(VLOOKUP(B346,'بينات التلاميد'!$B$5:$G$56,6,0),\"\")","v":""}]
["",{"$f":"IFERROR(IF(ROWS($B$2:B347)>'بينات التلاميد'!$Q$5,\"\",INDEX('بينات التلاميد'!$B$5:$B$56,SMALL(IF('بينات التلاميد'!$B$5:$B$56<>\"\",ROW('بينات التلاميد'!$B$5:$B$56)-ROW($B$5)+1),ROWS($B$2:B347)))),\"\")","v":""},{"$f":"IFERROR(VLOOKUP(B347,'بينات التلاميد'!$B$5:$G$56,6,0),\"\")","v":""}]
["",{"$f":"IFERROR(IF(ROWS($B$2:B348)>'بينات التلاميد'!$Q$5,\"\",INDEX('بينات التلاميد'!$B$5:$B$56,SMALL(IF('بينات التلاميد'!$B$5:$B$56<>\"\",ROW('بينات التلاميد'!$B$5:$B$56)-ROW($B$5)+1),ROWS($B$2:B348)))),\"\")","v":""},{"$f":"IFERROR(VLOOKUP(B348,'بينات التلاميد'!$B$5:$G$56,6,0),\"\")","v":""}]
["",{"$f":"IFERROR(IF(ROWS($B$2:B349)>'بينات التلاميد'!$Q$5,\"\",INDEX('بينات التلاميد'!$B$5:$B$56,SMALL(IF('بينات التلاميد'!$B$5:$B$56<>\"\",ROW('بينات التلاميد'!$B$5:$B$56)-ROW($B$5)+1),ROWS($B$2:B349)))),\"\")","v":""},{"$f":"IFERROR(VLOOKUP(B349,'بينات التلاميد'!$B$5:$G$56,6,0),\"\")","v":""}]
["",{"$f":"IFERROR(IF(ROWS($B$2:B350)>'بينات التلاميد'!$Q$5,\"\",INDEX('بينات التلاميد'!$B$5:$B$56,SMALL(IF('بينات التلاميد'!$B$5:$B$56<>\"\",ROW('بينات التلاميد'!$B$5:$B$56)-ROW($B$5)+1),ROWS($B$2:B350)))),\"\")","v":""},{"$f":"IFERROR(VLOOKUP(B350,'بينات التلاميد'!$B$5:$G$56,6,0),\"\")","v":""}]
["",{"$f":"IFERROR(IF(ROWS($B$2:B351)>'بينات التلاميد'!$Q$5,\"\",INDEX('بينات التلاميد'!$B$5:$B$56,SMALL(IF('بينات التلاميد'!$B$5:$B$56<>\"\",ROW('بينات التلاميد'!$B$5:$B$56)-ROW($B$5)+1),ROWS($B$2:B351)))),\"\")","v":""},{"$f":"IFERROR(VLOOKUP(B351,'بينات التلاميد'!$B$5:$G$56,6,0),\"\")","v":""}]
["",{"$f":"IFERROR(IF(ROWS($B$2:B352)>'بينات التلاميد'!$Q$5,\"\",INDEX('بينات التلاميد'!$B$5:$B$56,SMALL(IF('بينات التلاميد'!$B$5:$B$56<>\"\",ROW('بينات التلاميد'!$B$5:$B$56)-ROW($B$5)+1),ROWS($B$2:B352)))),\"\")","v":""},{"$f":"IFERROR(VLOOKUP(B352,'بينات التلاميد'!$B$5:$G$56,6,0),\"\")","v":""}]
["",{"$f":"IFERROR(IF(ROWS($B$2:B353)>'بينات التلاميد'!$Q$5,\"\",INDEX('بينات التلاميد'!$B$5:$B$56,SMALL(IF('بينات التلاميد'!$B$5:$B$56<>\"\",ROW('بينات التلاميد'!$B$5:$B$56)-ROW($B$5)+1),ROWS($B$2:B353)))),\"\")","v":""},{"$f":"IFERROR(VLOOKUP(B353,'بينات التلاميد'!$B$5:$G$56,6,0),\"\")","v":""}]
["",{"$f":"IFERROR(IF(ROWS($B$2:B354)>'بينات التلاميد'!$Q$5,\"\",INDEX('بينات التلاميد'!$B$5:$B$56,SMALL(IF('بينات التلاميد'!$B$5:$B$56<>\"\",ROW('بينات التلاميد'!$B$5:$B$56)-ROW($B$5)+1),ROWS($B$2:B354)))),\"\")","v":""},{"$f":"IFERROR(VLOOKUP(B354,'بينات التلاميد'!$B$5:$G$56,6,0),\"\")","v":""}]
["",{"$f":"IFERROR(IF(ROWS($B$2:B355)>'بينات التلاميد'!$Q$5,\"\",INDEX('بينات التلاميد'!$B$5:$B$56,SMALL(IF('بينات التلاميد'!$B$5:$B$56<>\"\",ROW('بينات التلاميد'!$B$5:$B$56)-ROW($B$5)+1),ROWS($B$2:B355)))),\"\")","v":""},{"$f":"IFERROR(VLOOKUP(B355,'بينات التلاميد'!$B$5:$G$56,6,0),\"\")","v":""}]
["",{"$f":"IFERROR(IF(ROWS($B$2:B356)>'بينات التلاميد'!$Q$5,\"\",INDEX('بينات التلاميد'!$B$5:$B$56,SMALL(IF('بينات التلاميد'!$B$5:$B$56<>\"\",ROW('بينات التلاميد'!$B$5:$B$56)-ROW($B$5)+1),ROWS($B$2:B356)))),\"\")","v":""},{"$f":"IFERROR(VLOOKUP(B356,'بينات التلاميد'!$B$5:$G$56,6,0),\"\")","v":""}]
["",{"$f":"IFERROR(IF(ROWS($B$2:B357)>'بينات التلاميد'!$Q$5,\"\",INDEX('بينات التلاميد'!$B$5:$B$56,SMALL(IF('بينات التلاميد'!$B$5:$B$56<>\"\",ROW('بينات التلاميد'!$B$5:$B$56)-ROW($B$5)+1),ROWS($B$2:B357)))),\"\")","v":""},{"$f":"IFERROR(VLOOKUP(B357,'بينات التلاميد'!$B$5:$G$56,6,0),\"\")","v":""}]
["",{"$f":"IFERROR(IF(ROWS($B$2:B358)>'بينات التلاميد'!$Q$5,\"\",INDEX('بينات التلاميد'!$B$5:$B$56,SMALL(IF('بينات التلاميد'!$B$5:$B$56<>\"\",ROW('بينات التلاميد'!$B$5:$B$56)-ROW($B$5)+1),ROWS($B$2:B358)))),\"\")","v":""},{"$f":"IFERROR(VLOOKUP(B358,'بينات التلاميد'!$B$5:$G$56,6,0),\"\")","v":""}]
["",{"$f":"IFERROR(IF(ROWS($B$2:B359)>'بينات التلاميد'!$Q$5,\"\",INDEX('بينات التلاميد'!$B$5:$B$56,SMALL(IF('بينات التلاميد'!$B$5:$B$56<>\"\",ROW('بينات التلاميد'!$B$5:$B$56)-ROW($B$5)+1),ROWS($B$2:B359)))),\"\")","v":""},{"$f":"IFERROR(VLOOKUP(B359,'بينات التلاميد'!$B$5:$G$56,6,0),\"\")","v":""}]
["",{"$f":"IFERROR(IF(ROWS($B$2:B360)>'بينات التلاميد'!$Q$5,\"\",INDEX('بينات التلاميد'!$B$5:$B$56,SMALL(IF('بينات التلاميد'!$B$5:$B$56<>\"\",ROW('بينات التلاميد'!$B$5:$B$56)-ROW($B$5)+1),ROWS($B$2:B360)))),\"\")","v":""},{"$f":"IFERROR(VLOOKUP(B360,'بينات التلاميد'!$B$5:$G$56,6,0),\"\")","v":""}]
["",{"$f":"IFERROR(IF(ROWS($B$2:B361)>'بينات التلاميد'!$Q$5,\"\",INDEX('بينات التلاميد'!$B$5:$B$56,SMALL(IF('بينات التلاميد'!$B$5:$B$56<>\"\",ROW('بينات التلاميد'!$B$5:$B$56)-ROW($B$5)+1),ROWS($B$2:B361)))),\"\")","v":""},{"$f":"IFERROR(VLOOKUP(B361,'بينات التلاميد'!$B$5:$G$56,6,0),\"\")","v":""}]
["",{"$f":"IFERROR(IF(ROWS($B$2:B362)>'بينات التلاميد'!$Q$5,\"\",INDEX('بينات التلاميد'!$B$5:$B$56,SMALL(IF('بينات التلاميد'!$B$5:$B$56<>\"\",ROW('بينات التلاميد'!$B$5:$B$56)-ROW($B$5)+1),ROWS($B$2:B362)))),\"\")","v":""},{"$f":"IFERROR(VLOOKUP(B362,'بينات التلاميد'!$B$5:$G$56,6,0),\"\")","v":""}]
["",{"$f":"IFERROR(IF(ROWS($B$2:B363)>'بينات التلاميد'!$Q$5,\"\",INDEX('بينات التلاميد'!$B$5:$B$56,SMALL(IF('بينات التلاميد'!$B$5:$B$56<>\"\",ROW('بينات التلاميد'!$B$5:$B$56)-ROW($B$5)+1),ROWS($B$2:B363)))),\"\")","v":""},{"$f":"IFERROR(VLOOKUP(B363,'بينات التلاميد'!$B$5:$G$56,6,0),\"\")","v":""}]
["",{"$f":"IFERROR(IF(ROWS($B$2:B364)>'بينات التلاميد'!$Q$5,\"\",INDEX('بينات التلاميد'!$B$5:$B$56,SMALL(IF('بينات التلاميد'!$B$5:$B$56<>\"\",ROW('بينات التلاميد'!$B$5:$B$56)-ROW($B$5)+1),ROWS($B$2:B364)))),\"\")","v":""},{"$f":"IFERROR(VLOOKUP(B364,'بينات التلاميد'!$B$5:$G$56,6,0),\"\")","v":""}]
["",{"$f":"IFERROR(IF(ROWS($B$2:B365)>'بينات التلاميد'!$Q$5,\"\",INDEX('بينات التلاميد'!$B$5:$B$56,SMALL(IF('بينات التلاميد'!$B$5:$B$56<>\"\",ROW('بينات التلاميد'!$B$5:$B$56)-ROW($B$5)+1),ROWS($B$2:B365)))),\"\")","v":""},{"$f":"IFERROR(VLOOKUP(B365,'بينات التلاميد'!$B$5:$G$56,6,0),\"\")","v":""}]
["",{"$f":"IFERROR(IF(ROWS($B$2:B366)>'بينات التلاميد'!$Q$5,\"\",INDEX('بينات التلاميد'!$B$5:$B$56,SMALL(IF('بينات التلاميد'!$B$5:$B$56<>\"\",ROW('بينات التلاميد'!$B$5:$B$56)-ROW($B$5)+1),ROWS($B$2:B366)))),\"\")","v":""},{"$f":"IFERROR(VLOOKUP(B366,'بينات التلاميد'!$B$5:$G$56,6,0),\"\")","v":""}]
["",{"$f":"IFERROR(IF(ROWS($B$2:B367)>'بينات التلاميد'!$Q$5,\"\",INDEX('بينات التلاميد'!$B$5:$B$56,SMALL(IF('بينات التلاميد'!$B$5:$B$56<>\"\",ROW('بينات التلاميد'!$B$5:$B$56)-ROW($B$5)+1),ROWS($B$2:B367)))),\"\")","v":""},{"$f":"IFERROR(VLOOKUP(B367,'بينات التلاميد'!$B$5:$G$56,6,0),\"\")","v":""}]
["",{"$f":"IFERROR(IF(ROWS($B$2:B368)>'بينات التلاميد'!$Q$5,\"\",INDEX('بينات التلاميد'!$B$5:$B$56,SMALL(IF('بينات التلاميد'!$B$5:$B$56<>\"\",ROW('بينات التلاميد'!$B$5:$B$56)-ROW($B$5)+1),ROWS($B$2:B368)))),\"\")","v":""},{"$f":"IFERROR(VLOOKUP(B368,'بينات التلاميد'!$B$5:$G$56,6,0),\"\")","v":""}]
["",{"$f":"IFERROR(IF(ROWS($B$2:B369)>'بينات التلاميد'!$Q$5,\"\",INDEX('بينات التلاميد'!$B$5:$B$56,SMALL(IF('بينات التلاميد'!$B$5:$B$56<>\"\",ROW('بينات التلاميد'!$B$5:$B$56)-ROW($B$5)+1),ROWS($B$2:B369)))),\"\")","v":""},{"$f":"IFERROR(VLOOKUP(B369,'بينات التلاميد'!$B$5:$G$56,6,0),\"\")","v":""}]
["",{"$f":"IFERROR(IF(ROWS($B$2:B370)>'بينات التلاميد'!$Q$5,\"\",INDEX('بينات التلاميد'!$B$5:$B$56,SMALL(IF('بينات التلاميد'!$B$5:$B$56<>\"\",ROW('بينات التلاميد'!$B$5:$B$56)-ROW($B$5)+1),ROWS($B$2:B370)))),\"\")","v":""},{"$f":"IFERROR(VLOOKUP(B370,'بينات التلاميد'!$B$5:$G$56,6,0),\"\")","v":""}]
["",{"$f":"IFERROR(IF(ROWS($B$2:B371)>'بينات التلاميد'!$Q$5,\"\",INDEX('بينات التلاميد'!$B$5:$B$56,SMALL(IF('بينات التلاميد'!$B$5:$B$56<>\"\",ROW('بينات التلاميد'!$B$5:$B$56)-ROW($B$5)+1),ROWS($B$2:B371)))),\"\")","v":""},{"$f":"IFERROR(VLOOKUP(B371,'بينات التلاميد'!$B$5:$G$56,6,0),\"\")","v":""}]
["",{"$f":"IFERROR(IF(ROWS($B$2:B372)>'بينات التلاميد'!$Q$5,\"\",INDEX('بينات التلاميد'!$B$5:$B$56,SMALL(IF('بينات التلاميد'!$B$5:$B$56<>\"\",ROW('بينات التلاميد'!$B$5:$B$56)-ROW($B$5)+1),ROWS($B$2:B372)))),\"\")","v":""},{"$f":"IFERROR(VLOOKUP(B372,'بينات التلاميد'!$B$5:$G$56,6,0),\"\")","v":""}]
["",{"$f":"IFERROR(IF(ROWS($B$2:B373)>'بينات التلاميد'!$Q$5,\"\",INDEX('بينات التلاميد'!$B$5:$B$56,SMALL(IF('بينات التلاميد'!$B$5:$B$56<>\"\",ROW('بينات التلاميد'!$B$5:$B$56)-ROW($B$5)+1),ROWS($B$2:B373)))),\"\")","v":""},{"$f":"IFERROR(VLOOKUP(B373,'بينات التلاميد'!$B$5:$G$56,6,0),\"\")","v":""}]
["",{"$f":"IFERROR(IF(ROWS($B$2:B374)>'بينات التلاميد'!$Q$5,\"\",INDEX('بينات التلاميد'!$B$5:$B$56,SMALL(IF('بينات التلاميد'!$B$5:$B$56<>\"\",ROW('بينات التلاميد'!$B$5:$B$56)-ROW($B$5)+1),ROWS($B$2:B374)))),\"\")","v":""},{"$f":"IFERROR(VLOOKUP(B374,'بينات التلاميد'!$B$5:$G$56,6,0),\"\")","v":""}]
["",{"$f":"IFERROR(IF(ROWS($B$2:B375)>'بينات التلاميد'!$Q$5,\"\",INDEX('بينات التلاميد'!$B$5:$B$56,SMALL(IF('بينات التلاميد'!$B$5:$B$56<>\"\",ROW('بينات التلاميد'!$B$5:$B$56)-ROW($B$5)+1),ROWS($B$2:B375)))),\"\")","v":""},{"$f":"IFERROR(VLOOKUP(B375,'بينات التلاميد'!$B$5:$G$56,6,0),\"\")","v":""}]
["",{"$f":"IFERROR(IF(ROWS($B$2:B376)>'بينات التلاميد'!$Q$5,\"\",INDEX('بينات التلاميد'!$B$5:$B$56,SMALL(IF('بينات التلاميد'!$B$5:$B$56<>\"\",ROW('بينات التلاميد'!$B$5:$B$56)-ROW($B$5)+1),ROWS($B$2:B376)))),\"\")","v":""},{"$f":"IFERROR(VLOOKUP(B376,'بينات التلاميد'!$B$5:$G$56,6,0),\"\")","v":""}]
["",{"$f":"IFERROR(IF(ROWS($B$2:B377)>'بينات التلاميد'!$Q$5,\"\",INDEX('بينات التلاميد'!$B$5:$B$56,SMALL(IF('بينات التلاميد'!$B$5:$B$56<>\"\",ROW('بينات التلاميد'!$B$5:$B$56)-ROW($B$5)+1),ROWS($B$2:B377)))),\"\")","v":""},{"$f":"IFERROR(VLOOKUP(B377,'بينات التلاميد'!$B$5:$G$56,6,0),\"\")","v":""}]
["",{"$f":"IFERROR(IF(ROWS($B$2:B378)>'بينات التلاميد'!$Q$5,\"\",INDEX('بينات التلاميد'!$B$5:$B$56,SMALL(IF('بينات التلاميد'!$B$5:$B$56<>\"\",ROW('بينات التلاميد'!$B$5:$B$56)-ROW($B$5)+1),ROWS($B$2:B378)))),\"\")","v":""},{"$f":"IFERROR(VLOOKUP(B378,'بينات التلاميد'!$B$5:$G$56,6,0),\"\")","v":""}]
["",{"$f":"IFERROR(IF(ROWS($B$2:B379)>'بينات التلاميد'!$Q$5,\"\",INDEX('بينات التلاميد'!$B$5:$B$56,SMALL(IF('بينات التلاميد'!$B$5:$B$56<>\"\",ROW('بينات التلاميد'!$B$5:$B$56)-ROW($B$5)+1),ROWS($B$2:B379)))),\"\")","v":""},{"$f":"IFERROR(VLOOKUP(B379,'بينات التلاميد'!$B$5:$G$56,6,0),\"\")","v":""}]
["",{"$f":"IFERROR(IF(ROWS($B$2:B380)>'بينات التلاميد'!$Q$5,\"\",INDEX('بينات التلاميد'!$B$5:$B$56,SMALL(IF('بينات التلاميد'!$B$5:$B$56<>\"\",ROW('بينات التلاميد'!$B$5:$B$56)-ROW($B$5)+1),ROWS($B$2:B380)))),\"\")","v":""},{"$f":"IFERROR(VLOOKUP(B380,'بينات التلاميد'!$B$5:$G$56,6,0),\"\")","v":""}]
["",{"$f":"IFERROR(IF(ROWS($B$2:B381)>'بينات التلاميد'!$Q$5,\"\",INDEX('بينات التلاميد'!$B$5:$B$56,SMALL(IF('بينات التلاميد'!$B$5:$B$56<>\"\",ROW('بينات التلاميد'!$B$5:$B$56)-ROW($B$5)+1),ROWS($B$2:B381)))),\"\")","v":""},{"$f":"IFERROR(VLOOKUP(B381,'بينات التلاميد'!$B$5:$G$56,6,0),\"\")","v":""}]
["",{"$f":"IFERROR(IF(ROWS($B$2:B382)>'بينات التلاميد'!$Q$5,\"\",INDEX('بينات التلاميد'!$B$5:$B$56,SMALL(IF('بينات التلاميد'!$B$5:$B$56<>\"\",ROW('بينات التلاميد'!$B$5:$B$56)-ROW($B$5)+1),ROWS($B$2:B382)))),\"\")","v":""},{"$f":"IFERROR(VLOOKUP(B382,'بينات التلاميد'!$B$5:$G$56,6,0),\"\")","v":""}]
["",{"$f":"IFERROR(IF(ROWS($B$2:B383)>'بينات التلاميد'!$Q$5,\"\",INDEX('بينات التلاميد'!$B$5:$B$56,SMALL(IF('بينات التلاميد'!$B$5:$B$56<>\"\",ROW('بينات التلاميد'!$B$5:$B$56)-ROW($B$5)+1),ROWS($B$2:B383)))),\"\")","v":""},{"$f":"IFERROR(VLOOKUP(B383,'بينات التلاميد'!$B$5:$G$56,6,0),\"\")","v":""}]
["",{"$f":"IFERROR(IF(ROWS($B$2:B384)>'بينات التلاميد'!$Q$5,\"\",INDEX('بينات التلاميد'!$B$5:$B$56,SMALL(IF('بينات التلاميد'!$B$5:$B$56<>\"\",ROW('بينات التلاميد'!$B$5:$B$56)-ROW($B$5)+1),ROWS($B$2:B384)))),\"\")","v":""},{"$f":"IFERROR(VLOOKUP(B384,'بينات التلاميد'!$B$5:$G$56,6,0),\"\")","v":""}]
["",{"$f":"IFERROR(IF(ROWS($B$2:B385)>'بينات التلاميد'!$Q$5,\"\",INDEX('بينات التلاميد'!$B$5:$B$56,SMALL(IF('بينات التلاميد'!$B$5:$B$56<>\"\",ROW('بينات التلاميد'!$B$5:$B$56)-ROW($B$5)+1),ROWS($B$2:B385)))),\"\")","v":""},{"$f":"IFERROR(VLOOKUP(B385,'بينات التلاميد'!$B$5:$G$56,6,0),\"\")","v":""}]
[{"$f":"IFERROR(VLOOKUP(C386,$D$2:$E$20,2,0),\"\")","v":""},{"$f":"IFERROR(IF(ROWS($B$2:B386)>'بينات التلاميد'!$Q$5,\"\",INDEX('بينات التلاميد'!$B$5:$B$56,SMALL(IF('بينات التلاميد'!$B$5:$B$56<>\"\",ROW('بينات التلاميد'!$B$5:$B$56)-ROW($B$5)+1),ROWS($B$2:B386)))),\"\")","v":""},{"$f":"IFERROR(VLOOKUP(B386,'بينات التلاميد'!$B$5:$G$56,6,0),\"\")","v":""}]
["",{"$f":"IFERROR(IF(ROWS($B$2:B387)>'بينات التلاميد'!$Q$5,\"\",INDEX('بينات التلاميد'!$B$5:$B$56,SMALL(IF('بينات التلاميد'!$B$5:$B$56<>\"\",ROW('بينات التلاميد'!$B$5:$B$56)-ROW($B$5)+1),ROWS($B$2:B387)))),\"\")","v":""},{"$f":"IFERROR(VLOOKUP(B387,'بينات التلاميد'!$B$5:$G$56,6,0),\"\")","v":""}]
["",{"$f":"IFERROR(IF(ROWS($B$2:B388)>'بينات التلاميد'!$Q$5,\"\",INDEX('بينات التلاميد'!$B$5:$B$56,SMALL(IF('بينات التلاميد'!$B$5:$B$56<>\"\",ROW('بينات التلاميد'!$B$5:$B$56)-ROW($B$5)+1),ROWS($B$2:B388)))),\"\")","v":""},{"$f":"IFERROR(VLOOKUP(B388,'بينات التلاميد'!$B$5:$G$56,6,0),\"\")","v":""}]
["",{"$f":"IFERROR(IF(ROWS($B$2:B389)>'بينات التلاميد'!$Q$5,\"\",INDEX('بينات التلاميد'!$B$5:$B$56,SMALL(IF('بينات التلاميد'!$B$5:$B$56<>\"\",ROW('بينات التلاميد'!$B$5:$B$56)-ROW($B$5)+1),ROWS($B$2:B389)))),\"\")","v":""},{"$f":"IFERROR(VLOOKUP(B389,'بينات التلاميد'!$B$5:$G$56,6,0),\"\")","v":""}]
["",{"$f":"IFERROR(IF(ROWS($B$2:B390)>'بينات التلاميد'!$Q$5,\"\",INDEX('بينات التلاميد'!$B$5:$B$56,SMALL(IF('بينات التلاميد'!$B$5:$B$56<>\"\",ROW('بينات التلاميد'!$B$5:$B$56)-ROW($B$5)+1),ROWS($B$2:B390)))),\"\")","v":""},{"$f":"IFERROR(VLOOKUP(B390,'بينات التلاميد'!$B$5:$G$56,6,0),\"\")","v":""}]
["",{"$f":"IFERROR(IF(ROWS($B$2:B391)>'بينات التلاميد'!$Q$5,\"\",INDEX('بينات التلاميد'!$B$5:$B$56,SMALL(IF('بينات التلاميد'!$B$5:$B$56<>\"\",ROW('بينات التلاميد'!$B$5:$B$56)-ROW($B$5)+1),ROWS($B$2:B391)))),\"\")","v":""},{"$f":"IFERROR(VLOOKUP(B391,'بينات التلاميد'!$B$5:$G$56,6,0),\"\")","v":""}]
["",{"$f":"IFERROR(IF(ROWS($B$2:B392)>'بينات التلاميد'!$Q$5,\"\",INDEX('بينات التلاميد'!$B$5:$B$56,SMALL(IF('بينات التلاميد'!$B$5:$B$56<>\"\",ROW('بينات التلاميد'!$B$5:$B$56)-ROW($B$5)+1),ROWS($B$2:B392)))),\"\")","v":""},{"$f":"IFERROR(VLOOKUP(B392,'بينات التلاميد'!$B$5:$G$56,6,0),\"\")","v":""}]
["",{"$f":"IFERROR(IF(ROWS($B$2:B393)>'بينات التلاميد'!$Q$5,\"\",INDEX('بينات التلاميد'!$B$5:$B$56,SMALL(IF('بينات التلاميد'!$B$5:$B$56<>\"\",ROW('بينات التلاميد'!$B$5:$B$56)-ROW($B$5)+1),ROWS($B$2:B393)))),\"\")","v":""},{"$f":"IFERROR(VLOOKUP(B393,'بينات التلاميد'!$B$5:$G$56,6,0),\"\")","v":""}]
["",{"$f":"IFERROR(IF(ROWS($B$2:B394)>'بينات التلاميد'!$Q$5,\"\",INDEX('بينات التلاميد'!$B$5:$B$56,SMALL(IF('بينات التلاميد'!$B$5:$B$56<>\"\",ROW('بينات التلاميد'!$B$5:$B$56)-ROW($B$5)+1),ROWS($B$2:B394)))),\"\")","v":""},{"$f":"IFERROR(VLOOKUP(B394,'بينات التلاميد'!$B$5:$G$56,6,0),\"\")","v":""}]
["",{"$f":"IFERROR(IF(ROWS($B$2:B395)>'بينات التلاميد'!$Q$5,\"\",INDEX('بينات التلاميد'!$B$5:$B$56,SMALL(IF('بينات التلاميد'!$B$5:$B$56<>\"\",ROW('بينات التلاميد'!$B$5:$B$56)-ROW($B$5)+1),ROWS($B$2:B395)))),\"\")","v":""},{"$f":"IFERROR(VLOOKUP(B395,'بينات التلاميد'!$B$5:$G$56,6,0),\"\")","v":""}]
["",{"$f":"IFERROR(IF(ROWS($B$2:B396)>'بينات التلاميد'!$Q$5,\"\",INDEX('بينات التلاميد'!$B$5:$B$56,SMALL(IF('بينات التلاميد'!$B$5:$B$56<>\"\",ROW('بينات التلاميد'!$B$5:$B$56)-ROW($B$5)+1),ROWS($B$2:B396)))),\"\")","v":""},{"$f":"IFERROR(VLOOKUP(B396,'بينات التلاميد'!$B$5:$G$56,6,0),\"\")","v":""}]
["",{"$f":"IFERROR(IF(ROWS($B$2:B397)>'بينات التلاميد'!$Q$5,\"\",INDEX('بينات التلاميد'!$B$5:$B$56,SMALL(IF('بينات التلاميد'!$B$5:$B$56<>\"\",ROW('بينات التلاميد'!$B$5:$B$56)-ROW($B$5)+1),ROWS($B$2:B397)))),\"\")","v":""},{"$f":"IFERROR(VLOOKUP(B397,'بينات التلاميد'!$B$5:$G$56,6,0),\"\")","v":""}]
["",{"$f":"IFERROR(IF(ROWS($B$2:B398)>'بينات التلاميد'!$Q$5,\"\",INDEX('بينات التلاميد'!$B$5:$B$56,SMALL(IF('بينات التلاميد'!$B$5:$B$56<>\"\",ROW('بينات التلاميد'!$B$5:$B$56)-ROW($B$5)+1),ROWS($B$2:B398)))),\"\")","v":""},{"$f":"IFERROR(VLOOKUP(B398,'بينات التلاميد'!$B$5:$G$56,6,0),\"\")","v":""}]
["",{"$f":"IFERROR(IF(ROWS($B$2:B399)>'بينات التلاميد'!$Q$5,\"\",INDEX('بينات التلاميد'!$B$5:$B$56,SMALL(IF('بينات التلاميد'!$B$5:$B$56<>\"\",ROW('بينات التلاميد'!$B$5:$B$56)-ROW($B$5)+1),ROWS($B$2:B399)))),\"\")","v":""},{"$f":"IFERROR(VLOOKUP(B399,'بينات التلاميد'!$B$5:$G$56,6,0),\"\")","v":""}]
["",{"$f":"IFERROR(IF(ROWS($B$2:B400)>'بينات التلاميد'!$Q$5,\"\",INDEX('بينات التلاميد'!$B$5:$B$56,SMALL(IF('بينات التلاميد'!$B$5:$B$56<>\"\",ROW('بينات التلاميد'!$B$5:$B$56)-ROW($B$5)+1),ROWS($B$2:B400)))),\"\")","v":""},{"$f":"IFERROR(VLOOKUP(B400,'بينات التلاميد'!$B$5:$G$56,6,0),\"\")","v":""}]
["",{"$f":"IFERROR(IF(ROWS($B$2:B401)>'بينات التلاميد'!$Q$5,\"\",INDEX('بينات التلاميد'!$B$5:$B$56,SMALL(IF('بينات التلاميد'!$B$5:$B$56<>\"\",ROW('بينات التلاميد'!$B$5:$B$56)-ROW($B$5)+1),ROWS($B$2:B401)))),\"\")","v":""},{"$f":"IFERROR(VLOOKUP(B401,'بينات التلاميد'!$B$5:$G$56,6,0),\"\")","v":""}]
["",{"$f":"IFERROR(IF(ROWS($B$2:B402)>'بينات التلاميد'!$Q$5,\"\",INDEX('بينات التلاميد'!$B$5:$B$56,SMALL(IF('بينات التلاميد'!$B$5:$B$56<>\"\",ROW('بينات التلاميد'!$B$5:$B$56)-ROW($B$5)+1),ROWS($B$2:B402)))),\"\")","v":""},{"$f":"IFERROR(VLOOKUP(B402,'بينات التلاميد'!$B$5:$G$56,6,0),\"\")","v":""}]
["",{"$f":"IFERROR(IF(ROWS($B$2:B403)>'بينات التلاميد'!$Q$5,\"\",INDEX('بينات التلاميد'!$B$5:$B$56,SMALL(IF('بينات التلاميد'!$B$5:$B$56<>\"\",ROW('بينات التلاميد'!$B$5:$B$56)-ROW($B$5)+1),ROWS($B$2:B403)))),\"\")","v":""},{"$f":"IFERROR(VLOOKUP(B403,'بينات التلاميد'!$B$5:$G$56,6,0),\"\")","v":""}]
["",{"$f":"IFERROR(IF(ROWS($B$2:B404)>'بينات التلاميد'!$Q$5,\"\",INDEX('بينات التلاميد'!$B$5:$B$56,SMALL(IF('بينات التلاميد'!$B$5:$B$56<>\"\",ROW('بينات التلاميد'!$B$5:$B$56)-ROW($B$5)+1),ROWS($B$2:B404)))),\"\")","v":""},{"$f":"IFERROR(VLOOKUP(B404,'بينات التلاميد'!$B$5:$G$56,6,0),\"\")","v":""}]
["",{"$f":"IFERROR(IF(ROWS($B$2:B405)>'بينات التلاميد'!$Q$5,\"\",INDEX('بينات التلاميد'!$B$5:$B$56,SMALL(IF('بينات التلاميد'!$B$5:$B$56<>\"\",ROW('بينات التلاميد'!$B$5:$B$56)-ROW($B$5)+1),ROWS($B$2:B405)))),\"\")","v":""},{"$f":"IFERROR(VLOOKUP(B405,'بينات التلاميد'!$B$5:$G$56,6,0),\"\")","v":""}]
["",{"$f":"IFERROR(IF(ROWS($B$2:B406)>'بينات التلاميد'!$Q$5,\"\",INDEX('بينات التلاميد'!$B$5:$B$56,SMALL(IF('بينات التلاميد'!$B$5:$B$56<>\"\",ROW('بينات التلاميد'!$B$5:$B$56)-ROW($B$5)+1),ROWS($B$2:B406)))),\"\")","v":""},{"$f":"IFERROR(VLOOKUP(B406,'بينات التلاميد'!$B$5:$G$56,6,0),\"\")","v":""}]
["",{"$f":"IFERROR(IF(ROWS($B$2:B407)>'بينات التلاميد'!$Q$5,\"\",INDEX('بينات التلاميد'!$B$5:$B$56,SMALL(IF('بينات التلاميد'!$B$5:$B$56<>\"\",ROW('بينات التلاميد'!$B$5:$B$56)-ROW($B$5)+1),ROWS($B$2:B407)))),\"\")","v":""},{"$f":"IFERROR(VLOOKUP(B407,'بينات التلاميد'!$B$5:$G$56,6,0),\"\")","v":""}]
["",{"$f":"IFERROR(IF(ROWS($B$2:B408)>'بينات التلاميد'!$Q$5,\"\",INDEX('بينات التلاميد'!$B$5:$B$56,SMALL(IF('بينات التلاميد'!$B$5:$B$56<>\"\",ROW('بينات التلاميد'!$B$5:$B$56)-ROW($B$5)+1),ROWS($B$2:B408)))),\"\")","v":""},{"$f":"IFERROR(VLOOKUP(B408,'بينات التلاميد'!$B$5:$G$56,6,0),\"\")","v":""}]
["",{"$f":"IFERROR(IF(ROWS($B$2:B409)>'بينات التلاميد'!$Q$5,\"\",INDEX('بينات التلاميد'!$B$5:$B$56,SMALL(IF('بينات التلاميد'!$B$5:$B$56<>\"\",ROW('بينات التلاميد'!$B$5:$B$56)-ROW($B$5)+1),ROWS($B$2:B409)))),\"\")","v":""},{"$f":"IFERROR(VLOOKUP(B409,'بينات التلاميد'!$B$5:$G$56,6,0),\"\")","v":""}]
["",{"$f":"IFERROR(IF(ROWS($B$2:B410)>'بينات التلاميد'!$Q$5,\"\",INDEX('بينات التلاميد'!$B$5:$B$56,SMALL(IF('بينات التلاميد'!$B$5:$B$56<>\"\",ROW('بينات التلاميد'!$B$5:$B$56)-ROW($B$5)+1),ROWS($B$2:B410)))),\"\")","v":""},{"$f":"IFERROR(VLOOKUP(B410,'بينات التلاميد'!$B$5:$G$56,6,0),\"\")","v":""}]
["",{"$f":"IFERROR(IF(ROWS($B$2:B411)>'بينات التلاميد'!$Q$5,\"\",INDEX('بينات التلاميد'!$B$5:$B$56,SMALL(IF('بينات التلاميد'!$B$5:$B$56<>\"\",ROW('بينات التلاميد'!$B$5:$B$56)-ROW($B$5)+1),ROWS($B$2:B411)))),\"\")","v":""},{"$f":"IFERROR(VLOOKUP(B411,'بينات التلاميد'!$B$5:$G$56,6,0),\"\")","v":""}]
["",{"$f":"IFERROR(IF(ROWS($B$2:B412)>'بينات التلاميد'!$Q$5,\"\",INDEX('بينات التلاميد'!$B$5:$B$56,SMALL(IF('بينات التلاميد'!$B$5:$B$56<>\"\",ROW('بينات التلاميد'!$B$5:$B$56)-ROW($B$5)+1),ROWS($B$2:B412)))),\"\")","v":""},{"$f":"IFERROR(VLOOKUP(B412,'بينات التلاميد'!$B$5:$G$56,6,0),\"\")","v":""}]
["",{"$f":"IFERROR(IF(ROWS($B$2:B413)>'بينات التلاميد'!$Q$5,\"\",INDEX('بينات التلاميد'!$B$5:$B$56,SMALL(IF('بينات التلاميد'!$B$5:$B$56<>\"\",ROW('بينات التلاميد'!$B$5:$B$56)-ROW($B$5)+1),ROWS($B$2:B413)))),\"\")","v":""},{"$f":"IFERROR(VLOOKUP(B413,'بينات التلاميد'!$B$5:$G$56,6,0),\"\")","v":""}]
["",{"$f":"IFERROR(IF(ROWS($B$2:B414)>'بينات التلاميد'!$Q$5,\"\",INDEX('بينات التلاميد'!$B$5:$B$56,SMALL(IF('بينات التلاميد'!$B$5:$B$56<>\"\",ROW('بينات التلاميد'!$B$5:$B$56)-ROW($B$5)+1),ROWS($B$2:B414)))),\"\")","v":""},{"$f":"IFERROR(VLOOKUP(B414,'بينات التلاميد'!$B$5:$G$56,6,0),\"\")","v":""}]
["",{"$f":"IFERROR(IF(ROWS($B$2:B415)>'بينات التلاميد'!$Q$5,\"\",INDEX('بينات التلاميد'!$B$5:$B$56,SMALL(IF('بينات التلاميد'!$B$5:$B$56<>\"\",ROW('بينات التلاميد'!$B$5:$B$56)-ROW($B$5)+1),ROWS($B$2:B415)))),\"\")","v":""},{"$f":"IFERROR(VLOOKUP(B415,'بينات التلاميد'!$B$5:$G$56,6,0),\"\")","v":""}]
["",{"$f":"IFERROR(IF(ROWS($B$2:B416)>'بينات التلاميد'!$Q$5,\"\",INDEX('بينات التلاميد'!$B$5:$B$56,SMALL(IF('بينات التلاميد'!$B$5:$B$56<>\"\",ROW('بينات التلاميد'!$B$5:$B$56)-ROW($B$5)+1),ROWS($B$2:B416)))),\"\")","v":""},{"$f":"IFERROR(VLOOKUP(B416,'بينات التلاميد'!$B$5:$G$56,6,0),\"\")","v":""}]
["",{"$f":"IFERROR(IF(ROWS($B$2:B417)>'بينات التلاميد'!$Q$5,\"\",INDEX('بينات التلاميد'!$B$5:$B$56,SMALL(IF('بينات التلاميد'!$B$5:$B$56<>\"\",ROW('بينات التلاميد'!$B$5:$B$56)-ROW($B$5)+1),ROWS($B$2:B417)))),\"\")","v":""},{"$f":"IFERROR(VLOOKUP(B417,'بينات التلاميد'!$B$5:$G$56,6,0),\"\")","v":""}]
["",{"$f":"IFERROR(IF(ROWS($B$2:B418)>'بينات التلاميد'!$Q$5,\"\",INDEX('بينات التلاميد'!$B$5:$B$56,SMALL(IF('بينات التلاميد'!$B$5:$B$56<>\"\",ROW('بينات التلاميد'!$B$5:$B$56)-ROW($B$5)+1),ROWS($B$2:B418)))),\"\")","v":""},{"$f":"IFERROR(VLOOKUP(B418,'بينات التلاميد'!$B$5:$G$56,6,0),\"\")","v":""}]
["",{"$f":"IFERROR(IF(ROWS($B$2:B419)>'بينات التلاميد'!$Q$5,\"\",INDEX('بينات التلاميد'!$B$5:$B$56,SMALL(IF('بينات التلاميد'!$B$5:$B$56<>\"\",ROW('بينات التلاميد'!$B$5:$B$56)-ROW($B$5)+1),ROWS($B$2:B419)))),\"\")","v":""},{"$f":"IFERROR(VLOOKUP(B419,'بينات التلاميد'!$B$5:$G$56,6,0),\"\")","v":""}]
["",{"$f":"IFERROR(IF(ROWS($B$2:B420)>'بينات التلاميد'!$Q$5,\"\",INDEX('بينات التلاميد'!$B$5:$B$56,SMALL(IF('بينات التلاميد'!$B$5:$B$56<>\"\",ROW('بينات التلاميد'!$B$5:$B$56)-ROW($B$5)+1),ROWS($B$2:B420)))),\"\")","v":""},{"$f":"IFERROR(VLOOKUP(B420,'بينات التلاميد'!$B$5:$G$56,6,0),\"\")","v":""}]
["",{"$f":"IFERROR(IF(ROWS($B$2:B421)>'بينات التلاميد'!$Q$5,\"\",INDEX('بينات التلاميد'!$B$5:$B$56,SMALL(IF('بينات التلاميد'!$B$5:$B$56<>\"\",ROW('بينات التلاميد'!$B$5:$B$56)-ROW($B$5)+1),ROWS($B$2:B421)))),\"\")","v":""},{"$f":"IFERROR(VLOOKUP(B421,'بينات التلاميد'!$B$5:$G$56,6,0),\"\")","v":""}]
["",{"$f":"IFERROR(IF(ROWS($B$2:B422)>'بينات التلاميد'!$Q$5,\"\",INDEX('بينات التلاميد'!$B$5:$B$56,SMALL(IF('بينات التلاميد'!$B$5:$B$56<>\"\",ROW('بينات التلاميد'!$B$5:$B$56)-ROW($B$5)+1),ROWS($B$2:B422)))),\"\")","v":""},{"$f":"IFERROR(VLOOKUP(B422,'بينات التلاميد'!$B$5:$G$56,6,0),\"\")","v":""}]
["",{"$f":"IFERROR(IF(ROWS($B$2:B423)>'بينات التلاميد'!$Q$5,\"\",INDEX('بينات التلاميد'!$B$5:$B$56,SMALL(IF('بينات التلاميد'!$B$5:$B$56<>\"\",ROW('بينات التلاميد'!$B$5:$B$56)-ROW($B$5)+1),ROWS($B$2:B423)))),\"\")","v":""},{"$f":"IFERROR(VLOOKUP(B423,'بينات التلاميد'!$B$5:$G$56,6,0),\"\")","v":""}]
["",{"$f":"IFERROR(IF(ROWS($B$2:B424)>'بينات التلاميد'!$Q$5,\"\",INDEX('بينات التلاميد'!$B$5:$B$56,SMALL(IF('بينات التلاميد'!$B$5:$B$56<>\"\",ROW('بينات التلاميد'!$B$5:$B$56)-ROW($B$5)+1),ROWS($B$2:B424)))),\"\")","v":""},{"$f":"IFERROR(VLOOKUP(B424,'بينات التلاميد'!$B$5:$G$56,6,0),\"\")","v":""}]
["",{"$f":"IFERROR(IF(ROWS($B$2:B425)>'بينات التلاميد'!$Q$5,\"\",INDEX('بينات التلاميد'!$B$5:$B$56,SMALL(IF('بينات التلاميد'!$B$5:$B$56<>\"\",ROW('بينات التلاميد'!$B$5:$B$56)-ROW($B$5)+1),ROWS($B$2:B425)))),\"\")","v":""},{"$f":"IFERROR(VLOOKUP(B425,'بينات التلاميد'!$B$5:$G$56,6,0),\"\")","v":""}]
["",{"$f":"IFERROR(IF(ROWS($B$2:B426)>'بينات التلاميد'!$Q$5,\"\",INDEX('بينات التلاميد'!$B$5:$B$56,SMALL(IF('بينات التلاميد'!$B$5:$B$56<>\"\",ROW('بينات التلاميد'!$B$5:$B$56)-ROW($B$5)+1),ROWS($B$2:B426)))),\"\")","v":""},{"$f":"IFERROR(VLOOKUP(B426,'بينات التلاميد'!$B$5:$G$56,6,0),\"\")","v":""}]
["",{"$f":"IFERROR(IF(ROWS($B$2:B427)>'بينات التلاميد'!$Q$5,\"\",INDEX('بينات التلاميد'!$B$5:$B$56,SMALL(IF('بينات التلاميد'!$B$5:$B$56<>\"\",ROW('بينات التلاميد'!$B$5:$B$56)-ROW($B$5)+1),ROWS($B$2:B427)))),\"\")","v":""},{"$f":"IFERROR(VLOOKUP(B427,'بينات التلاميد'!$B$5:$G$56,6,0),\"\")","v":""}]
["",{"$f":"IFERROR(IF(ROWS($B$2:B428)>'بينات التلاميد'!$Q$5,\"\",INDEX('بينات التلاميد'!$B$5:$B$56,SMALL(IF('بينات التلاميد'!$B$5:$B$56<>\"\",ROW('بينات التلاميد'!$B$5:$B$56)-ROW($B$5)+1),ROWS($B$2:B428)))),\"\")","v":""},{"$f":"IFERROR(VLOOKUP(B428,'بينات التلاميد'!$B$5:$G$56,6,0),\"\")","v":""}]
["",{"$f":"IFERROR(IF(ROWS($B$2:B429)>'بينات التلاميد'!$Q$5,\"\",INDEX('بينات التلاميد'!$B$5:$B$56,SMALL(IF('بينات التلاميد'!$B$5:$B$56<>\"\",ROW('بينات التلاميد'!$B$5:$B$56)-ROW($B$5)+1),ROWS($B$2:B429)))),\"\")","v":""},{"$f":"IFERROR(VLOOKUP(B429,'بينات التلاميد'!$B$5:$G$56,6,0),\"\")","v":""}]
["",{"$f":"IFERROR(IF(ROWS($B$2:B430)>'بينات التلاميد'!$Q$5,\"\",INDEX('بينات التلاميد'!$B$5:$B$56,SMALL(IF('بينات التلاميد'!$B$5:$B$56<>\"\",ROW('بينات التلاميد'!$B$5:$B$56)-ROW($B$5)+1),ROWS($B$2:B430)))),\"\")","v":""},{"$f":"IFERROR(VLOOKUP(B430,'بينات التلاميد'!$B$5:$G$56,6,0),\"\")","v":""}]
["",{"$f":"IFERROR(IF(ROWS($B$2:B431)>'بينات التلاميد'!$Q$5,\"\",INDEX('بينات التلاميد'!$B$5:$B$56,SMALL(IF('بينات التلاميد'!$B$5:$B$56<>\"\",ROW('بينات التلاميد'!$B$5:$B$56)-ROW($B$5)+1),ROWS($B$2:B431)))),\"\")","v":""},{"$f":"IFERROR(VLOOKUP(B431,'بينات التلاميد'!$B$5:$G$56,6,0),\"\")","v":""}]
["",{"$f":"IFERROR(IF(ROWS($B$2:B432)>'بينات التلاميد'!$Q$5,\"\",INDEX('بينات التلاميد'!$B$5:$B$56,SMALL(IF('بينات التلاميد'!$B$5:$B$56<>\"\",ROW('بينات التلاميد'!$B$5:$B$56)-ROW($B$5)+1),ROWS($B$2:B432)))),\"\")","v":""},{"$f":"IFERROR(VLOOKUP(B432,'بينات التلاميد'!$B$5:$G$56,6,0),\"\")","v":""}]
["",{"$f":"IFERROR(IF(ROWS($B$2:B433)>'بينات التلاميد'!$Q$5,\"\",INDEX('بينات التلاميد'!$B$5:$B$56,SMALL(IF('بينات التلاميد'!$B$5:$B$56<>\"\",ROW('بينات التلاميد'!$B$5:$B$56)-ROW($B$5)+1),ROWS($B$2:B433)))),\"\")","v":""},{"$f":"IFERROR(VLOOKUP(B433,'بينات التلاميد'!$B$5:$G$56,6,0),\"\")","v":""}]
["",{"$f":"IFERROR(IF(ROWS($B$2:B434)>'بينات التلاميد'!$Q$5,\"\",INDEX('بينات التلاميد'!$B$5:$B$56,SMALL(IF('بينات التلاميد'!$B$5:$B$56<>\"\",ROW('بينات التلاميد'!$B$5:$B$56)-ROW($B$5)+1),ROWS($B$2:B434)))),\"\")","v":""},{"$f":"IFERROR(VLOOKUP(B434,'بينات التلاميد'!$B$5:$G$56,6,0),\"\")","v":""}]
["",{"$f":"IFERROR(IF(ROWS($B$2:B435)>'بينات التلاميد'!$Q$5,\"\",INDEX('بينات التلاميد'!$B$5:$B$56,SMALL(IF('بينات التلاميد'!$B$5:$B$56<>\"\",ROW('بينات التلاميد'!$B$5:$B$56)-ROW($B$5)+1),ROWS($B$2:B435)))),\"\")","v":""},{"$f":"IFERROR(VLOOKUP(B435,'بينات التلاميد'!$B$5:$G$56,6,0),\"\")","v":""}]
["",{"$f":"IFERROR(IF(ROWS($B$2:B436)>'بينات التلاميد'!$Q$5,\"\",INDEX('بينات التلاميد'!$B$5:$B$56,SMALL(IF('بينات التلاميد'!$B$5:$B$56<>\"\",ROW('بينات التلاميد'!$B$5:$B$56)-ROW($B$5)+1),ROWS($B$2:B436)))),\"\")","v":""},{"$f":"IFERROR(VLOOKUP(B436,'بينات التلاميد'!$B$5:$G$56,6,0),\"\")","v":""}]
["",{"$f":"IFERROR(IF(ROWS($B$2:B437)>'بينات التلاميد'!$Q$5,\"\",INDEX('بينات التلاميد'!$B$5:$B$56,SMALL(IF('بينات التلاميد'!$B$5:$B$56<>\"\",ROW('بينات التلاميد'!$B$5:$B$56)-ROW($B$5)+1),ROWS($B$2:B437)))),\"\")","v":""},{"$f":"IFERROR(VLOOKUP(B437,'بينات التلاميد'!$B$5:$G$56,6,0),\"\")","v":""}]
["",{"$f":"IFERROR(IF(ROWS($B$2:B438)>'بينات التلاميد'!$Q$5,\"\",INDEX('بينات التلاميد'!$B$5:$B$56,SMALL(IF('بينات التلاميد'!$B$5:$B$56<>\"\",ROW('بينات التلاميد'!$B$5:$B$56)-ROW($B$5)+1),ROWS($B$2:B438)))),\"\")","v":""},{"$f":"IFERROR(VLOOKUP(B438,'بينات التلاميد'!$B$5:$G$56,6,0),\"\")","v":""}]
["",{"$f":"IFERROR(IF(ROWS($B$2:B439)>'بينات التلاميد'!$Q$5,\"\",INDEX('بينات التلاميد'!$B$5:$B$56,SMALL(IF('بينات التلاميد'!$B$5:$B$56<>\"\",ROW('بينات التلاميد'!$B$5:$B$56)-ROW($B$5)+1),ROWS($B$2:B439)))),\"\")","v":""},{"$f":"IFERROR(VLOOKUP(B439,'بينات التلاميد'!$B$5:$G$56,6,0),\"\")","v":""}]
["",{"$f":"IFERROR(IF(ROWS($B$2:B440)>'بينات التلاميد'!$Q$5,\"\",INDEX('بينات التلاميد'!$B$5:$B$56,SMALL(IF('بينات التلاميد'!$B$5:$B$56<>\"\",ROW('بينات التلاميد'!$B$5:$B$56)-ROW($B$5)+1),ROWS($B$2:B440)))),\"\")","v":""},{"$f":"IFERROR(VLOOKUP(B440,'بينات التلاميد'!$B$5:$G$56,6,0),\"\")","v":""}]
["",{"$f":"IFERROR(IF(ROWS($B$2:B441)>'بينات التلاميد'!$Q$5,\"\",INDEX('بينات التلاميد'!$B$5:$B$56,SMALL(IF('بينات التلاميد'!$B$5:$B$56<>\"\",ROW('بينات التلاميد'!$B$5:$B$56)-ROW($B$5)+1),ROWS($B$2:B441)))),\"\")","v":""},{"$f":"IFERROR(VLOOKUP(B441,'بينات التلاميد'!$B$5:$G$56,6,0),\"\")","v":""}]
["",{"$f":"IFERROR(IF(ROWS($B$2:B442)>'بينات التلاميد'!$Q$5,\"\",INDEX('بينات التلاميد'!$B$5:$B$56,SMALL(IF('بينات التلاميد'!$B$5:$B$56<>\"\",ROW('بينات التلاميد'!$B$5:$B$56)-ROW($B$5)+1),ROWS($B$2:B442)))),\"\")","v":""},{"$f":"IFERROR(VLOOKUP(B442,'بينات التلاميد'!$B$5:$G$56,6,0),\"\")","v":""}]
["",{"$f":"IFERROR(IF(ROWS($B$2:B443)>'بينات التلاميد'!$Q$5,\"\",INDEX('بينات التلاميد'!$B$5:$B$56,SMALL(IF('بينات التلاميد'!$B$5:$B$56<>\"\",ROW('بينات التلاميد'!$B$5:$B$56)-ROW($B$5)+1),ROWS($B$2:B443)))),\"\")","v":""},{"$f":"IFERROR(VLOOKUP(B443,'بينات التلاميد'!$B$5:$G$56,6,0),\"\")","v":""}]
["",{"$f":"IFERROR(IF(ROWS($B$2:B444)>'بينات التلاميد'!$Q$5,\"\",INDEX('بينات التلاميد'!$B$5:$B$56,SMALL(IF('بينات التلاميد'!$B$5:$B$56<>\"\",ROW('بينات التلاميد'!$B$5:$B$56)-ROW($B$5)+1),ROWS($B$2:B444)))),\"\")","v":""},{"$f":"IFERROR(VLOOKUP(B444,'بينات التلاميد'!$B$5:$G$56,6,0),\"\")","v":""}]
["",{"$f":"IFERROR(IF(ROWS($B$2:B445)>'بينات التلاميد'!$Q$5,\"\",INDEX('بينات التلاميد'!$B$5:$B$56,SMALL(IF('بينات التلاميد'!$B$5:$B$56<>\"\",ROW('بينات التلاميد'!$B$5:$B$56)-ROW($B$5)+1),ROWS($B$2:B445)))),\"\")","v":""},{"$f":"IFERROR(VLOOKUP(B445,'بينات التلاميد'!$B$5:$G$56,6,0),\"\")","v":""}]
["",{"$f":"IFERROR(IF(ROWS($B$2:B446)>'بينات التلاميد'!$Q$5,\"\",INDEX('بينات التلاميد'!$B$5:$B$56,SMALL(IF('بينات التلاميد'!$B$5:$B$56<>\"\",ROW('بينات التلاميد'!$B$5:$B$56)-ROW($B$5)+1),ROWS($B$2:B446)))),\"\")","v":""},{"$f":"IFERROR(VLOOKUP(B446,'بينات التلاميد'!$B$5:$G$56,6,0),\"\")","v":""}]
["",{"$f":"IFERROR(IF(ROWS($B$2:B447)>'بينات التلاميد'!$Q$5,\"\",INDEX('بينات التلاميد'!$B$5:$B$56,SMALL(IF('بينات التلاميد'!$B$5:$B$56<>\"\",ROW('بينات التلاميد'!$B$5:$B$56)-ROW($B$5)+1),ROWS($B$2:B447)))),\"\")","v":""},{"$f":"IFERROR(VLOOKUP(B447,'بينات التلاميد'!$B$5:$G$56,6,0),\"\")","v":""}]
["",{"$f":"IFERROR(IF(ROWS($B$2:B448)>'بينات التلاميد'!$Q$5,\"\",INDEX('بينات التلاميد'!$B$5:$B$56,SMALL(IF('بينات التلاميد'!$B$5:$B$56<>\"\",ROW('بينات التلاميد'!$B$5:$B$56)-ROW($B$5)+1),ROWS($B$2:B448)))),\"\")","v":""},{"$f":"IFERROR(VLOOKUP(B448,'بينات التلاميد'!$B$5:$G$56,6,0),\"\")","v":""}]
["",{"$f":"IFERROR(IF(ROWS($B$2:B449)>'بينات التلاميد'!$Q$5,\"\",INDEX('بينات التلاميد'!$B$5:$B$56,SMALL(IF('بينات التلاميد'!$B$5:$B$56<>\"\",ROW('بينات التلاميد'!$B$5:$B$56)-ROW($B$5)+1),ROWS($B$2:B449)))),\"\")","v":""},{"$f":"IFERROR(VLOOKUP(B449,'بينات التلاميد'!$B$5:$G$56,6,0),\"\")","v":""}]
[{"$f":"IFERROR(VLOOKUP(C450,$D$2:$E$20,2,0),\"\")","v":""},{"$f":"IFERROR(IF(ROWS($B$2:B450)>'بينات التلاميد'!$Q$5,\"\",INDEX('بينات التلاميد'!$B$5:$B$56,SMALL(IF('بينات التلاميد'!$B$5:$B$56<>\"\",ROW('بينات التلاميد'!$B$5:$B$56)-ROW($B$5)+1),ROWS($B$2:B450)))),\"\")","v":""},{"$f":"IFERROR(VLOOKUP(B450,'بينات التلاميد'!$B$5:$G$56,6,0),\"\")","v":""}]
["",{"$f":"IFERROR(IF(ROWS($B$2:B451)>'بينات التلاميد'!$Q$5,\"\",INDEX('بينات التلاميد'!$B$5:$B$56,SMALL(IF('بينات التلاميد'!$B$5:$B$56<>\"\",ROW('بينات التلاميد'!$B$5:$B$56)-ROW($B$5)+1),ROWS($B$2:B451)))),\"\")","v":""},{"$f":"IFERROR(VLOOKUP(B451,'بينات التلاميد'!$B$5:$G$56,6,0),\"\")","v":""}]
["",{"$f":"IFERROR(IF(ROWS($B$2:B452)>'بينات التلاميد'!$Q$5,\"\",INDEX('بينات التلاميد'!$B$5:$B$56,SMALL(IF('بينات التلاميد'!$B$5:$B$56<>\"\",ROW('بينات التلاميد'!$B$5:$B$56)-ROW($B$5)+1),ROWS($B$2:B452)))),\"\")","v":""},{"$f":"IFERROR(VLOOKUP(B452,'بينات التلاميد'!$B$5:$G$56,6,0),\"\")","v":""}]
["",{"$f":"IFERROR(IF(ROWS($B$2:B453)>'بينات التلاميد'!$Q$5,\"\",INDEX('بينات التلاميد'!$B$5:$B$56,SMALL(IF('بينات التلاميد'!$B$5:$B$56<>\"\",ROW('بينات التلاميد'!$B$5:$B$56)-ROW($B$5)+1),ROWS($B$2:B453)))),\"\")","v":""},{"$f":"IFERROR(VLOOKUP(B453,'بينات التلاميد'!$B$5:$G$56,6,0),\"\")","v":""}]
["",{"$f":"IFERROR(IF(ROWS($B$2:B454)>'بينات التلاميد'!$Q$5,\"\",INDEX('بينات التلاميد'!$B$5:$B$56,SMALL(IF('بينات التلاميد'!$B$5:$B$56<>\"\",ROW('بينات التلاميد'!$B$5:$B$56)-ROW($B$5)+1),ROWS($B$2:B454)))),\"\")","v":""},{"$f":"IFERROR(VLOOKUP(B454,'بينات التلاميد'!$B$5:$G$56,6,0),\"\")","v":""}]
["",{"$f":"IFERROR(IF(ROWS($B$2:B455)>'بينات التلاميد'!$Q$5,\"\",INDEX('بينات التلاميد'!$B$5:$B$56,SMALL(IF('بينات التلاميد'!$B$5:$B$56<>\"\",ROW('بينات التلاميد'!$B$5:$B$56)-ROW($B$5)+1),ROWS($B$2:B455)))),\"\")","v":""},{"$f":"IFERROR(VLOOKUP(B455,'بينات التلاميد'!$B$5:$G$56,6,0),\"\")","v":""}]
["",{"$f":"IFERROR(IF(ROWS($B$2:B456)>'بينات التلاميد'!$Q$5,\"\",INDEX('بينات التلاميد'!$B$5:$B$56,SMALL(IF('بينات التلاميد'!$B$5:$B$56<>\"\",ROW('بينات التلاميد'!$B$5:$B$56)-ROW($B$5)+1),ROWS($B$2:B456)))),\"\")","v":""},{"$f":"IFERROR(VLOOKUP(B456,'بينات التلاميد'!$B$5:$G$56,6,0),\"\")","v":""}]
["",{"$f":"IFERROR(IF(ROWS($B$2:B457)>'بينات التلاميد'!$Q$5,\"\",INDEX('بينات التلاميد'!$B$5:$B$56,SMALL(IF('بينات التلاميد'!$B$5:$B$56<>\"\",ROW('بينات التلاميد'!$B$5:$B$56)-ROW($B$5)+1),ROWS($B$2:B457)))),\"\")","v":""},{"$f":"IFERROR(VLOOKUP(B457,'بينات التلاميد'!$B$5:$G$56,6,0),\"\")","v":""}]
["",{"$f":"IFERROR(IF(ROWS($B$2:B458)>'بينات التلاميد'!$Q$5,\"\",INDEX('بينات التلاميد'!$B$5:$B$56,SMALL(IF('بينات التلاميد'!$B$5:$B$56<>\"\",ROW('بينات التلاميد'!$B$5:$B$56)-ROW($B$5)+1),ROWS($B$2:B458)))),\"\")","v":""},{"$f":"IFERROR(VLOOKUP(B458,'بينات التلاميد'!$B$5:$G$56,6,0),\"\")","v":""}]
["",{"$f":"IFERROR(IF(ROWS($B$2:B459)>'بينات التلاميد'!$Q$5,\"\",INDEX('بينات التلاميد'!$B$5:$B$56,SMALL(IF('بينات التلاميد'!$B$5:$B$56<>\"\",ROW('بينات التلاميد'!$B$5:$B$56)-ROW($B$5)+1),ROWS($B$2:B459)))),\"\")","v":""},{"$f":"IFERROR(VLOOKUP(B459,'بينات التلاميد'!$B$5:$G$56,6,0),\"\")","v":""}]
["",{"$f":"IFERROR(IF(ROWS($B$2:B460)>'بينات التلاميد'!$Q$5,\"\",INDEX('بينات التلاميد'!$B$5:$B$56,SMALL(IF('بينات التلاميد'!$B$5:$B$56<>\"\",ROW('بينات التلاميد'!$B$5:$B$56)-ROW($B$5)+1),ROWS($B$2:B460)))),\"\")","v":""},{"$f":"IFERROR(VLOOKUP(B460,'بينات التلاميد'!$B$5:$G$56,6,0),\"\")","v":""}]
["",{"$f":"IFERROR(IF(ROWS($B$2:B461)>'بينات التلاميد'!$Q$5,\"\",INDEX('بينات التلاميد'!$B$5:$B$56,SMALL(IF('بينات التلاميد'!$B$5:$B$56<>\"\",ROW('بينات التلاميد'!$B$5:$B$56)-ROW($B$5)+1),ROWS($B$2:B461)))),\"\")","v":""},{"$f":"IFERROR(VLOOKUP(B461,'بينات التلاميد'!$B$5:$G$56,6,0),\"\")","v":""}]
["",{"$f":"IFERROR(IF(ROWS($B$2:B462)>'بينات التلاميد'!$Q$5,\"\",INDEX('بينات التلاميد'!$B$5:$B$56,SMALL(IF('بينات التلاميد'!$B$5:$B$56<>\"\",ROW('بينات التلاميد'!$B$5:$B$56)-ROW($B$5)+1),ROWS($B$2:B462)))),\"\")","v":""},{"$f":"IFERROR(VLOOKUP(B462,'بينات التلاميد'!$B$5:$G$56,6,0),\"\")","v":""}]
["",{"$f":"IFERROR(IF(ROWS($B$2:B463)>'بينات التلاميد'!$Q$5,\"\",INDEX('بينات التلاميد'!$B$5:$B$56,SMALL(IF('بينات التلاميد'!$B$5:$B$56<>\"\",ROW('بينات التلاميد'!$B$5:$B$56)-ROW($B$5)+1),ROWS($B$2:B463)))),\"\")","v":""},{"$f":"IFERROR(VLOOKUP(B463,'بينات التلاميد'!$B$5:$G$56,6,0),\"\")","v":""}]
["",{"$f":"IFERROR(IF(ROWS($B$2:B464)>'بينات التلاميد'!$Q$5,\"\",INDEX('بينات التلاميد'!$B$5:$B$56,SMALL(IF('بينات التلاميد'!$B$5:$B$56<>\"\",ROW('بينات التلاميد'!$B$5:$B$56)-ROW($B$5)+1),ROWS($B$2:B464)))),\"\")","v":""},{"$f":"IFERROR(VLOOKUP(B464,'بينات التلاميد'!$B$5:$G$56,6,0),\"\")","v":""}]
["",{"$f":"IFERROR(IF(ROWS($B$2:B465)>'بينات التلاميد'!$Q$5,\"\",INDEX('بينات التلاميد'!$B$5:$B$56,SMALL(IF('بينات التلاميد'!$B$5:$B$56<>\"\",ROW('بينات التلاميد'!$B$5:$B$56)-ROW($B$5)+1),ROWS($B$2:B465)))),\"\")","v":""},{"$f":"IFERROR(VLOOKUP(B465,'بينات التلاميد'!$B$5:$G$56,6,0),\"\")","v":""}]
["",{"$f":"IFERROR(IF(ROWS($B$2:B466)>'بينات التلاميد'!$Q$5,\"\",INDEX('بينات التلاميد'!$B$5:$B$56,SMALL(IF('بينات التلاميد'!$B$5:$B$56<>\"\",ROW('بينات التلاميد'!$B$5:$B$56)-ROW($B$5)+1),ROWS($B$2:B466)))),\"\")","v":""},{"$f":"IFERROR(VLOOKUP(B466,'بينات التلاميد'!$B$5:$G$56,6,0),\"\")","v":""}]
["",{"$f":"IFERROR(IF(ROWS($B$2:B467)>'بينات التلاميد'!$Q$5,\"\",INDEX('بينات التلاميد'!$B$5:$B$56,SMALL(IF('بينات التلاميد'!$B$5:$B$56<>\"\",ROW('بينات التلاميد'!$B$5:$B$56)-ROW($B$5)+1),ROWS($B$2:B467)))),\"\")","v":""},{"$f":"IFERROR(VLOOKUP(B467,'بينات التلاميد'!$B$5:$G$56,6,0),\"\")","v":""}]
["",{"$f":"IFERROR(IF(ROWS($B$2:B468)>'بينات التلاميد'!$Q$5,\"\",INDEX('بينات التلاميد'!$B$5:$B$56,SMALL(IF('بينات التلاميد'!$B$5:$B$56<>\"\",ROW('بينات التلاميد'!$B$5:$B$56)-ROW($B$5)+1),ROWS($B$2:B468)))),\"\")","v":""},{"$f":"IFERROR(VLOOKUP(B468,'بينات التلاميد'!$B$5:$G$56,6,0),\"\")","v":""}]
["",{"$f":"IFERROR(IF(ROWS($B$2:B469)>'بينات التلاميد'!$Q$5,\"\",INDEX('بينات التلاميد'!$B$5:$B$56,SMALL(IF('بينات التلاميد'!$B$5:$B$56<>\"\",ROW('بينات التلاميد'!$B$5:$B$56)-ROW($B$5)+1),ROWS($B$2:B469)))),\"\")","v":""},{"$f":"IFERROR(VLOOKUP(B469,'بينات التلاميد'!$B$5:$G$56,6,0),\"\")","v":""}]
["",{"$f":"IFERROR(IF(ROWS($B$2:B470)>'بينات التلاميد'!$Q$5,\"\",INDEX('بينات التلاميد'!$B$5:$B$56,SMALL(IF('بينات التلاميد'!$B$5:$B$56<>\"\",ROW('بينات التلاميد'!$B$5:$B$56)-ROW($B$5)+1),ROWS($B$2:B470)))),\"\")","v":""},{"$f":"IFERROR(VLOOKUP(B470,'بينات التلاميد'!$B$5:$G$56,6,0),\"\")","v":""}]
["",{"$f":"IFERROR(IF(ROWS($B$2:B471)>'بينات التلاميد'!$Q$5,\"\",INDEX('بينات التلاميد'!$B$5:$B$56,SMALL(IF('بينات التلاميد'!$B$5:$B$56<>\"\",ROW('بينات التلاميد'!$B$5:$B$56)-ROW($B$5)+1),ROWS($B$2:B471)))),\"\")","v":""},{"$f":"IFERROR(VLOOKUP(B471,'بينات التلاميد'!$B$5:$G$56,6,0),\"\")","v":""}]
["",{"$f":"IFERROR(IF(ROWS($B$2:B472)>'بينات التلاميد'!$Q$5,\"\",INDEX('بينات التلاميد'!$B$5:$B$56,SMALL(IF('بينات التلاميد'!$B$5:$B$56<>\"\",ROW('بينات التلاميد'!$B$5:$B$56)-ROW($B$5)+1),ROWS($B$2:B472)))),\"\")","v":""},{"$f":"IFERROR(VLOOKUP(B472,'بينات التلاميد'!$B$5:$G$56,6,0),\"\")","v":""}]
["",{"$f":"IFERROR(IF(ROWS($B$2:B473)>'بينات التلاميد'!$Q$5,\"\",INDEX('بينات التلاميد'!$B$5:$B$56,SMALL(IF('بينات التلاميد'!$B$5:$B$56<>\"\",ROW('بينات التلاميد'!$B$5:$B$56)-ROW($B$5)+1),ROWS($B$2:B473)))),\"\")","v":""},{"$f":"IFERROR(VLOOKUP(B473,'بينات التلاميد'!$B$5:$G$56,6,0),\"\")","v":""}]
["",{"$f":"IFERROR(IF(ROWS($B$2:B474)>'بينات التلاميد'!$Q$5,\"\",INDEX('بينات التلاميد'!$B$5:$B$56,SMALL(IF('بينات التلاميد'!$B$5:$B$56<>\"\",ROW('بينات التلاميد'!$B$5:$B$56)-ROW($B$5)+1),ROWS($B$2:B474)))),\"\")","v":""},{"$f":"IFERROR(VLOOKUP(B474,'بينات التلاميد'!$B$5:$G$56,6,0),\"\")","v":""}]
["",{"$f":"IFERROR(IF(ROWS($B$2:B475)>'بينات التلاميد'!$Q$5,\"\",INDEX('بينات التلاميد'!$B$5:$B$56,SMALL(IF('بينات التلاميد'!$B$5:$B$56<>\"\",ROW('بينات التلاميد'!$B$5:$B$56)-ROW($B$5)+1),ROWS($B$2:B475)))),\"\")","v":""},{"$f":"IFERROR(VLOOKUP(B475,'بينات التلاميد'!$B$5:$G$56,6,0),\"\")","v":""}]
["",{"$f":"IFERROR(IF(ROWS($B$2:B476)>'بينات التلاميد'!$Q$5,\"\",INDEX('بينات التلاميد'!$B$5:$B$56,SMALL(IF('بينات التلاميد'!$B$5:$B$56<>\"\",ROW('بينات التلاميد'!$B$5:$B$56)-ROW($B$5)+1),ROWS($B$2:B476)))),\"\")","v":""},{"$f":"IFERROR(VLOOKUP(B476,'بينات التلاميد'!$B$5:$G$56,6,0),\"\")","v":""}]
["",{"$f":"IFERROR(IF(ROWS($B$2:B477)>'بينات التلاميد'!$Q$5,\"\",INDEX('بينات التلاميد'!$B$5:$B$56,SMALL(IF('بينات التلاميد'!$B$5:$B$56<>\"\",ROW('بينات التلاميد'!$B$5:$B$56)-ROW($B$5)+1),ROWS($B$2:B477)))),\"\")","v":""},{"$f":"IFERROR(VLOOKUP(B477,'بينات التلاميد'!$B$5:$G$56,6,0),\"\")","v":""}]
["",{"$f":"IFERROR(IF(ROWS($B$2:B478)>'بينات التلاميد'!$Q$5,\"\",INDEX('بينات التلاميد'!$B$5:$B$56,SMALL(IF('بينات التلاميد'!$B$5:$B$56<>\"\",ROW('بينات التلاميد'!$B$5:$B$56)-ROW($B$5)+1),ROWS($B$2:B478)))),\"\")","v":""},{"$f":"IFERROR(VLOOKUP(B478,'بينات التلاميد'!$B$5:$G$56,6,0),\"\")","v":""}]
["",{"$f":"IFERROR(IF(ROWS($B$2:B479)>'بينات التلاميد'!$Q$5,\"\",INDEX('بينات التلاميد'!$B$5:$B$56,SMALL(IF('بينات التلاميد'!$B$5:$B$56<>\"\",ROW('بينات التلاميد'!$B$5:$B$56)-ROW($B$5)+1),ROWS($B$2:B479)))),\"\")","v":""},{"$f":"IFERROR(VLOOKUP(B479,'بينات التلاميد'!$B$5:$G$56,6,0),\"\")","v":""}]
["",{"$f":"IFERROR(IF(ROWS($B$2:B480)>'بينات التلاميد'!$Q$5,\"\",INDEX('بينات التلاميد'!$B$5:$B$56,SMALL(IF('بينات التلاميد'!$B$5:$B$56<>\"\",ROW('بينات التلاميد'!$B$5:$B$56)-ROW($B$5)+1),ROWS($B$2:B480)))),\"\")","v":""},{"$f":"IFERROR(VLOOKUP(B480,'بينات التلاميد'!$B$5:$G$56,6,0),\"\")","v":""}]
["",{"$f":"IFERROR(IF(ROWS($B$2:B481)>'بينات التلاميد'!$Q$5,\"\",INDEX('بينات التلاميد'!$B$5:$B$56,SMALL(IF('بينات التلاميد'!$B$5:$B$56<>\"\",ROW('بينات التلاميد'!$B$5:$B$56)-ROW($B$5)+1),ROWS($B$2:B481)))),\"\")","v":""},{"$f":"IFERROR(VLOOKUP(B481,'بينات التلاميد'!$B$5:$G$56,6,0),\"\")","v":""}]
["",{"$f":"IFERROR(IF(ROWS($B$2:B482)>'بينات التلاميد'!$Q$5,\"\",INDEX('بينات التلاميد'!$B$5:$B$56,SMALL(IF('بينات التلاميد'!$B$5:$B$56<>\"\",ROW('بينات التلاميد'!$B$5:$B$56)-ROW($B$5)+1),ROWS($B$2:B482)))),\"\")","v":""},{"$f":"IFERROR(VLOOKUP(B482,'بينات التلاميد'!$B$5:$G$56,6,0),\"\")","v":""}]
["",{"$f":"IFERROR(IF(ROWS($B$2:B483)>'بينات التلاميد'!$Q$5,\"\",INDEX('بينات التلاميد'!$B$5:$B$56,SMALL(IF('بينات التلاميد'!$B$5:$B$56<>\"\",ROW('بينات التلاميد'!$B$5:$B$56)-ROW($B$5)+1),ROWS($B$2:B483)))),\"\")","v":""},{"$f":"IFERROR(VLOOKUP(B483,'بينات التلاميد'!$B$5:$G$56,6,0),\"\")","v":""}]
["",{"$f":"IFERROR(IF(ROWS($B$2:B484)>'بينات التلاميد'!$Q$5,\"\",INDEX('بينات التلاميد'!$B$5:$B$56,SMALL(IF('بينات التلاميد'!$B$5:$B$56<>\"\",ROW('بينات التلاميد'!$B$5:$B$56)-ROW($B$5)+1),ROWS($B$2:B484)))),\"\")","v":""},{"$f":"IFERROR(VLOOKUP(B484,'بينات التلاميد'!$B$5:$G$56,6,0),\"\")","v":""}]
["",{"$f":"IFERROR(IF(ROWS($B$2:B485)>'بينات التلاميد'!$Q$5,\"\",INDEX('بينات التلاميد'!$B$5:$B$56,SMALL(IF('بينات التلاميد'!$B$5:$B$56<>\"\",ROW('بينات التلاميد'!$B$5:$B$56)-ROW($B$5)+1),ROWS($B$2:B485)))),\"\")","v":""},{"$f":"IFERROR(VLOOKUP(B485,'بينات التلاميد'!$B$5:$G$56,6,0),\"\")","v":""}]
["",{"$f":"IFERROR(IF(ROWS($B$2:B486)>'بينات التلاميد'!$Q$5,\"\",INDEX('بينات التلاميد'!$B$5:$B$56,SMALL(IF('بينات التلاميد'!$B$5:$B$56<>\"\",ROW('بينات التلاميد'!$B$5:$B$56)-ROW($B$5)+1),ROWS($B$2:B486)))),\"\")","v":""},{"$f":"IFERROR(VLOOKUP(B486,'بينات التلاميد'!$B$5:$G$56,6,0),\"\")","v":""}]
["",{"$f":"IFERROR(IF(ROWS($B$2:B487)>'بينات التلاميد'!$Q$5,\"\",INDEX('بينات التلاميد'!$B$5:$B$56,SMALL(IF('بينات التلاميد'!$B$5:$B$56<>\"\",ROW('بينات التلاميد'!$B$5:$B$56)-ROW($B$5)+1),ROWS($B$2:B487)))),\"\")","v":""},{"$f":"IFERROR(VLOOKUP(B487,'بينات التلاميد'!$B$5:$G$56,6,0),\"\")","v":""}]
["",{"$f":"IFERROR(IF(ROWS($B$2:B488)>'بينات التلاميد'!$Q$5,\"\",INDEX('بينات التلاميد'!$B$5:$B$56,SMALL(IF('بينات التلاميد'!$B$5:$B$56<>\"\",ROW('بينات التلاميد'!$B$5:$B$56)-ROW($B$5)+1),ROWS($B$2:B488)))),\"\")","v":""},{"$f":"IFERROR(VLOOKUP(B488,'بينات التلاميد'!$B$5:$G$56,6,0),\"\")","v":""}]
["",{"$f":"IFERROR(IF(ROWS($B$2:B489)>'بينات التلاميد'!$Q$5,\"\",INDEX('بينات التلاميد'!$B$5:$B$56,SMALL(IF('بينات التلاميد'!$B$5:$B$56<>\"\",ROW('بينات التلاميد'!$B$5:$B$56)-ROW($B$5)+1),ROWS($B$2:B489)))),\"\")","v":""},{"$f":"IFERROR(VLOOKUP(B489,'بينات التلاميد'!$B$5:$G$56,6,0),\"\")","v":""}]
["",{"$f":"IFERROR(IF(ROWS($B$2:B490)>'بينات التلاميد'!$Q$5,\"\",INDEX('بينات التلاميد'!$B$5:$B$56,SMALL(IF('بينات التلاميد'!$B$5:$B$56<>\"\",ROW('بينات التلاميد'!$B$5:$B$56)-ROW($B$5)+1),ROWS($B$2:B490)))),\"\")","v":""},{"$f":"IFERROR(VLOOKUP(B490,'بينات التلاميد'!$B$5:$G$56,6,0),\"\")","v":""}]
["",{"$f":"IFERROR(IF(ROWS($B$2:B491)>'بينات التلاميد'!$Q$5,\"\",INDEX('بينات التلاميد'!$B$5:$B$56,SMALL(IF('بينات التلاميد'!$B$5:$B$56<>\"\",ROW('بينات التلاميد'!$B$5:$B$56)-ROW($B$5)+1),ROWS($B$2:B491)))),\"\")","v":""},{"$f":"IFERROR(VLOOKUP(B491,'بينات التلاميد'!$B$5:$G$56,6,0),\"\")","v":""}]
["",{"$f":"IFERROR(IF(ROWS($B$2:B492)>'بينات التلاميد'!$Q$5,\"\",INDEX('بينات التلاميد'!$B$5:$B$56,SMALL(IF('بينات التلاميد'!$B$5:$B$56<>\"\",ROW('بينات التلاميد'!$B$5:$B$56)-ROW($B$5)+1),ROWS($B$2:B492)))),\"\")","v":""},{"$f":"IFERROR(VLOOKUP(B492,'بينات التلاميد'!$B$5:$G$56,6,0),\"\")","v":""}]
["",{"$f":"IFERROR(IF(ROWS($B$2:B493)>'بينات التلاميد'!$Q$5,\"\",INDEX('بينات التلاميد'!$B$5:$B$56,SMALL(IF('بينات التلاميد'!$B$5:$B$56<>\"\",ROW('بينات التلاميد'!$B$5:$B$56)-ROW($B$5)+1),ROWS($B$2:B493)))),\"\")","v":""},{"$f":"IFERROR(VLOOKUP(B493,'بينات التلاميد'!$B$5:$G$56,6,0),\"\")","v":""}]
["",{"$f":"IFERROR(IF(ROWS($B$2:B494)>'بينات التلاميد'!$Q$5,\"\",INDEX('بينات التلاميد'!$B$5:$B$56,SMALL(IF('بينات التلاميد'!$B$5:$B$56<>\"\",ROW('بينات التلاميد'!$B$5:$B$56)-ROW($B$5)+1),ROWS($B$2:B494)))),\"\")","v":""},{"$f":"IFERROR(VLOOKUP(B494,'بينات التلاميد'!$B$5:$G$56,6,0),\"\")","v":""}]
["",{"$f":"IFERROR(IF(ROWS($B$2:B495)>'بينات التلاميد'!$Q$5,\"\",INDEX('بينات التلاميد'!$B$5:$B$56,SMALL(IF('بينات التلاميد'!$B$5:$B$56<>\"\",ROW('بينات التلاميد'!$B$5:$B$56)-ROW($B$5)+1),ROWS($B$2:B495)))),\"\")","v":""},{"$f":"IFERROR(VLOOKUP(B495,'بينات التلاميد'!$B$5:$G$56,6,0),\"\")","v":""}]
["",{"$f":"IFERROR(IF(ROWS($B$2:B496)>'بينات التلاميد'!$Q$5,\"\",INDEX('بينات التلاميد'!$B$5:$B$56,SMALL(IF('بينات التلاميد'!$B$5:$B$56<>\"\",ROW('بينات التلاميد'!$B$5:$B$56)-ROW($B$5)+1),ROWS($B$2:B496)))),\"\")","v":""},{"$f":"IFERROR(VLOOKUP(B496,'بينات التلاميد'!$B$5:$G$56,6,0),\"\")","v":""}]
["",{"$f":"IFERROR(IF(ROWS($B$2:B497)>'بينات التلاميد'!$Q$5,\"\",INDEX('بينات التلاميد'!$B$5:$B$56,SMALL(IF('بينات التلاميد'!$B$5:$B$56<>\"\",ROW('بينات التلاميد'!$B$5:$B$56)-ROW($B$5)+1),ROWS($B$2:B497)))),\"\")","v":""},{"$f":"IFERROR(VLOOKUP(B497,'بينات التلاميد'!$B$5:$G$56,6,0),\"\")","v":""}]
["",{"$f":"IFERROR(IF(ROWS($B$2:B498)>'بينات التلاميد'!$Q$5,\"\",INDEX('بينات التلاميد'!$B$5:$B$56,SMALL(IF('بينات التلاميد'!$B$5:$B$56<>\"\",ROW('بينات التلاميد'!$B$5:$B$56)-ROW($B$5)+1),ROWS($B$2:B498)))),\"\")","v":""},{"$f":"IFERROR(VLOOKUP(B498,'بينات التلاميد'!$B$5:$G$56,6,0),\"\")","v":""}]
["",{"$f":"IFERROR(IF(ROWS($B$2:B499)>'بينات التلاميد'!$Q$5,\"\",INDEX('بينات التلاميد'!$B$5:$B$56,SMALL(IF('بينات التلاميد'!$B$5:$B$56<>\"\",ROW('بينات التلاميد'!$B$5:$B$56)-ROW($B$5)+1),ROWS($B$2:B499)))),\"\")","v":""},{"$f":"IFERROR(VLOOKUP(B499,'بينات التلاميد'!$B$5:$G$56,6,0),\"\")","v":""}]
["",{"$f":"IFERROR(IF(ROWS($B$2:B500)>'بينات التلاميد'!$Q$5,\"\",INDEX('بينات التلاميد'!$B$5:$B$56,SMALL(IF('بينات التلاميد'!$B$5:$B$56<>\"\",ROW('بينات التلاميد'!$B$5:$B$56)-ROW($B$5)+1),ROWS($B$2:B500)))),\"\")","v":""},{"$f":"IFERROR(VLOOKUP(B500,'بينات التلاميد'!$B$5:$G$56,6,0),\"\")","v":""}]
["",{"$f":"IFERROR(IF(ROWS($B$2:B501)>'بينات التلاميد'!$Q$5,\"\",INDEX('بينات التلاميد'!$B$5:$B$56,SMALL(IF('بينات التلاميد'!$B$5:$B$56<>\"\",ROW('بينات التلاميد'!$B$5:$B$56)-ROW($B$5)+1),ROWS($B$2:B501)))),\"\")","v":""},{"$f":"IFERROR(VLOOKUP(B501,'بينات التلاميد'!$B$5:$G$56,6,0),\"\")","v":""}]
["",{"$f":"IFERROR(IF(ROWS($B$2:B502)>'بينات التلاميد'!$Q$5,\"\",INDEX('بينات التلاميد'!$B$5:$B$56,SMALL(IF('بينات التلاميد'!$B$5:$B$56<>\"\",ROW('بينات التلاميد'!$B$5:$B$56)-ROW($B$5)+1),ROWS($B$2:B502)))),\"\")","v":""},{"$f":"IFERROR(VLOOKUP(B502,'بينات التلاميد'!$B$5:$G$56,6,0),\"\")","v":""}]
["",{"$f":"IFERROR(IF(ROWS($B$2:B503)>'بينات التلاميد'!$Q$5,\"\",INDEX('بينات التلاميد'!$B$5:$B$56,SMALL(IF('بينات التلاميد'!$B$5:$B$56<>\"\",ROW('بينات التلاميد'!$B$5:$B$56)-ROW($B$5)+1),ROWS($B$2:B503)))),\"\")","v":""},{"$f":"IFERROR(VLOOKUP(B503,'بينات التلاميد'!$B$5:$G$56,6,0),\"\")","v":""}]
["",{"$f":"IFERROR(IF(ROWS($B$2:B504)>'بينات التلاميد'!$Q$5,\"\",INDEX('بينات التلاميد'!$B$5:$B$56,SMALL(IF('بينات التلاميد'!$B$5:$B$56<>\"\",ROW('بينات التلاميد'!$B$5:$B$56)-ROW($B$5)+1),ROWS($B$2:B504)))),\"\")","v":""},{"$f":"IFERROR(VLOOKUP(B504,'بينات التلاميد'!$B$5:$G$56,6,0),\"\")","v":""}]
["",{"$f":"IFERROR(IF(ROWS($B$2:B505)>'بينات التلاميد'!$Q$5,\"\",INDEX('بينات التلاميد'!$B$5:$B$56,SMALL(IF('بينات التلاميد'!$B$5:$B$56<>\"\",ROW('بينات التلاميد'!$B$5:$B$56)-ROW($B$5)+1),ROWS($B$2:B505)))),\"\")","v":""},{"$f":"IFERROR(VLOOKUP(B505,'بينات التلاميد'!$B$5:$G$56,6,0),\"\")","v":""}]
["",{"$f":"IFERROR(IF(ROWS($B$2:B506)>'بينات التلاميد'!$Q$5,\"\",INDEX('بينات التلاميد'!$B$5:$B$56,SMALL(IF('بينات التلاميد'!$B$5:$B$56<>\"\",ROW('بينات التلاميد'!$B$5:$B$56)-ROW($B$5)+1),ROWS($B$2:B506)))),\"\")","v":""},{"$f":"IFERROR(VLOOKUP(B506,'بينات التلاميد'!$B$5:$G$56,6,0),\"\")","v":""}]
["",{"$f":"IFERROR(IF(ROWS($B$2:B507)>'بينات التلاميد'!$Q$5,\"\",INDEX('بينات التلاميد'!$B$5:$B$56,SMALL(IF('بينات التلاميد'!$B$5:$B$56<>\"\",ROW('بينات التلاميد'!$B$5:$B$56)-ROW($B$5)+1),ROWS($B$2:B507)))),\"\")","v":""},{"$f":"IFERROR(VLOOKUP(B507,'بينات التلاميد'!$B$5:$G$56,6,0),\"\")","v":""}]
["",{"$f":"IFERROR(IF(ROWS($B$2:B508)>'بينات التلاميد'!$Q$5,\"\",INDEX('بينات التلاميد'!$B$5:$B$56,SMALL(IF('بينات التلاميد'!$B$5:$B$56<>\"\",ROW('بينات التلاميد'!$B$5:$B$56)-ROW($B$5)+1),ROWS($B$2:B508)))),\"\")","v":""},{"$f":"IFERROR(VLOOKUP(B508,'بينات التلاميد'!$B$5:$G$56,6,0),\"\")","v":""}]
["",{"$f":"IFERROR(IF(ROWS($B$2:B509)>'بينات التلاميد'!$Q$5,\"\",INDEX('بينات التلاميد'!$B$5:$B$56,SMALL(IF('بينات التلاميد'!$B$5:$B$56<>\"\",ROW('بينات التلاميد'!$B$5:$B$56)-ROW($B$5)+1),ROWS($B$2:B509)))),\"\")","v":""},{"$f":"IFERROR(VLOOKUP(B509,'بينات التلاميد'!$B$5:$G$56,6,0),\"\")","v":""}]
["",{"$f":"IFERROR(IF(ROWS($B$2:B510)>'بينات التلاميد'!$Q$5,\"\",INDEX('بينات التلاميد'!$B$5:$B$56,SMALL(IF('بينات التلاميد'!$B$5:$B$56<>\"\",ROW('بينات التلاميد'!$B$5:$B$56)-ROW($B$5)+1),ROWS($B$2:B510)))),\"\")","v":""},{"$f":"IFERROR(VLOOKUP(B510,'بينات التلاميد'!$B$5:$G$56,6,0),\"\")","v":""}]
["",{"$f":"IFERROR(IF(ROWS($B$2:B511)>'بينات التلاميد'!$Q$5,\"\",INDEX('بينات التلاميد'!$B$5:$B$56,SMALL(IF('بينات التلاميد'!$B$5:$B$56<>\"\",ROW('بينات التلاميد'!$B$5:$B$56)-ROW($B$5)+1),ROWS($B$2:B511)))),\"\")","v":""},{"$f":"IFERROR(VLOOKUP(B511,'بينات التلاميد'!$B$5:$G$56,6,0),\"\")","v":""}]
["",{"$f":"IFERROR(IF(ROWS($B$2:B512)>'بينات التلاميد'!$Q$5,\"\",INDEX('بينات التلاميد'!$B$5:$B$56,SMALL(IF('بينات التلاميد'!$B$5:$B$56<>\"\",ROW('بينات التلاميد'!$B$5:$B$56)-ROW($B$5)+1),ROWS($B$2:B512)))),\"\")","v":""},{"$f":"IFERROR(VLOOKUP(B512,'بينات التلاميد'!$B$5:$G$56,6,0),\"\")","v":""}]
["",{"$f":"IFERROR(IF(ROWS($B$2:B513)>'بينات التلاميد'!$Q$5,\"\",INDEX('بينات التلاميد'!$B$5:$B$56,SMALL(IF('بينات التلاميد'!$B$5:$B$56<>\"\",ROW('بينات التلاميد'!$B$5:$B$56)-ROW($B$5)+1),ROWS($B$2:B513)))),\"\")","v":""},{"$f":"IFERROR(VLOOKUP(B513,'بينات التلاميد'!$B$5:$G$56,6,0),\"\")","v":""}]
[{"$f":"IFERROR(VLOOKUP(C514,$D$2:$E$20,2,0),\"\")","v":""},{"$f":"IFERROR(IF(ROWS($B$2:B514)>'بينات التلاميد'!$Q$5,\"\",INDEX('بينات التلاميد'!$B$5:$B$56,SMALL(IF('بينات التلاميد'!$B$5:$B$56<>\"\",ROW('بينات التلاميد'!$B$5:$B$56)-ROW($B$5)+1),ROWS($B$2:B514)))),\"\")","v":""},{"$f":"IFERROR(VLOOKUP(B514,'بينات التلاميد'!$B$5:$G$56,6,0),\"\")","v":""}]
["",{"$f":"IFERROR(IF(ROWS($B$2:B515)>'بينات التلاميد'!$Q$5,\"\",INDEX('بينات التلاميد'!$B$5:$B$56,SMALL(IF('بينات التلاميد'!$B$5:$B$56<>\"\",ROW('بينات التلاميد'!$B$5:$B$56)-ROW($B$5)+1),ROWS($B$2:B515)))),\"\")","v":""},{"$f":"IFERROR(VLOOKUP(B515,'بينات التلاميد'!$B$5:$G$56,6,0),\"\")","v":""}]
["",{"$f":"IFERROR(IF(ROWS($B$2:B516)>'بينات التلاميد'!$Q$5,\"\",INDEX('بينات التلاميد'!$B$5:$B$56,SMALL(IF('بينات التلاميد'!$B$5:$B$56<>\"\",ROW('بينات التلاميد'!$B$5:$B$56)-ROW($B$5)+1),ROWS($B$2:B516)))),\"\")","v":""},{"$f":"IFERROR(VLOOKUP(B516,'بينات التلاميد'!$B$5:$G$56,6,0),\"\")","v":""}]
["",{"$f":"IFERROR(IF(ROWS($B$2:B517)>'بينات التلاميد'!$Q$5,\"\",INDEX('بينات التلاميد'!$B$5:$B$56,SMALL(IF('بينات التلاميد'!$B$5:$B$56<>\"\",ROW('بينات التلاميد'!$B$5:$B$56)-ROW($B$5)+1),ROWS($B$2:B517)))),\"\")","v":""},{"$f":"IFERROR(VLOOKUP(B517,'بينات التلاميد'!$B$5:$G$56,6,0),\"\")","v":""}]
["",{"$f":"IFERROR(IF(ROWS($B$2:B518)>'بينات التلاميد'!$Q$5,\"\",INDEX('بينات التلاميد'!$B$5:$B$56,SMALL(IF('بينات التلاميد'!$B$5:$B$56<>\"\",ROW('بينات التلاميد'!$B$5:$B$56)-ROW($B$5)+1),ROWS($B$2:B518)))),\"\")","v":""},{"$f":"IFERROR(VLOOKUP(B518,'بينات التلاميد'!$B$5:$G$56,6,0),\"\")","v":""}]
["",{"$f":"IFERROR(IF(ROWS($B$2:B519)>'بينات التلاميد'!$Q$5,\"\",INDEX('بينات التلاميد'!$B$5:$B$56,SMALL(IF('بينات التلاميد'!$B$5:$B$56<>\"\",ROW('بينات التلاميد'!$B$5:$B$56)-ROW($B$5)+1),ROWS($B$2:B519)))),\"\")","v":""},{"$f":"IFERROR(VLOOKUP(B519,'بينات التلاميد'!$B$5:$G$56,6,0),\"\")","v":""}]
["",{"$f":"IFERROR(IF(ROWS($B$2:B520)>'بينات التلاميد'!$Q$5,\"\",INDEX('بينات التلاميد'!$B$5:$B$56,SMALL(IF('بينات التلاميد'!$B$5:$B$56<>\"\",ROW('بينات التلاميد'!$B$5:$B$56)-ROW($B$5)+1),ROWS($B$2:B520)))),\"\")","v":""},{"$f":"IFERROR(VLOOKUP(B520,'بينات التلاميد'!$B$5:$G$56,6,0),\"\")","v":""}]
["",{"$f":"IFERROR(IF(ROWS($B$2:B521)>'بينات التلاميد'!$Q$5,\"\",INDEX('بينات التلاميد'!$B$5:$B$56,SMALL(IF('بينات التلاميد'!$B$5:$B$56<>\"\",ROW('بينات التلاميد'!$B$5:$B$56)-ROW($B$5)+1),ROWS($B$2:B521)))),\"\")","v":""},{"$f":"IFERROR(VLOOKUP(B521,'بينات التلاميد'!$B$5:$G$56,6,0),\"\")","v":""}]
["",{"$f":"IFERROR(IF(ROWS($B$2:B522)>'بينات التلاميد'!$Q$5,\"\",INDEX('بينات التلاميد'!$B$5:$B$56,SMALL(IF('بينات التلاميد'!$B$5:$B$56<>\"\",ROW('بينات التلاميد'!$B$5:$B$56)-ROW($B$5)+1),ROWS($B$2:B522)))),\"\")","v":""},{"$f":"IFERROR(VLOOKUP(B522,'بينات التلاميد'!$B$5:$G$56,6,0),\"\")","v":""}]
["",{"$f":"IFERROR(IF(ROWS($B$2:B523)>'بينات التلاميد'!$Q$5,\"\",INDEX('بينات التلاميد'!$B$5:$B$56,SMALL(IF('بينات التلاميد'!$B$5:$B$56<>\"\",ROW('بينات التلاميد'!$B$5:$B$56)-ROW($B$5)+1),ROWS($B$2:B523)))),\"\")","v":""},{"$f":"IFERROR(VLOOKUP(B523,'بينات التلاميد'!$B$5:$G$56,6,0),\"\")","v":""}]
["",{"$f":"IFERROR(IF(ROWS($B$2:B524)>'بينات التلاميد'!$Q$5,\"\",INDEX('بينات التلاميد'!$B$5:$B$56,SMALL(IF('بينات التلاميد'!$B$5:$B$56<>\"\",ROW('بينات التلاميد'!$B$5:$B$56)-ROW($B$5)+1),ROWS($B$2:B524)))),\"\")","v":""},{"$f":"IFERROR(VLOOKUP(B524,'بينات التلاميد'!$B$5:$G$56,6,0),\"\")","v":""}]
["",{"$f":"IFERROR(IF(ROWS($B$2:B525)>'بينات التلاميد'!$Q$5,\"\",INDEX('بينات التلاميد'!$B$5:$B$56,SMALL(IF('بينات التلاميد'!$B$5:$B$56<>\"\",ROW('بينات التلاميد'!$B$5:$B$56)-ROW($B$5)+1),ROWS($B$2:B525)))),\"\")","v":""},{"$f":"IFERROR(VLOOKUP(B525,'بينات التلاميد'!$B$5:$G$56,6,0),\"\")","v":""}]
["",{"$f":"IFERROR(IF(ROWS($B$2:B526)>'بينات التلاميد'!$Q$5,\"\",INDEX('بينات التلاميد'!$B$5:$B$56,SMALL(IF('بينات التلاميد'!$B$5:$B$56<>\"\",ROW('بينات التلاميد'!$B$5:$B$56)-ROW($B$5)+1),ROWS($B$2:B526)))),\"\")","v":""},{"$f":"IFERROR(VLOOKUP(B526,'بينات التلاميد'!$B$5:$G$56,6,0),\"\")","v":""}]
["",{"$f":"IFERROR(IF(ROWS($B$2:B527)>'بينات التلاميد'!$Q$5,\"\",INDEX('بينات التلاميد'!$B$5:$B$56,SMALL(IF('بينات التلاميد'!$B$5:$B$56<>\"\",ROW('بينات التلاميد'!$B$5:$B$56)-ROW($B$5)+1),ROWS($B$2:B527)))),\"\")","v":""},{"$f":"IFERROR(VLOOKUP(B527,'بينات التلاميد'!$B$5:$G$56,6,0),\"\")","v":""}]
["",{"$f":"IFERROR(IF(ROWS($B$2:B528)>'بينات التلاميد'!$Q$5,\"\",INDEX('بينات التلاميد'!$B$5:$B$56,SMALL(IF('بينات التلاميد'!$B$5:$B$56<>\"\",ROW('بينات التلاميد'!$B$5:$B$56)-ROW($B$5)+1),ROWS($B$2:B528)))),\"\")","v":""},{"$f":"IFERROR(VLOOKUP(B528,'بينات التلاميد'!$B$5:$G$56,6,0),\"\")","v":""}]
["",{"$f":"IFERROR(IF(ROWS($B$2:B529)>'بينات التلاميد'!$Q$5,\"\",INDEX('بينات التلاميد'!$B$5:$B$56,SMALL(IF('بينات التلاميد'!$B$5:$B$56<>\"\",ROW('بينات التلاميد'!$B$5:$B$56)-ROW($B$5)+1),ROWS($B$2:B529)))),\"\")","v":""},{"$f":"IFERROR(VLOOKUP(B529,'بينات التلاميد'!$B$5:$G$56,6,0),\"\")","v":""}]
["",{"$f":"IFERROR(IF(ROWS($B$2:B530)>'بينات التلاميد'!$Q$5,\"\",INDEX('بينات التلاميد'!$B$5:$B$56,SMALL(IF('بينات التلاميد'!$B$5:$B$56<>\"\",ROW('بينات التلاميد'!$B$5:$B$56)-ROW($B$5)+1),ROWS($B$2:B530)))),\"\")","v":""},{"$f":"IFERROR(VLOOKUP(B530,'بينات التلاميد'!$B$5:$G$56,6,0),\"\")","v":""}]
["",{"$f":"IFERROR(IF(ROWS($B$2:B531)>'بينات التلاميد'!$Q$5,\"\",INDEX('بينات التلاميد'!$B$5:$B$56,SMALL(IF('بينات التلاميد'!$B$5:$B$56<>\"\",ROW('بينات التلاميد'!$B$5:$B$56)-ROW($B$5)+1),ROWS($B$2:B531)))),\"\")","v":""},{"$f":"IFERROR(VLOOKUP(B531,'بينات التلاميد'!$B$5:$G$56,6,0),\"\")","v":""}]
["",{"$f":"IFERROR(IF(ROWS($B$2:B532)>'بينات التلاميد'!$Q$5,\"\",INDEX('بينات التلاميد'!$B$5:$B$56,SMALL(IF('بينات التلاميد'!$B$5:$B$56<>\"\",ROW('بينات التلاميد'!$B$5:$B$56)-ROW($B$5)+1),ROWS($B$2:B532)))),\"\")","v":""},{"$f":"IFERROR(VLOOKUP(B532,'بينات التلاميد'!$B$5:$G$56,6,0),\"\")","v":""}]
["",{"$f":"IFERROR(IF(ROWS($B$2:B533)>'بينات التلاميد'!$Q$5,\"\",INDEX('بينات التلاميد'!$B$5:$B$56,SMALL(IF('بينات التلاميد'!$B$5:$B$56<>\"\",ROW('بينات التلاميد'!$B$5:$B$56)-ROW($B$5)+1),ROWS($B$2:B533)))),\"\")","v":""},{"$f":"IFERROR(VLOOKUP(B533,'بينات التلاميد'!$B$5:$G$56,6,0),\"\")","v":""}]
["",{"$f":"IFERROR(IF(ROWS($B$2:B534)>'بينات التلاميد'!$Q$5,\"\",INDEX('بينات التلاميد'!$B$5:$B$56,SMALL(IF('بينات التلاميد'!$B$5:$B$56<>\"\",ROW('بينات التلاميد'!$B$5:$B$56)-ROW($B$5)+1),ROWS($B$2:B534)))),\"\")","v":""},{"$f":"IFERROR(VLOOKUP(B534,'بينات التلاميد'!$B$5:$G$56,6,0),\"\")","v":""}]
["",{"$f":"IFERROR(IF(ROWS($B$2:B535)>'بينات التلاميد'!$Q$5,\"\",INDEX('بينات التلاميد'!$B$5:$B$56,SMALL(IF('بينات التلاميد'!$B$5:$B$56<>\"\",ROW('بينات التلاميد'!$B$5:$B$56)-ROW($B$5)+1),ROWS($B$2:B535)))),\"\")","v":""},{"$f":"IFERROR(VLOOKUP(B535,'بينات التلاميد'!$B$5:$G$56,6,0),\"\")","v":""}]
["",{"$f":"IFERROR(IF(ROWS($B$2:B536)>'بينات التلاميد'!$Q$5,\"\",INDEX('بينات التلاميد'!$B$5:$B$56,SMALL(IF('بينات التلاميد'!$B$5:$B$56<>\"\",ROW('بينات التلاميد'!$B$5:$B$56)-ROW($B$5)+1),ROWS($B$2:B536)))),\"\")","v":""},{"$f":"IFERROR(VLOOKUP(B536,'بينات التلاميد'!$B$5:$G$56,6,0),\"\")","v":""}]
["",{"$f":"IFERROR(IF(ROWS($B$2:B537)>'بينات التلاميد'!$Q$5,\"\",INDEX('بينات التلاميد'!$B$5:$B$56,SMALL(IF('بينات التلاميد'!$B$5:$B$56<>\"\",ROW('بينات التلاميد'!$B$5:$B$56)-ROW($B$5)+1),ROWS($B$2:B537)))),\"\")","v":""},{"$f":"IFERROR(VLOOKUP(B537,'بينات التلاميد'!$B$5:$G$56,6,0),\"\")","v":""}]
["",{"$f":"IFERROR(IF(ROWS($B$2:B538)>'بينات التلاميد'!$Q$5,\"\",INDEX('بينات التلاميد'!$B$5:$B$56,SMALL(IF('بينات التلاميد'!$B$5:$B$56<>\"\",ROW('بينات التلاميد'!$B$5:$B$56)-ROW($B$5)+1),ROWS($B$2:B538)))),\"\")","v":""},{"$f":"IFERROR(VLOOKUP(B538,'بينات التلاميد'!$B$5:$G$56,6,0),\"\")","v":""}]
["",{"$f":"IFERROR(IF(ROWS($B$2:B539)>'بينات التلاميد'!$Q$5,\"\",INDEX('بينات التلاميد'!$B$5:$B$56,SMALL(IF('بينات التلاميد'!$B$5:$B$56<>\"\",ROW('بينات التلاميد'!$B$5:$B$56)-ROW($B$5)+1),ROWS($B$2:B539)))),\"\")","v":""},{"$f":"IFERROR(VLOOKUP(B539,'بينات التلاميد'!$B$5:$G$56,6,0),\"\")","v":""}]
["",{"$f":"IFERROR(IF(ROWS($B$2:B540)>'بينات التلاميد'!$Q$5,\"\",INDEX('بينات التلاميد'!$B$5:$B$56,SMALL(IF('بينات التلاميد'!$B$5:$B$56<>\"\",ROW('بينات التلاميد'!$B$5:$B$56)-ROW($B$5)+1),ROWS($B$2:B540)))),\"\")","v":""},{"$f":"IFERROR(VLOOKUP(B540,'بينات التلاميد'!$B$5:$G$56,6,0),\"\")","v":""}]
["",{"$f":"IFERROR(IF(ROWS($B$2:B541)>'بينات التلاميد'!$Q$5,\"\",INDEX('بينات التلاميد'!$B$5:$B$56,SMALL(IF('بينات التلاميد'!$B$5:$B$56<>\"\",ROW('بينات التلاميد'!$B$5:$B$56)-ROW($B$5)+1),ROWS($B$2:B541)))),\"\")","v":""},{"$f":"IFERROR(VLOOKUP(B541,'بينات التلاميد'!$B$5:$G$56,6,0),\"\")","v":""}]
["",{"$f":"IFERROR(IF(ROWS($B$2:B542)>'بينات التلاميد'!$Q$5,\"\",INDEX('بينات التلاميد'!$B$5:$B$56,SMALL(IF('بينات التلاميد'!$B$5:$B$56<>\"\",ROW('بينات التلاميد'!$B$5:$B$56)-ROW($B$5)+1),ROWS($B$2:B542)))),\"\")","v":""},{"$f":"IFERROR(VLOOKUP(B542,'بينات التلاميد'!$B$5:$G$56,6,0),\"\")","v":""}]
["",{"$f":"IFERROR(IF(ROWS($B$2:B543)>'بينات التلاميد'!$Q$5,\"\",INDEX('بينات التلاميد'!$B$5:$B$56,SMALL(IF('بينات التلاميد'!$B$5:$B$56<>\"\",ROW('بينات التلاميد'!$B$5:$B$56)-ROW($B$5)+1),ROWS($B$2:B543)))),\"\")","v":""},{"$f":"IFERROR(VLOOKUP(B543,'بينات التلاميد'!$B$5:$G$56,6,0),\"\")","v":""}]
["",{"$f":"IFERROR(IF(ROWS($B$2:B544)>'بينات التلاميد'!$Q$5,\"\",INDEX('بينات التلاميد'!$B$5:$B$56,SMALL(IF('بينات التلاميد'!$B$5:$B$56<>\"\",ROW('بينات التلاميد'!$B$5:$B$56)-ROW($B$5)+1),ROWS($B$2:B544)))),\"\")","v":""},{"$f":"IFERROR(VLOOKUP(B544,'بينات التلاميد'!$B$5:$G$56,6,0),\"\")","v":""}]
["",{"$f":"IFERROR(IF(ROWS($B$2:B545)>'بينات التلاميد'!$Q$5,\"\",INDEX('بينات التلاميد'!$B$5:$B$56,SMALL(IF('بينات التلاميد'!$B$5:$B$56<>\"\",ROW('بينات التلاميد'!$B$5:$B$56)-ROW($B$5)+1),ROWS($B$2:B545)))),\"\")","v":""},{"$f":"IFERROR(VLOOKUP(B545,'بينات التلاميد'!$B$5:$G$56,6,0),\"\")","v":""}]
["",{"$f":"IFERROR(IF(ROWS($B$2:B546)>'بينات التلاميد'!$Q$5,\"\",INDEX('بينات التلاميد'!$B$5:$B$56,SMALL(IF('بينات التلاميد'!$B$5:$B$56<>\"\",ROW('بينات التلاميد'!$B$5:$B$56)-ROW($B$5)+1),ROWS($B$2:B546)))),\"\")","v":""},{"$f":"IFERROR(VLOOKUP(B546,'بينات التلاميد'!$B$5:$G$56,6,0),\"\")","v":""}]
["",{"$f":"IFERROR(IF(ROWS($B$2:B547)>'بينات التلاميد'!$Q$5,\"\",INDEX('بينات التلاميد'!$B$5:$B$56,SMALL(IF('بينات التلاميد'!$B$5:$B$56<>\"\",ROW('بينات التلاميد'!$B$5:$B$56)-ROW($B$5)+1),ROWS($B$2:B547)))),\"\")","v":""},{"$f":"IFERROR(VLOOKUP(B547,'بينات التلاميد'!$B$5:$G$56,6,0),\"\")","v":""}]
["",{"$f":"IFERROR(IF(ROWS($B$2:B548)>'بينات التلاميد'!$Q$5,\"\",INDEX('بينات التلاميد'!$B$5:$B$56,SMALL(IF('بينات التلاميد'!$B$5:$B$56<>\"\",ROW('بينات التلاميد'!$B$5:$B$56)-ROW($B$5)+1),ROWS($B$2:B548)))),\"\")","v":""},{"$f":"IFERROR(VLOOKUP(B548,'بينات التلاميد'!$B$5:$G$56,6,0),\"\")","v":""}]
["",{"$f":"IFERROR(IF(ROWS($B$2:B549)>'بينات التلاميد'!$Q$5,\"\",INDEX('بينات التلاميد'!$B$5:$B$56,SMALL(IF('بينات التلاميد'!$B$5:$B$56<>\"\",ROW('بينات التلاميد'!$B$5:$B$56)-ROW($B$5)+1),ROWS($B$2:B549)))),\"\")","v":""},{"$f":"IFERROR(VLOOKUP(B549,'بينات التلاميد'!$B$5:$G$56,6,0),\"\")","v":""}]
["",{"$f":"IFERROR(IF(ROWS($B$2:B550)>'بينات التلاميد'!$Q$5,\"\",INDEX('بينات التلاميد'!$B$5:$B$56,SMALL(IF('بينات التلاميد'!$B$5:$B$56<>\"\",ROW('بينات التلاميد'!$B$5:$B$56)-ROW($B$5)+1),ROWS($B$2:B550)))),\"\")","v":""},{"$f":"IFERROR(VLOOKUP(B550,'بينات التلاميد'!$B$5:$G$56,6,0),\"\")","v":""}]
["",{"$f":"IFERROR(IF(ROWS($B$2:B551)>'بينات التلاميد'!$Q$5,\"\",INDEX('بينات التلاميد'!$B$5:$B$56,SMALL(IF('بينات التلاميد'!$B$5:$B$56<>\"\",ROW('بينات التلاميد'!$B$5:$B$56)-ROW($B$5)+1),ROWS($B$2:B551)))),\"\")","v":""},{"$f":"IFERROR(VLOOKUP(B551,'بينات التلاميد'!$B$5:$G$56,6,0),\"\")","v":""}]
["",{"$f":"IFERROR(IF(ROWS($B$2:B552)>'بينات التلاميد'!$Q$5,\"\",INDEX('بينات التلاميد'!$B$5:$B$56,SMALL(IF('بينات التلاميد'!$B$5:$B$56<>\"\",ROW('بينات التلاميد'!$B$5:$B$56)-ROW($B$5)+1),ROWS($B$2:B552)))),\"\")","v":""},{"$f":"IFERROR(VLOOKUP(B552,'بينات التلاميد'!$B$5:$G$56,6,0),\"\")","v":""}]
["",{"$f":"IFERROR(IF(ROWS($B$2:B553)>'بينات التلاميد'!$Q$5,\"\",INDEX('بينات التلاميد'!$B$5:$B$56,SMALL(IF('بينات التلاميد'!$B$5:$B$56<>\"\",ROW('بينات التلاميد'!$B$5:$B$56)-ROW($B$5)+1),ROWS($B$2:B553)))),\"\")","v":""},{"$f":"IFERROR(VLOOKUP(B553,'بينات التلاميد'!$B$5:$G$56,6,0),\"\")","v":""}]
["",{"$f":"IFERROR(IF(ROWS($B$2:B554)>'بينات التلاميد'!$Q$5,\"\",INDEX('بينات التلاميد'!$B$5:$B$56,SMALL(IF('بينات التلاميد'!$B$5:$B$56<>\"\",ROW('بينات التلاميد'!$B$5:$B$56)-ROW($B$5)+1),ROWS($B$2:B554)))),\"\")","v":""},{"$f":"IFERROR(VLOOKUP(B554,'بينات التلاميد'!$B$5:$G$56,6,0),\"\")","v":""}]
["",{"$f":"IFERROR(IF(ROWS($B$2:B555)>'بينات التلاميد'!$Q$5,\"\",INDEX('بينات التلاميد'!$B$5:$B$56,SMALL(IF('بينات التلاميد'!$B$5:$B$56<>\"\",ROW('بينات التلاميد'!$B$5:$B$56)-ROW($B$5)+1),ROWS($B$2:B555)))),\"\")","v":""},{"$f":"IFERROR(VLOOKUP(B555,'بينات التلاميد'!$B$5:$G$56,6,0),\"\")","v":""}]
["",{"$f":"IFERROR(IF(ROWS($B$2:B556)>'بينات التلاميد'!$Q$5,\"\",INDEX('بينات التلاميد'!$B$5:$B$56,SMALL(IF('بينات التلاميد'!$B$5:$B$56<>\"\",ROW('بينات التلاميد'!$B$5:$B$56)-ROW($B$5)+1),ROWS($B$2:B556)))),\"\")","v":""},{"$f":"IFERROR(VLOOKUP(B556,'بينات التلاميد'!$B$5:$G$56,6,0),\"\")","v":""}]
["",{"$f":"IFERROR(IF(ROWS($B$2:B557)>'بينات التلاميد'!$Q$5,\"\",INDEX('بينات التلاميد'!$B$5:$B$56,SMALL(IF('بينات التلاميد'!$B$5:$B$56<>\"\",ROW('بينات التلاميد'!$B$5:$B$56)-ROW($B$5)+1),ROWS($B$2:B557)))),\"\")","v":""},{"$f":"IFERROR(VLOOKUP(B557,'بينات التلاميد'!$B$5:$G$56,6,0),\"\")","v":""}]
["",{"$f":"IFERROR(IF(ROWS($B$2:B558)>'بينات التلاميد'!$Q$5,\"\",INDEX('بينات التلاميد'!$B$5:$B$56,SMALL(IF('بينات التلاميد'!$B$5:$B$56<>\"\",ROW('بينات التلاميد'!$B$5:$B$56)-ROW($B$5)+1),ROWS($B$2:B558)))),\"\")","v":""},{"$f":"IFERROR(VLOOKUP(B558,'بينات التلاميد'!$B$5:$G$56,6,0),\"\")","v":""}]
["",{"$f":"IFERROR(IF(ROWS($B$2:B559)>'بينات التلاميد'!$Q$5,\"\",INDEX('بينات التلاميد'!$B$5:$B$56,SMALL(IF('بينات التلاميد'!$B$5:$B$56<>\"\",ROW('بينات التلاميد'!$B$5:$B$56)-ROW($B$5)+1),ROWS($B$2:B559)))),\"\")","v":""},{"$f":"IFERROR(VLOOKUP(B559,'بينات التلاميد'!$B$5:$G$56,6,0),\"\")","v":""}]
["",{"$f":"IFERROR(IF(ROWS($B$2:B560)>'بينات التلاميد'!$Q$5,\"\",INDEX('بينات التلاميد'!$B$5:$B$56,SMALL(IF('بينات التلاميد'!$B$5:$B$56<>\"\",ROW('بينات التلاميد'!$B$5:$B$56)-ROW($B$5)+1),ROWS($B$2:B560)))),\"\")","v":""},{"$f":"IFERROR(VLOOKUP(B560,'بينات التلاميد'!$B$5:$G$56,6,0),\"\")","v":""}]
["",{"$f":"IFERROR(IF(ROWS($B$2:B561)>'بينات التلاميد'!$Q$5,\"\",INDEX('بينات التلاميد'!$B$5:$B$56,SMALL(IF('بينات التلاميد'!$B$5:$B$56<>\"\",ROW('بينات التلاميد'!$B$5:$B$56)-ROW($B$5)+1),ROWS($B$2:B561)))),\"\")","v":""},{"$f":"IFERROR(VLOOKUP(B561,'بينات التلاميد'!$B$5:$G$56,6,0),\"\")","v":""}]
["",{"$f":"IFERROR(IF(ROWS($B$2:B562)>'بينات التلاميد'!$Q$5,\"\",INDEX('بينات التلاميد'!$B$5:$B$56,SMALL(IF('بينات التلاميد'!$B$5:$B$56<>\"\",ROW('بينات التلاميد'!$B$5:$B$56)-ROW($B$5)+1),ROWS($B$2:B562)))),\"\")","v":""},{"$f":"IFERROR(VLOOKUP(B562,'بينات التلاميد'!$B$5:$G$56,6,0),\"\")","v":""}]
["",{"$f":"IFERROR(IF(ROWS($B$2:B563)>'بينات التلاميد'!$Q$5,\"\",INDEX('بينات التلاميد'!$B$5:$B$56,SMALL(IF('بينات التلاميد'!$B$5:$B$56<>\"\",ROW('بينات التلاميد'!$B$5:$B$56)-ROW($B$5)+1),ROWS($B$2:B563)))),\"\")","v":""},{"$f":"IFERROR(VLOOKUP(B563,'بينات التلاميد'!$B$5:$G$56,6,0),\"\")","v":""}]
["",{"$f":"IFERROR(IF(ROWS($B$2:B564)>'بينات التلاميد'!$Q$5,\"\",INDEX('بينات التلاميد'!$B$5:$B$56,SMALL(IF('بينات التلاميد'!$B$5:$B$56<>\"\",ROW('بينات التلاميد'!$B$5:$B$56)-ROW($B$5)+1),ROWS($B$2:B564)))),\"\")","v":""},{"$f":"IFERROR(VLOOKUP(B564,'بينات التلاميد'!$B$5:$G$56,6,0),\"\")","v":""}]
["",{"$f":"IFERROR(IF(ROWS($B$2:B565)>'بينات التلاميد'!$Q$5,\"\",INDEX('بينات التلاميد'!$B$5:$B$56,SMALL(IF('بينات التلاميد'!$B$5:$B$56<>\"\",ROW('بينات التلاميد'!$B$5:$B$56)-ROW($B$5)+1),ROWS($B$2:B565)))),\"\")","v":""},{"$f":"IFERROR(VLOOKUP(B565,'بينات التلاميد'!$B$5:$G$56,6,0),\"\")","v":""}]
["",{"$f":"IFERROR(IF(ROWS($B$2:B566)>'بينات التلاميد'!$Q$5,\"\",INDEX('بينات التلاميد'!$B$5:$B$56,SMALL(IF('بينات التلاميد'!$B$5:$B$56<>\"\",ROW('بينات التلاميد'!$B$5:$B$56)-ROW($B$5)+1),ROWS($B$2:B566)))),\"\")","v":""},{"$f":"IFERROR(VLOOKUP(B566,'بينات التلاميد'!$B$5:$G$56,6,0),\"\")","v":""}]
["",{"$f":"IFERROR(IF(ROWS($B$2:B567)>'بينات التلاميد'!$Q$5,\"\",INDEX('بينات التلاميد'!$B$5:$B$56,SMALL(IF('بينات التلاميد'!$B$5:$B$56<>\"\",ROW('بينات التلاميد'!$B$5:$B$56)-ROW($B$5)+1),ROWS($B$2:B567)))),\"\")","v":""},{"$f":"IFERROR(VLOOKUP(B567,'بينات التلاميد'!$B$5:$G$56,6,0),\"\")","v":""}]
["",{"$f":"IFERROR(IF(ROWS($B$2:B568)>'بينات التلاميد'!$Q$5,\"\",INDEX('بينات التلاميد'!$B$5:$B$56,SMALL(IF('بينات التلاميد'!$B$5:$B$56<>\"\",ROW('بينات التلاميد'!$B$5:$B$56)-ROW($B$5)+1),ROWS($B$2:B568)))),\"\")","v":""},{"$f":"IFERROR(VLOOKUP(B568,'بينات التلاميد'!$B$5:$G$56,6,0),\"\")","v":""}]
["",{"$f":"IFERROR(IF(ROWS($B$2:B569)>'بينات التلاميد'!$Q$5,\"\",INDEX('بينات التلاميد'!$B$5:$B$56,SMALL(IF('بينات التلاميد'!$B$5:$B$56<>\"\",ROW('بينات التلاميد'!$B$5:$B$56)-ROW($B$5)+1),ROWS($B$2:B569)))),\"\")","v":""},{"$f":"IFERROR(VLOOKUP(B569,'بينات التلاميد'!$B$5:$G$56,6,0),\"\")","v":""}]
["",{"$f":"IFERROR(IF(ROWS($B$2:B570)>'بينات التلاميد'!$Q$5,\"\",INDEX('بينات التلاميد'!$B$5:$B$56,SMALL(IF('بينات التلاميد'!$B$5:$B$56<>\"\",ROW('بينات التلاميد'!$B$5:$B$56)-ROW($B$5)+1),ROWS($B$2:B570)))),\"\")","v":""},{"$f":"IFERROR(VLOOKUP(B570,'بينات التلاميد'!$B$5:$G$56,6,0),\"\")","v":""}]
["",{"$f":"IFERROR(IF(ROWS($B$2:B571)>'بينات التلاميد'!$Q$5,\"\",INDEX('بينات التلاميد'!$B$5:$B$56,SMALL(IF('بينات التلاميد'!$B$5:$B$56<>\"\",ROW('بينات التلاميد'!$B$5:$B$56)-ROW($B$5)+1),ROWS($B$2:B571)))),\"\")","v":""},{"$f":"IFERROR(VLOOKUP(B571,'بينات التلاميد'!$B$5:$G$56,6,0),\"\")","v":""}]
["",{"$f":"IFERROR(IF(ROWS($B$2:B572)>'بينات التلاميد'!$Q$5,\"\",INDEX('بينات التلاميد'!$B$5:$B$56,SMALL(IF('بينات التلاميد'!$B$5:$B$56<>\"\",ROW('بينات التلاميد'!$B$5:$B$56)-ROW($B$5)+1),ROWS($B$2:B572)))),\"\")","v":""},{"$f":"IFERROR(VLOOKUP(B572,'بينات التلاميد'!$B$5:$G$56,6,0),\"\")","v":""}]
["",{"$f":"IFERROR(IF(ROWS($B$2:B573)>'بينات التلاميد'!$Q$5,\"\",INDEX('بينات التلاميد'!$B$5:$B$56,SMALL(IF('بينات التلاميد'!$B$5:$B$56<>\"\",ROW('بينات التلاميد'!$B$5:$B$56)-ROW($B$5)+1),ROWS($B$2:B573)))),\"\")","v":""},{"$f":"IFERROR(VLOOKUP(B573,'بينات التلاميد'!$B$5:$G$56,6,0),\"\")","v":""}]
["",{"$f":"IFERROR(IF(ROWS($B$2:B574)>'بينات التلاميد'!$Q$5,\"\",INDEX('بينات التلاميد'!$B$5:$B$56,SMALL(IF('بينات التلاميد'!$B$5:$B$56<>\"\",ROW('بينات التلاميد'!$B$5:$B$56)-ROW($B$5)+1),ROWS($B$2:B574)))),\"\")","v":""},{"$f":"IFERROR(VLOOKUP(B574,'بينات التلاميد'!$B$5:$G$56,6,0),\"\")","v":""}]
["",{"$f":"IFERROR(IF(ROWS($B$2:B575)>'بينات التلاميد'!$Q$5,\"\",INDEX('بينات التلاميد'!$B$5:$B$56,SMALL(IF('بينات التلاميد'!$B$5:$B$56<>\"\",ROW('بينات التلاميد'!$B$5:$B$56)-ROW($B$5)+1),ROWS($B$2:B575)))),\"\")","v":""},{"$f":"IFERROR(VLOOKUP(B575,'بينات التلاميد'!$B$5:$G$56,6,0),\"\")","v":""}]
["",{"$f":"IFERROR(IF(ROWS($B$2:B576)>'بينات التلاميد'!$Q$5,\"\",INDEX('بينات التلاميد'!$B$5:$B$56,SMALL(IF('بينات التلاميد'!$B$5:$B$56<>\"\",ROW('بينات التلاميد'!$B$5:$B$56)-ROW($B$5)+1),ROWS($B$2:B576)))),\"\")","v":""},{"$f":"IFERROR(VLOOKUP(B576,'بينات التلاميد'!$B$5:$G$56,6,0),\"\")","v":""}]
["",{"$f":"IFERROR(IF(ROWS($B$2:B577)>'بينات التلاميد'!$Q$5,\"\",INDEX('بينات التلاميد'!$B$5:$B$56,SMALL(IF('بينات التلاميد'!$B$5:$B$56<>\"\",ROW('بينات التلاميد'!$B$5:$B$56)-ROW($B$5)+1),ROWS($B$2:B577)))),\"\")","v":""},{"$f":"IFERROR(VLOOKUP(B577,'بينات التلاميد'!$B$5:$G$56,6,0),\"\")","v":""}]
[{"$f":"IFERROR(VLOOKUP(C578,$D$2:$E$20,2,0),\"\")","v":""},{"$f":"IFERROR(IF(ROWS($B$2:B578)>'بينات التلاميد'!$Q$5,\"\",INDEX('بينات التلاميد'!$B$5:$B$56,SMALL(IF('بينات التلاميد'!$B$5:$B$56<>\"\",ROW('بينات التلاميد'!$B$5:$B$56)-ROW($B$5)+1),ROWS($B$2:B578)))),\"\")","v":""},{"$f":"IFERROR(VLOOKUP(B578,'بينات التلاميد'!$B$5:$G$56,6,0),\"\")","v":""}]
["",{"$f":"IFERROR(IF(ROWS($B$2:B579)>'بينات التلاميد'!$Q$5,\"\",INDEX('بينات التلاميد'!$B$5:$B$56,SMALL(IF('بينات التلاميد'!$B$5:$B$56<>\"\",ROW('بينات التلاميد'!$B$5:$B$56)-ROW($B$5)+1),ROWS($B$2:B579)))),\"\")","v":""},{"$f":"IFERROR(VLOOKUP(B579,'بينات التلاميد'!$B$5:$G$56,6,0),\"\")","v":""}]
["",{"$f":"IFERROR(IF(ROWS($B$2:B580)>'بينات التلاميد'!$Q$5,\"\",INDEX('بينات التلاميد'!$B$5:$B$56,SMALL(IF('بينات التلاميد'!$B$5:$B$56<>\"\",ROW('بينات التلاميد'!$B$5:$B$56)-ROW($B$5)+1),ROWS($B$2:B580)))),\"\")","v":""},{"$f":"IFERROR(VLOOKUP(B580,'بينات التلاميد'!$B$5:$G$56,6,0),\"\")","v":""}]
["",{"$f":"IFERROR(IF(ROWS($B$2:B581)>'بينات التلاميد'!$Q$5,\"\",INDEX('بينات التلاميد'!$B$5:$B$56,SMALL(IF('بينات التلاميد'!$B$5:$B$56<>\"\",ROW('بينات التلاميد'!$B$5:$B$56)-ROW($B$5)+1),ROWS($B$2:B581)))),\"\")","v":""},{"$f":"IFERROR(VLOOKUP(B581,'بينات التلاميد'!$B$5:$G$56,6,0),\"\")","v":""}]
["",{"$f":"IFERROR(IF(ROWS($B$2:B582)>'بينات التلاميد'!$Q$5,\"\",INDEX('بينات التلاميد'!$B$5:$B$56,SMALL(IF('بينات التلاميد'!$B$5:$B$56<>\"\",ROW('بينات التلاميد'!$B$5:$B$56)-ROW($B$5)+1),ROWS($B$2:B582)))),\"\")","v":""},{"$f":"IFERROR(VLOOKUP(B582,'بينات التلاميد'!$B$5:$G$56,6,0),\"\")","v":""}]
["",{"$f":"IFERROR(IF(ROWS($B$2:B583)>'بينات التلاميد'!$Q$5,\"\",INDEX('بينات التلاميد'!$B$5:$B$56,SMALL(IF('بينات التلاميد'!$B$5:$B$56<>\"\",ROW('بينات التلاميد'!$B$5:$B$56)-ROW($B$5)+1),ROWS($B$2:B583)))),\"\")","v":""},{"$f":"IFERROR(VLOOKUP(B583,'بينات التلاميد'!$B$5:$G$56,6,0),\"\")","v":""}]
["",{"$f":"IFERROR(IF(ROWS($B$2:B584)>'بينات التلاميد'!$Q$5,\"\",INDEX('بينات التلاميد'!$B$5:$B$56,SMALL(IF('بينات التلاميد'!$B$5:$B$56<>\"\",ROW('بينات التلاميد'!$B$5:$B$56)-ROW($B$5)+1),ROWS($B$2:B584)))),\"\")","v":""},{"$f":"IFERROR(VLOOKUP(B584,'بينات التلاميد'!$B$5:$G$56,6,0),\"\")","v":""}]
["",{"$f":"IFERROR(IF(ROWS($B$2:B585)>'بينات التلاميد'!$Q$5,\"\",INDEX('بينات التلاميد'!$B$5:$B$56,SMALL(IF('بينات التلاميد'!$B$5:$B$56<>\"\",ROW('بينات التلاميد'!$B$5:$B$56)-ROW($B$5)+1),ROWS($B$2:B585)))),\"\")","v":""},{"$f":"IFERROR(VLOOKUP(B585,'بينات التلاميد'!$B$5:$G$56,6,0),\"\")","v":""}]
["",{"$f":"IFERROR(IF(ROWS($B$2:B586)>'بينات التلاميد'!$Q$5,\"\",INDEX('بينات التلاميد'!$B$5:$B$56,SMALL(IF('بينات التلاميد'!$B$5:$B$56<>\"\",ROW('بينات التلاميد'!$B$5:$B$56)-ROW($B$5)+1),ROWS($B$2:B586)))),\"\")","v":""},{"$f":"IFERROR(VLOOKUP(B586,'بينات التلاميد'!$B$5:$G$56,6,0),\"\")","v":""}]
["",{"$f":"IFERROR(IF(ROWS($B$2:B587)>'بينات التلاميد'!$Q$5,\"\",INDEX('بينات التلاميد'!$B$5:$B$56,SMALL(IF('بينات التلاميد'!$B$5:$B$56<>\"\",ROW('بينات التلاميد'!$B$5:$B$56)-ROW($B$5)+1),ROWS($B$2:B587)))),\"\")","v":""},{"$f":"IFERROR(VLOOKUP(B587,'بينات التلاميد'!$B$5:$G$56,6,0),\"\")","v":""}]
["",{"$f":"IFERROR(IF(ROWS($B$2:B588)>'بينات التلاميد'!$Q$5,\"\",INDEX('بينات التلاميد'!$B$5:$B$56,SMALL(IF('بينات التلاميد'!$B$5:$B$56<>\"\",ROW('بينات التلاميد'!$B$5:$B$56)-ROW($B$5)+1),ROWS($B$2:B588)))),\"\")","v":""},{"$f":"IFERROR(VLOOKUP(B588,'بينات التلاميد'!$B$5:$G$56,6,0),\"\")","v":""}]
["",{"$f":"IFERROR(IF(ROWS($B$2:B589)>'بينات التلاميد'!$Q$5,\"\",INDEX('بينات التلاميد'!$B$5:$B$56,SMALL(IF('بينات التلاميد'!$B$5:$B$56<>\"\",ROW('بينات التلاميد'!$B$5:$B$56)-ROW($B$5)+1),ROWS($B$2:B589)))),\"\")","v":""},{"$f":"IFERROR(VLOOKUP(B589,'بينات التلاميد'!$B$5:$G$56,6,0),\"\")","v":""}]
["",{"$f":"IFERROR(IF(ROWS($B$2:B590)>'بينات التلاميد'!$Q$5,\"\",INDEX('بينات التلاميد'!$B$5:$B$56,SMALL(IF('بينات التلاميد'!$B$5:$B$56<>\"\",ROW('بينات التلاميد'!$B$5:$B$56)-ROW($B$5)+1),ROWS($B$2:B590)))),\"\")","v":""},{"$f":"IFERROR(VLOOKUP(B590,'بينات التلاميد'!$B$5:$G$56,6,0),\"\")","v":""}]
["",{"$f":"IFERROR(IF(ROWS($B$2:B591)>'بينات التلاميد'!$Q$5,\"\",INDEX('بينات التلاميد'!$B$5:$B$56,SMALL(IF('بينات التلاميد'!$B$5:$B$56<>\"\",ROW('بينات التلاميد'!$B$5:$B$56)-ROW($B$5)+1),ROWS($B$2:B591)))),\"\")","v":""},{"$f":"IFERROR(VLOOKUP(B591,'بينات التلاميد'!$B$5:$G$56,6,0),\"\")","v":""}]
["",{"$f":"IFERROR(IF(ROWS($B$2:B592)>'بينات التلاميد'!$Q$5,\"\",INDEX('بينات التلاميد'!$B$5:$B$56,SMALL(IF('بينات التلاميد'!$B$5:$B$56<>\"\",ROW('بينات التلاميد'!$B$5:$B$56)-ROW($B$5)+1),ROWS($B$2:B592)))),\"\")","v":""},{"$f":"IFERROR(VLOOKUP(B592,'بينات التلاميد'!$B$5:$G$56,6,0),\"\")","v":""}]
["",{"$f":"IFERROR(IF(ROWS($B$2:B593)>'بينات التلاميد'!$Q$5,\"\",INDEX('بينات التلاميد'!$B$5:$B$56,SMALL(IF('بينات التلاميد'!$B$5:$B$56<>\"\",ROW('بينات التلاميد'!$B$5:$B$56)-ROW($B$5)+1),ROWS($B$2:B593)))),\"\")","v":""},{"$f":"IFERROR(VLOOKUP(B593,'بينات التلاميد'!$B$5:$G$56,6,0),\"\")","v":""}]
["",{"$f":"IFERROR(IF(ROWS($B$2:B594)>'بينات التلاميد'!$Q$5,\"\",INDEX('بينات التلاميد'!$B$5:$B$56,SMALL(IF('بينات التلاميد'!$B$5:$B$56<>\"\",ROW('بينات التلاميد'!$B$5:$B$56)-ROW($B$5)+1),ROWS($B$2:B594)))),\"\")","v":""},{"$f":"IFERROR(VLOOKUP(B594,'بينات التلاميد'!$B$5:$G$56,6,0),\"\")","v":""}]
["",{"$f":"IFERROR(IF(ROWS($B$2:B595)>'بينات التلاميد'!$Q$5,\"\",INDEX('بينات التلاميد'!$B$5:$B$56,SMALL(IF('بينات التلاميد'!$B$5:$B$56<>\"\",ROW('بينات التلاميد'!$B$5:$B$56)-ROW($B$5)+1),ROWS($B$2:B595)))),\"\")","v":""},{"$f":"IFERROR(VLOOKUP(B595,'بينات التلاميد'!$B$5:$G$56,6,0),\"\")","v":""}]
["",{"$f":"IFERROR(IF(ROWS($B$2:B596)>'بينات التلاميد'!$Q$5,\"\",INDEX('بينات التلاميد'!$B$5:$B$56,SMALL(IF('بينات التلاميد'!$B$5:$B$56<>\"\",ROW('بينات التلاميد'!$B$5:$B$56)-ROW($B$5)+1),ROWS($B$2:B596)))),\"\")","v":""},{"$f":"IFERROR(VLOOKUP(B596,'بينات التلاميد'!$B$5:$G$56,6,0),\"\")","v":""}]
["",{"$f":"IFERROR(IF(ROWS($B$2:B597)>'بينات التلاميد'!$Q$5,\"\",INDEX('بينات التلاميد'!$B$5:$B$56,SMALL(IF('بينات التلاميد'!$B$5:$B$56<>\"\",ROW('بينات التلاميد'!$B$5:$B$56)-ROW($B$5)+1),ROWS($B$2:B597)))),\"\")","v":""},{"$f":"IFERROR(VLOOKUP(B597,'بينات التلاميد'!$B$5:$G$56,6,0),\"\")","v":""}]
["",{"$f":"IFERROR(IF(ROWS($B$2:B598)>'بينات التلاميد'!$Q$5,\"\",INDEX('بينات التلاميد'!$B$5:$B$56,SMALL(IF('بينات التلاميد'!$B$5:$B$56<>\"\",ROW('بينات التلاميد'!$B$5:$B$56)-ROW($B$5)+1),ROWS($B$2:B598)))),\"\")","v":""},{"$f":"IFERROR(VLOOKUP(B598,'بينات التلاميد'!$B$5:$G$56,6,0),\"\")","v":""}]
["",{"$f":"IFERROR(IF(ROWS($B$2:B599)>'بينات التلاميد'!$Q$5,\"\",INDEX('بينات التلاميد'!$B$5:$B$56,SMALL(IF('بينات التلاميد'!$B$5:$B$56<>\"\",ROW('بينات التلاميد'!$B$5:$B$56)-ROW($B$5)+1),ROWS($B$2:B599)))),\"\")","v":""},{"$f":"IFERROR(VLOOKUP(B599,'بينات التلاميد'!$B$5:$G$56,6,0),\"\")","v":""}]
["",{"$f":"IFERROR(IF(ROWS($B$2:B600)>'بينات التلاميد'!$Q$5,\"\",INDEX('بينات التلاميد'!$B$5:$B$56,SMALL(IF('بينات التلاميد'!$B$5:$B$56<>\"\",ROW('بينات التلاميد'!$B$5:$B$56)-ROW($B$5)+1),ROWS($B$2:B600)))),\"\")","v":""},{"$f":"IFERROR(VLOOKUP(B600,'بينات التلاميد'!$B$5:$G$56,6,0),\"\")","v":""}]
["",{"$f":"IFERROR(IF(ROWS($B$2:B601)>'بينات التلاميد'!$Q$5,\"\",INDEX('بينات التلاميد'!$B$5:$B$56,SMALL(IF('بينات التلاميد'!$B$5:$B$56<>\"\",ROW('بينات التلاميد'!$B$5:$B$56)-ROW($B$5)+1),ROWS($B$2:B601)))),\"\")","v":""},{"$f":"IFERROR(VLOOKUP(B601,'بينات التلاميد'!$B$5:$G$56,6,0),\"\")","v":""}]
["",{"$f":"IFERROR(IF(ROWS($B$2:B602)>'بينات التلاميد'!$Q$5,\"\",INDEX('بينات التلاميد'!$B$5:$B$56,SMALL(IF('بينات التلاميد'!$B$5:$B$56<>\"\",ROW('بينات التلاميد'!$B$5:$B$56)-ROW($B$5)+1),ROWS($B$2:B602)))),\"\")","v":""},{"$f":"IFERROR(VLOOKUP(B602,'بينات التلاميد'!$B$5:$G$56,6,0),\"\")","v":""}]
["",{"$f":"IFERROR(IF(ROWS($B$2:B603)>'بينات التلاميد'!$Q$5,\"\",INDEX('بينات التلاميد'!$B$5:$B$56,SMALL(IF('بينات التلاميد'!$B$5:$B$56<>\"\",ROW('بينات التلاميد'!$B$5:$B$56)-ROW($B$5)+1),ROWS($B$2:B603)))),\"\")","v":""},{"$f":"IFERROR(VLOOKUP(B603,'بينات التلاميد'!$B$5:$G$56,6,0),\"\")","v":""}]
["",{"$f":"IFERROR(IF(ROWS($B$2:B604)>'بينات التلاميد'!$Q$5,\"\",INDEX('بينات التلاميد'!$B$5:$B$56,SMALL(IF('بينات التلاميد'!$B$5:$B$56<>\"\",ROW('بينات التلاميد'!$B$5:$B$56)-ROW($B$5)+1),ROWS($B$2:B604)))),\"\")","v":""},{"$f":"IFERROR(VLOOKUP(B604,'بينات التلاميد'!$B$5:$G$56,6,0),\"\")","v":""}]
["",{"$f":"IFERROR(IF(ROWS($B$2:B605)>'بينات التلاميد'!$Q$5,\"\",INDEX('بينات التلاميد'!$B$5:$B$56,SMALL(IF('بينات التلاميد'!$B$5:$B$56<>\"\",ROW('بينات التلاميد'!$B$5:$B$56)-ROW($B$5)+1),ROWS($B$2:B605)))),\"\")","v":""},{"$f":"IFERROR(VLOOKUP(B605,'بينات التلاميد'!$B$5:$G$56,6,0),\"\")","v":""}]
["",{"$f":"IFERROR(IF(ROWS($B$2:B606)>'بينات التلاميد'!$Q$5,\"\",INDEX('بينات التلاميد'!$B$5:$B$56,SMALL(IF('بينات التلاميد'!$B$5:$B$56<>\"\",ROW('بينات التلاميد'!$B$5:$B$56)-ROW($B$5)+1),ROWS($B$2:B606)))),\"\")","v":""},{"$f":"IFERROR(VLOOKUP(B606,'بينات التلاميد'!$B$5:$G$56,6,0),\"\")","v":""}]
["",{"$f":"IFERROR(IF(ROWS($B$2:B607)>'بينات التلاميد'!$Q$5,\"\",INDEX('بينات التلاميد'!$B$5:$B$56,SMALL(IF('بينات التلاميد'!$B$5:$B$56<>\"\",ROW('بينات التلاميد'!$B$5:$B$56)-ROW($B$5)+1),ROWS($B$2:B607)))),\"\")","v":""},{"$f":"IFERROR(VLOOKUP(B607,'بينات التلاميد'!$B$5:$G$56,6,0),\"\")","v":""}]
["",{"$f":"IFERROR(IF(ROWS($B$2:B608)>'بينات التلاميد'!$Q$5,\"\",INDEX('بينات التلاميد'!$B$5:$B$56,SMALL(IF('بينات التلاميد'!$B$5:$B$56<>\"\",ROW('بينات التلاميد'!$B$5:$B$56)-ROW($B$5)+1),ROWS($B$2:B608)))),\"\")","v":""},{"$f":"IFERROR(VLOOKUP(B608,'بينات التلاميد'!$B$5:$G$56,6,0),\"\")","v":""}]
["",{"$f":"IFERROR(IF(ROWS($B$2:B609)>'بينات التلاميد'!$Q$5,\"\",INDEX('بينات التلاميد'!$B$5:$B$56,SMALL(IF('بينات التلاميد'!$B$5:$B$56<>\"\",ROW('بينات التلاميد'!$B$5:$B$56)-ROW($B$5)+1),ROWS($B$2:B609)))),\"\")","v":""},{"$f":"IFERROR(VLOOKUP(B609,'بينات التلاميد'!$B$5:$G$56,6,0),\"\")","v":""}]
["",{"$f":"IFERROR(IF(ROWS($B$2:B610)>'بينات التلاميد'!$Q$5,\"\",INDEX('بينات التلاميد'!$B$5:$B$56,SMALL(IF('بينات التلاميد'!$B$5:$B$56<>\"\",ROW('بينات التلاميد'!$B$5:$B$56)-ROW($B$5)+1),ROWS($B$2:B610)))),\"\")","v":""},{"$f":"IFERROR(VLOOKUP(B610,'بينات التلاميد'!$B$5:$G$56,6,0),\"\")","v":""}]
["",{"$f":"IFERROR(IF(ROWS($B$2:B611)>'بينات التلاميد'!$Q$5,\"\",INDEX('بينات التلاميد'!$B$5:$B$56,SMALL(IF('بينات التلاميد'!$B$5:$B$56<>\"\",ROW('بينات التلاميد'!$B$5:$B$56)-ROW($B$5)+1),ROWS($B$2:B611)))),\"\")","v":""},{"$f":"IFERROR(VLOOKUP(B611,'بينات التلاميد'!$B$5:$G$56,6,0),\"\")","v":""}]
["",{"$f":"IFERROR(IF(ROWS($B$2:B612)>'بينات التلاميد'!$Q$5,\"\",INDEX('بينات التلاميد'!$B$5:$B$56,SMALL(IF('بينات التلاميد'!$B$5:$B$56<>\"\",ROW('بينات التلاميد'!$B$5:$B$56)-ROW($B$5)+1),ROWS($B$2:B612)))),\"\")","v":""},{"$f":"IFERROR(VLOOKUP(B612,'بينات التلاميد'!$B$5:$G$56,6,0),\"\")","v":""}]
["",{"$f":"IFERROR(IF(ROWS($B$2:B613)>'بينات التلاميد'!$Q$5,\"\",INDEX('بينات التلاميد'!$B$5:$B$56,SMALL(IF('بينات التلاميد'!$B$5:$B$56<>\"\",ROW('بينات التلاميد'!$B$5:$B$56)-ROW($B$5)+1),ROWS($B$2:B613)))),\"\")","v":""},{"$f":"IFERROR(VLOOKUP(B613,'بينات التلاميد'!$B$5:$G$56,6,0),\"\")","v":""}]
["",{"$f":"IFERROR(IF(ROWS($B$2:B614)>'بينات التلاميد'!$Q$5,\"\",INDEX('بينات التلاميد'!$B$5:$B$56,SMALL(IF('بينات التلاميد'!$B$5:$B$56<>\"\",ROW('بينات التلاميد'!$B$5:$B$56)-ROW($B$5)+1),ROWS($B$2:B614)))),\"\")","v":""},{"$f":"IFERROR(VLOOKUP(B614,'بينات التلاميد'!$B$5:$G$56,6,0),\"\")","v":""}]
["",{"$f":"IFERROR(IF(ROWS($B$2:B615)>'بينات التلاميد'!$Q$5,\"\",INDEX('بينات التلاميد'!$B$5:$B$56,SMALL(IF('بينات التلاميد'!$B$5:$B$56<>\"\",ROW('بينات التلاميد'!$B$5:$B$56)-ROW($B$5)+1),ROWS($B$2:B615)))),\"\")","v":""},{"$f":"IFERROR(VLOOKUP(B615,'بينات التلاميد'!$B$5:$G$56,6,0),\"\")","v":""}]
["",{"$f":"IFERROR(IF(ROWS($B$2:B616)>'بينات التلاميد'!$Q$5,\"\",INDEX('بينات التلاميد'!$B$5:$B$56,SMALL(IF('بينات التلاميد'!$B$5:$B$56<>\"\",ROW('بينات التلاميد'!$B$5:$B$56)-ROW($B$5)+1),ROWS($B$2:B616)))),\"\")","v":""},{"$f":"IFERROR(VLOOKUP(B616,'بينات التلاميد'!$B$5:$G$56,6,0),\"\")","v":""}]
["",{"$f":"IFERROR(IF(ROWS($B$2:B617)>'بينات التلاميد'!$Q$5,\"\",INDEX('بينات التلاميد'!$B$5:$B$56,SMALL(IF('بينات التلاميد'!$B$5:$B$56<>\"\",ROW('بينات التلاميد'!$B$5:$B$56)-ROW($B$5)+1),ROWS($B$2:B617)))),\"\")","v":""},{"$f":"IFERROR(VLOOKUP(B617,'بينات التلاميد'!$B$5:$G$56,6,0),\"\")","v":""}]
["",{"$f":"IFERROR(IF(ROWS($B$2:B618)>'بينات التلاميد'!$Q$5,\"\",INDEX('بينات التلاميد'!$B$5:$B$56,SMALL(IF('بينات التلاميد'!$B$5:$B$56<>\"\",ROW('بينات التلاميد'!$B$5:$B$56)-ROW($B$5)+1),ROWS($B$2:B618)))),\"\")","v":""},{"$f":"IFERROR(VLOOKUP(B618,'بينات التلاميد'!$B$5:$G$56,6,0),\"\")","v":""}]
["",{"$f":"IFERROR(IF(ROWS($B$2:B619)>'بينات التلاميد'!$Q$5,\"\",INDEX('بينات التلاميد'!$B$5:$B$56,SMALL(IF('بينات التلاميد'!$B$5:$B$56<>\"\",ROW('بينات التلاميد'!$B$5:$B$56)-ROW($B$5)+1),ROWS($B$2:B619)))),\"\")","v":""},{"$f":"IFERROR(VLOOKUP(B619,'بينات التلاميد'!$B$5:$G$56,6,0),\"\")","v":""}]
["",{"$f":"IFERROR(IF(ROWS($B$2:B620)>'بينات التلاميد'!$Q$5,\"\",INDEX('بينات التلاميد'!$B$5:$B$56,SMALL(IF('بينات التلاميد'!$B$5:$B$56<>\"\",ROW('بينات التلاميد'!$B$5:$B$56)-ROW($B$5)+1),ROWS($B$2:B620)))),\"\")","v":""},{"$f":"IFERROR(VLOOKUP(B620,'بينات التلاميد'!$B$5:$G$56,6,0),\"\")","v":""}]
["",{"$f":"IFERROR(IF(ROWS($B$2:B621)>'بينات التلاميد'!$Q$5,\"\",INDEX('بينات التلاميد'!$B$5:$B$56,SMALL(IF('بينات التلاميد'!$B$5:$B$56<>\"\",ROW('بينات التلاميد'!$B$5:$B$56)-ROW($B$5)+1),ROWS($B$2:B621)))),\"\")","v":""},{"$f":"IFERROR(VLOOKUP(B621,'بينات التلاميد'!$B$5:$G$56,6,0),\"\")","v":""}]
["",{"$f":"IFERROR(IF(ROWS($B$2:B622)>'بينات التلاميد'!$Q$5,\"\",INDEX('بينات التلاميد'!$B$5:$B$56,SMALL(IF('بينات التلاميد'!$B$5:$B$56<>\"\",ROW('بينات التلاميد'!$B$5:$B$56)-ROW($B$5)+1),ROWS($B$2:B622)))),\"\")","v":""},{"$f":"IFERROR(VLOOKUP(B622,'بينات التلاميد'!$B$5:$G$56,6,0),\"\")","v":""}]
["",{"$f":"IFERROR(IF(ROWS($B$2:B623)>'بينات التلاميد'!$Q$5,\"\",INDEX('بينات التلاميد'!$B$5:$B$56,SMALL(IF('بينات التلاميد'!$B$5:$B$56<>\"\",ROW('بينات التلاميد'!$B$5:$B$56)-ROW($B$5)+1),ROWS($B$2:B623)))),\"\")","v":""},{"$f":"IFERROR(VLOOKUP(B623,'بينات التلاميد'!$B$5:$G$56,6,0),\"\")","v":""}]
["",{"$f":"IFERROR(IF(ROWS($B$2:B624)>'بينات التلاميد'!$Q$5,\"\",INDEX('بينات التلاميد'!$B$5:$B$56,SMALL(IF('بينات التلاميد'!$B$5:$B$56<>\"\",ROW('بينات التلاميد'!$B$5:$B$56)-ROW($B$5)+1),ROWS($B$2:B624)))),\"\")","v":""},{"$f":"IFERROR(VLOOKUP(B624,'بينات التلاميد'!$B$5:$G$56,6,0),\"\")","v":""}]
["",{"$f":"IFERROR(IF(ROWS($B$2:B625)>'بينات التلاميد'!$Q$5,\"\",INDEX('بينات التلاميد'!$B$5:$B$56,SMALL(IF('بينات التلاميد'!$B$5:$B$56<>\"\",ROW('بينات التلاميد'!$B$5:$B$56)-ROW($B$5)+1),ROWS($B$2:B625)))),\"\")","v":""},{"$f":"IFERROR(VLOOKUP(B625,'بينات التلاميد'!$B$5:$G$56,6,0),\"\")","v":""}]
["",{"$f":"IFERROR(IF(ROWS($B$2:B626)>'بينات التلاميد'!$Q$5,\"\",INDEX('بينات التلاميد'!$B$5:$B$56,SMALL(IF('بينات التلاميد'!$B$5:$B$56<>\"\",ROW('بينات التلاميد'!$B$5:$B$56)-ROW($B$5)+1),ROWS($B$2:B626)))),\"\")","v":""},{"$f":"IFERROR(VLOOKUP(B626,'بينات التلاميد'!$B$5:$G$56,6,0),\"\")","v":""}]
["",{"$f":"IFERROR(IF(ROWS($B$2:B627)>'بينات التلاميد'!$Q$5,\"\",INDEX('بينات التلاميد'!$B$5:$B$56,SMALL(IF('بينات التلاميد'!$B$5:$B$56<>\"\",ROW('بينات التلاميد'!$B$5:$B$56)-ROW($B$5)+1),ROWS($B$2:B627)))),\"\")","v":""},{"$f":"IFERROR(VLOOKUP(B627,'بينات التلاميد'!$B$5:$G$56,6,0),\"\")","v":""}]
["",{"$f":"IFERROR(IF(ROWS($B$2:B628)>'بينات التلاميد'!$Q$5,\"\",INDEX('بينات التلاميد'!$B$5:$B$56,SMALL(IF('بينات التلاميد'!$B$5:$B$56<>\"\",ROW('بينات التلاميد'!$B$5:$B$56)-ROW($B$5)+1),ROWS($B$2:B628)))),\"\")","v":""},{"$f":"IFERROR(VLOOKUP(B628,'بينات التلاميد'!$B$5:$G$56,6,0),\"\")","v":""}]
["",{"$f":"IFERROR(IF(ROWS($B$2:B629)>'بينات التلاميد'!$Q$5,\"\",INDEX('بينات التلاميد'!$B$5:$B$56,SMALL(IF('بينات التلاميد'!$B$5:$B$56<>\"\",ROW('بينات التلاميد'!$B$5:$B$56)-ROW($B$5)+1),ROWS($B$2:B629)))),\"\")","v":""},{"$f":"IFERROR(VLOOKUP(B629,'بينات التلاميد'!$B$5:$G$56,6,0),\"\")","v":""}]
["",{"$f":"IFERROR(IF(ROWS($B$2:B630)>'بينات التلاميد'!$Q$5,\"\",INDEX('بينات التلاميد'!$B$5:$B$56,SMALL(IF('بينات التلاميد'!$B$5:$B$56<>\"\",ROW('بينات التلاميد'!$B$5:$B$56)-ROW($B$5)+1),ROWS($B$2:B630)))),\"\")","v":""},{"$f":"IFERROR(VLOOKUP(B630,'بينات التلاميد'!$B$5:$G$56,6,0),\"\")","v":""}]
["",{"$f":"IFERROR(IF(ROWS($B$2:B631)>'بينات التلاميد'!$Q$5,\"\",INDEX('بينات التلاميد'!$B$5:$B$56,SMALL(IF('بينات التلاميد'!$B$5:$B$56<>\"\",ROW('بينات التلاميد'!$B$5:$B$56)-ROW($B$5)+1),ROWS($B$2:B631)))),\"\")","v":""},{"$f":"IFERROR(VLOOKUP(B631,'بينات التلاميد'!$B$5:$G$56,6,0),\"\")","v":""}]
["",{"$f":"IFERROR(IF(ROWS($B$2:B632)>'بينات التلاميد'!$Q$5,\"\",INDEX('بينات التلاميد'!$B$5:$B$56,SMALL(IF('بينات التلاميد'!$B$5:$B$56<>\"\",ROW('بينات التلاميد'!$B$5:$B$56)-ROW($B$5)+1),ROWS($B$2:B632)))),\"\")","v":""},{"$f":"IFERROR(VLOOKUP(B632,'بينات التلاميد'!$B$5:$G$56,6,0),\"\")","v":""}]
["",{"$f":"IFERROR(IF(ROWS($B$2:B633)>'بينات التلاميد'!$Q$5,\"\",INDEX('بينات التلاميد'!$B$5:$B$56,SMALL(IF('بينات التلاميد'!$B$5:$B$56<>\"\",ROW('بينات التلاميد'!$B$5:$B$56)-ROW($B$5)+1),ROWS($B$2:B633)))),\"\")","v":""},{"$f":"IFERROR(VLOOKUP(B633,'بينات التلاميد'!$B$5:$G$56,6,0),\"\")","v":""}]
["",{"$f":"IFERROR(IF(ROWS($B$2:B634)>'بينات التلاميد'!$Q$5,\"\",INDEX('بينات التلاميد'!$B$5:$B$56,SMALL(IF('بينات التلاميد'!$B$5:$B$56<>\"\",ROW('بينات التلاميد'!$B$5:$B$56)-ROW($B$5)+1),ROWS($B$2:B634)))),\"\")","v":""},{"$f":"IFERROR(VLOOKUP(B634,'بينات التلاميد'!$B$5:$G$56,6,0),\"\")","v":""}]
["",{"$f":"IFERROR(IF(ROWS($B$2:B635)>'بينات التلاميد'!$Q$5,\"\",INDEX('بينات التلاميد'!$B$5:$B$56,SMALL(IF('بينات التلاميد'!$B$5:$B$56<>\"\",ROW('بينات التلاميد'!$B$5:$B$56)-ROW($B$5)+1),ROWS($B$2:B635)))),\"\")","v":""},{"$f":"IFERROR(VLOOKUP(B635,'بينات التلاميد'!$B$5:$G$56,6,0),\"\")","v":""}]
["",{"$f":"IFERROR(IF(ROWS($B$2:B636)>'بينات التلاميد'!$Q$5,\"\",INDEX('بينات التلاميد'!$B$5:$B$56,SMALL(IF('بينات التلاميد'!$B$5:$B$56<>\"\",ROW('بينات التلاميد'!$B$5:$B$56)-ROW($B$5)+1),ROWS($B$2:B636)))),\"\")","v":""},{"$f":"IFERROR(VLOOKUP(B636,'بينات التلاميد'!$B$5:$G$56,6,0),\"\")","v":""}]
["",{"$f":"IFERROR(IF(ROWS($B$2:B637)>'بينات التلاميد'!$Q$5,\"\",INDEX('بينات التلاميد'!$B$5:$B$56,SMALL(IF('بينات التلاميد'!$B$5:$B$56<>\"\",ROW('بينات التلاميد'!$B$5:$B$56)-ROW($B$5)+1),ROWS($B$2:B637)))),\"\")","v":""},{"$f":"IFERROR(VLOOKUP(B637,'بينات التلاميد'!$B$5:$G$56,6,0),\"\")","v":""}]
["",{"$f":"IFERROR(IF(ROWS($B$2:B638)>'بينات التلاميد'!$Q$5,\"\",INDEX('بينات التلاميد'!$B$5:$B$56,SMALL(IF('بينات التلاميد'!$B$5:$B$56<>\"\",ROW('بينات التلاميد'!$B$5:$B$56)-ROW($B$5)+1),ROWS($B$2:B638)))),\"\")","v":""},{"$f":"IFERROR(VLOOKUP(B638,'بينات التلاميد'!$B$5:$G$56,6,0),\"\")","v":""}]
["",{"$f":"IFERROR(IF(ROWS($B$2:B639)>'بينات التلاميد'!$Q$5,\"\",INDEX('بينات التلاميد'!$B$5:$B$56,SMALL(IF('بينات التلاميد'!$B$5:$B$56<>\"\",ROW('بينات التلاميد'!$B$5:$B$56)-ROW($B$5)+1),ROWS($B$2:B639)))),\"\")","v":""},{"$f":"IFERROR(VLOOKUP(B639,'بينات التلاميد'!$B$5:$G$56,6,0),\"\")","v":""}]
["",{"$f":"IFERROR(IF(ROWS($B$2:B640)>'بينات التلاميد'!$Q$5,\"\",INDEX('بينات التلاميد'!$B$5:$B$56,SMALL(IF('بينات التلاميد'!$B$5:$B$56<>\"\",ROW('بينات التلاميد'!$B$5:$B$56)-ROW($B$5)+1),ROWS($B$2:B640)))),\"\")","v":""},{"$f":"IFERROR(VLOOKUP(B640,'بينات التلاميد'!$B$5:$G$56,6,0),\"\")","v":""}]
["",{"$f":"IFERROR(IF(ROWS($B$2:B641)>'بينات التلاميد'!$Q$5,\"\",INDEX('بينات التلاميد'!$B$5:$B$56,SMALL(IF('بينات التلاميد'!$B$5:$B$56<>\"\",ROW('بينات التلاميد'!$B$5:$B$56)-ROW($B$5)+1),ROWS($B$2:B641)))),\"\")","v":""},{"$f":"IFERROR(VLOOKUP(B641,'بينات التلاميد'!$B$5:$G$56,6,0),\"\")","v":""}]
[{"$f":"IFERROR(VLOOKUP(C642,$D$2:$E$20,2,0),\"\")","v":""},{"$f":"IFERROR(IF(ROWS($B$2:B642)>'بينات التلاميد'!$Q$5,\"\",INDEX('بينات التلاميد'!$B$5:$B$56,SMALL(IF('بينات التلاميد'!$B$5:$B$56<>\"\",ROW('بينات التلاميد'!$B$5:$B$56)-ROW($B$5)+1),ROWS($B$2:B642)))),\"\")","v":""},{"$f":"IFERROR(VLOOKUP(B642,'بينات التلاميد'!$B$5:$G$56,6,0),\"\")","v":""}]
["",{"$f":"IFERROR(IF(ROWS($B$2:B643)>'بينات التلاميد'!$Q$5,\"\",INDEX('بينات التلاميد'!$B$5:$B$56,SMALL(IF('بينات التلاميد'!$B$5:$B$56<>\"\",ROW('بينات التلاميد'!$B$5:$B$56)-ROW($B$5)+1),ROWS($B$2:B643)))),\"\")","v":""},{"$f":"IFERROR(VLOOKUP(B643,'بينات التلاميد'!$B$5:$G$56,6,0),\"\")","v":""}]
["",{"$f":"IFERROR(IF(ROWS($B$2:B644)>'بينات التلاميد'!$Q$5,\"\",INDEX('بينات التلاميد'!$B$5:$B$56,SMALL(IF('بينات التلاميد'!$B$5:$B$56<>\"\",ROW('بينات التلاميد'!$B$5:$B$56)-ROW($B$5)+1),ROWS($B$2:B644)))),\"\")","v":""},{"$f":"IFERROR(VLOOKUP(B644,'بينات التلاميد'!$B$5:$G$56,6,0),\"\")","v":""}]
["",{"$f":"IFERROR(IF(ROWS($B$2:B645)>'بينات التلاميد'!$Q$5,\"\",INDEX('بينات التلاميد'!$B$5:$B$56,SMALL(IF('بينات التلاميد'!$B$5:$B$56<>\"\",ROW('بينات التلاميد'!$B$5:$B$56)-ROW($B$5)+1),ROWS($B$2:B645)))),\"\")","v":""},{"$f":"IFERROR(VLOOKUP(B645,'بينات التلاميد'!$B$5:$G$56,6,0),\"\")","v":""}]
["",{"$f":"IFERROR(IF(ROWS($B$2:B646)>'بينات التلاميد'!$Q$5,\"\",INDEX('بينات التلاميد'!$B$5:$B$56,SMALL(IF('بينات التلاميد'!$B$5:$B$56<>\"\",ROW('بينات التلاميد'!$B$5:$B$56)-ROW($B$5)+1),ROWS($B$2:B646)))),\"\")","v":""},{"$f":"IFERROR(VLOOKUP(B646,'بينات التلاميد'!$B$5:$G$56,6,0),\"\")","v":""}]
["",{"$f":"IFERROR(IF(ROWS($B$2:B647)>'بينات التلاميد'!$Q$5,\"\",INDEX('بينات التلاميد'!$B$5:$B$56,SMALL(IF('بينات التلاميد'!$B$5:$B$56<>\"\",ROW('بينات التلاميد'!$B$5:$B$56)-ROW($B$5)+1),ROWS($B$2:B647)))),\"\")","v":""},{"$f":"IFERROR(VLOOKUP(B647,'بينات التلاميد'!$B$5:$G$56,6,0),\"\")","v":""}]
["",{"$f":"IFERROR(IF(ROWS($B$2:B648)>'بينات التلاميد'!$Q$5,\"\",INDEX('بينات التلاميد'!$B$5:$B$56,SMALL(IF('بينات التلاميد'!$B$5:$B$56<>\"\",ROW('بينات التلاميد'!$B$5:$B$56)-ROW($B$5)+1),ROWS($B$2:B648)))),\"\")","v":""},{"$f":"IFERROR(VLOOKUP(B648,'بينات التلاميد'!$B$5:$G$56,6,0),\"\")","v":""}]
["",{"$f":"IFERROR(IF(ROWS($B$2:B649)>'بينات التلاميد'!$Q$5,\"\",INDEX('بينات التلاميد'!$B$5:$B$56,SMALL(IF('بينات التلاميد'!$B$5:$B$56<>\"\",ROW('بينات التلاميد'!$B$5:$B$56)-ROW($B$5)+1),ROWS($B$2:B649)))),\"\")","v":""},{"$f":"IFERROR(VLOOKUP(B649,'بينات التلاميد'!$B$5:$G$56,6,0),\"\")","v":""}]
["",{"$f":"IFERROR(IF(ROWS($B$2:B650)>'بينات التلاميد'!$Q$5,\"\",INDEX('بينات التلاميد'!$B$5:$B$56,SMALL(IF('بينات التلاميد'!$B$5:$B$56<>\"\",ROW('بينات التلاميد'!$B$5:$B$56)-ROW($B$5)+1),ROWS($B$2:B650)))),\"\")","v":""},{"$f":"IFERROR(VLOOKUP(B650,'بينات التلاميد'!$B$5:$G$56,6,0),\"\")","v":""}]
[null,{"$f":"IFERROR(IF(ROWS($B$2:B651)>'بينات التلاميد'!$Q$5,\"\",INDEX('بينات التلاميد'!$B$5:$B$56,SMALL(IF('بينات التلاميد'!$B$5:$B$56<>\"\",ROW('بينات التلاميد'!$B$5:$B$56)-ROW($B$5)+1),ROWS($B$2:B651)))),\"\")","v":""},{"$f":"IFERROR(VLOOKUP(B651,'بينات التلاميد'!$B$5:$G$56,6,0),\"\")","v":""}]
[null,{"$f":"IFERROR(IF(ROWS($B$2:B652)>'بينات التلاميد'!$Q$5,\"\",INDEX('بينات التلاميد'!$B$5:$B$56,SMALL(IF('بينات التلاميد'!$B$5:$B$56<>\"\",ROW('بينات التلاميد'!$B$5:$B$56)-ROW($B$5)+1),ROWS($B$2:B652)))),\"\")","v":""},{"$f":"IFERROR(VLOOKUP(B652,'بينات التلاميد'!$B$5:$G$56,6,0),\"\")","v":""}]
[null,{"$f":"IFERROR(IF(ROWS($B$2:B653)>'بينات التلاميد'!$Q$5,\"\",INDEX('بينات التلاميد'!$B$5:$B$56,SMALL(IF('بينات التلاميد'!$B$5:$B$56<>\"\",ROW('بينات التلاميد'!$B$5:$B$56)-ROW($B$5)+1),ROWS($B$2:B653)))),\"\")","v":""},{"$f":"IFERROR(VLOOKUP(B653,'بينات التلاميد'!$B$5:$G$56,6,0),\"\")","v":""}]
[null,{"$f":"IFERROR(IF(ROWS($B$2:B654)>'بينات التلاميد'!$Q$5,\"\",INDEX('بينات التلاميد'!$B$5:$B$56,SMALL(IF('بينات التلاميد'!$B$5:$B$56<>\"\",ROW('بينات التلاميد'!$B$5:$B$56)-ROW($B$5)+1),ROWS($B$2:B654)))),\"\")","v":""},{"$f":"IFERROR(VLOOKUP(B654,'بينات التلاميد'!$B$5:$G$56,6,0),\"\")","v":""}]
[null,{"$f":"IFERROR(IF(ROWS($B$2:B655)>'بينات التلاميد'!$Q$5,\"\",INDEX('بينات التلاميد'!$B$5:$B$56,SMALL(IF('بينات التلاميد'!$B$5:$B$56<>\"\",ROW('بينات التلاميد'!$B$5:$B$56)-ROW($B$5)+1),ROWS($B$2:B655)))),\"\")","v":""},{"$f":"IFERROR(VLOOKUP(B655,'بينات التلاميد'!$B$5:$G$56,6,0),\"\")","v":""}]
[null,{"$f":"IFERROR(IF(ROWS($B$2:B656)>'بينات التلاميد'!$Q$5,\"\",INDEX('بينات التلاميد'!$B$5:$B$56,SMALL(IF('بينات التلاميد'!$B$5:$B$56<>\"\",ROW('بينات التلاميد'!$B$5:$B$56)-ROW($B$5)+1),ROWS($B$2:B656)))),\"\")","v":""},{"$f":"IFERROR(VLOOKUP(B656,'بينات التلاميد'!$B$5:$G$56,6,0),\"\")","v":""}]
[null,{"$f":"IFERROR(IF(ROWS($B$2:B657)>'بينات التلاميد'!$Q$5,\"\",INDEX('بينات التلاميد'!$B$5:$B$56,SMALL(IF('بينات التلاميد'!$B$5:$B$56<>\"\",ROW('بينات التلاميد'!$B$5:$B$56)-ROW($B$5)+1),ROWS($B$2:B657)))),\"\")","v":""},{"$f":"IFERROR(VLOOKUP(B657,'بينات التلاميد'!$B$5:$G$56,6,0),\"\")","v":""}]
[null,{"$f":"IFERROR(IF(ROWS($B$2:B658)>'بينات التلاميد'!$Q$5,\"\",INDEX('بينات التلاميد'!$B$5:$B$56,SMALL(IF('بينات التلاميد'!$B$5:$B$56<>\"\",ROW('بينات التلاميد'!$B$5:$B$56)-ROW($B$5)+1),ROWS($B$2:B658)))),\"\")","v":""},{"$f":"IFERROR(VLOOKUP(B658,'بينات التلاميد'!$B$5:$G$56,6,0),\"\")","v":""}]
[null,{"$f":"IFERROR(IF(ROWS($B$2:B659)>'بينات التلاميد'!$Q$5,\"\",INDEX('بينات التلاميد'!$B$5:$B$56,SMALL(IF('بينات التلاميد'!$B$5:$B$56<>\"\",ROW('بينات التلاميد'!$B$5:$B$56)-ROW($B$5)+1),ROWS($B$2:B659)))),\"\")","v":""},{"$f":"IFERROR(VLOOKUP(B659,'بينات التلاميد'!$B$5:$G$56,6,0),\"\")","v":""}]
[null,{"$f":"IFERROR(IF(ROWS($B$2:B660)>'بينات التلاميد'!$Q$5,\"\",INDEX('بينات التلاميد'!$B$5:$B$56,SMALL(IF('بينات التلاميد'!$B$5:$B$56<>\"\",ROW('بينات التلاميد'!$B$5:$B$56)-ROW($B$5)+1),ROWS($B$2:B660)))),\"\")","v":""},{"$f":"IFERROR(VLOOKUP(B660,'بينات التلاميد'!$B$5:$G$56,6,0),\"\")","v":""}]
[null,{"$f":"IFERROR(IF(ROWS($B$2:B661)>'بينات التلاميد'!$Q$5,\"\",INDEX('بينات التلاميد'!$B$5:$B$56,SMALL(IF('بينات التلاميد'!$B$5:$B$56<>\"\",ROW('بينات التلاميد'!$B$5:$B$56)-ROW($B$5)+1),ROWS($B$2:B661)))),\"\")","v":""},{"$f":"IFERROR(VLOOKUP(B661,'بينات التلاميد'!$B$5:$G$56,6,0),\"\")","v":""}]
[null,{"$f":"IFERROR(IF(ROWS($B$2:B662)>'بينات التلاميد'!$Q$5,\"\",INDEX('بينات التلاميد'!$B$5:$B$56,SMALL(IF('بينات التلاميد'!$B$5:$B$56<>\"\",ROW('بينات التلاميد'!$B$5:$B$56)-ROW($B$5)+1),ROWS($B$2:B662)))),\"\")","v":""},{"$f":"IFERROR(VLOOKUP(B662,'بينات التلاميد'!$B$5:$G$56,6,0),\"\")","v":""}]
[null,{"$f":"IFERROR(IF(ROWS($B$2:B663)>'بينات التلاميد'!$Q$5,\"\",INDEX('بينات التلاميد'!$B$5:$B$56,SMALL(IF('بينات التلاميد'!$B$5:$B$56<>\"\",ROW('بينات التلاميد'!$B$5:$B$56)-ROW($B$5)+1),ROWS($B$2:B663)))),\"\")","v":""},{"$f":"IFERROR(VLOOKUP(B663,'بينات التلاميد'!$B$5:$G$56,6,0),\"\")","v":""}]
[null,{"$f":"IFERROR(IF(ROWS($B$2:B664)>'بينات التلاميد'!$Q$5,\"\",INDEX('بينات التلاميد'!$B$5:$B$56,SMALL(IF('بينات التلاميد'!$B$5:$B$56<>\"\",ROW('بينات التلاميد'!$B$5:$B$56)-ROW($B$5)+1),ROWS($B$2:B664)))),\"\")","v":""},{"$f":"IFERROR(VLOOKUP(B664,'بينات التلاميد'!$B$5:$G$56,6,0),\"\")","v":""}]
[null,{"$f":"IFERROR(IF(ROWS($B$2:B665)>'بينات التلاميد'!$Q$5,\"\",INDEX('بينات التلاميد'!$B$5:$B$56,SMALL(IF('بينات التلاميد'!$B$5:$B$56<>\"\",ROW('بينات التلاميد'!$B$5:$B$56)-ROW($B$5)+1),ROWS($B$2:B665)))),\"\")","v":""},{"$f":"IFERROR(VLOOKUP(B665,'بينات التلاميد'!$B$5:$G$56,6,0),\"\")","v":""}]
[null,{"$f":"IFERROR(IF(ROWS($B$2:B666)>'بينات التلاميد'!$Q$5,\"\",INDEX('بينات التلاميد'!$B$5:$B$56,SMALL(IF('بينات التلاميد'!$B$5:$B$56<>\"\",ROW('بينات التلاميد'!$B$5:$B$56)-ROW($B$5)+1),ROWS($B$2:B666)))),\"\")","v":""},{"$f":"IFERROR(VLOOKUP(B666,'بينات التلاميد'!$B$5:$G$56,6,0),\"\")","v":""}]
[null,{"$f":"IFERROR(IF(ROWS($B$2:B667)>'بينات التلاميد'!$Q$5,\"\",INDEX('بينات التلاميد'!$B$5:$B$56,SMALL(IF('بينات التلاميد'!$B$5:$B$56<>\"\",ROW('بينات التلاميد'!$B$5:$B$56)-ROW($B$5)+1),ROWS($B$2:B667)))),\"\")","v":""},{"$f":"IFERROR(VLOOKUP(B667,'بينات التلاميد'!$B$5:$G$56,6,0),\"\")","v":""}]
[null,{"$f":"IFERROR(IF(ROWS($B$2:B668)>'بينات التلاميد'!$Q$5,\"\",INDEX('بينات التلاميد'!$B$5:$B$56,SMALL(IF('بينات التلاميد'!$B$5:$B$56<>\"\",ROW('بينات التلاميد'!$B$5:$B$56)-ROW($B$5)+1),ROWS($B$2:B668)))),\"\")","v":""},{"$f":"IFERROR(VLOOKUP(B668,'بينات التلاميد'!$B$5:$G$56,6,0),\"\")","v":""}]
[null,{"$f":"IFERROR(IF(ROWS($B$2:B669)>'بينات التلاميد'!$Q$5,\"\",INDEX('بينات التلاميد'!$B$5:$B$56,SMALL(IF('بينات التلاميد'!$B$5:$B$56<>\"\",ROW('بينات التلاميد'!$B$5:$B$56)-ROW($B$5)+1),ROWS($B$2:B669)))),\"\")","v":""},{"$f":"IFERROR(VLOOKUP(B669,'بينات التلاميد'!$B$5:$G$56,6,0),\"\")","v":""}]
[null,{"$f":"IFERROR(IF(ROWS($B$2:B670)>'بينات التلاميد'!$Q$5,\"\",INDEX('بينات التلاميد'!$B$5:$B$56,SMALL(IF('بينات التلاميد'!$B$5:$B$56<>\"\",ROW('بينات التلاميد'!$B$5:$B$56)-ROW($B$5)+1),ROWS($B$2:B670)))),\"\")","v":""},{"$f":"IFERROR(VLOOKUP(B670,'بينات التلاميد'!$B$5:$G$56,6,0),\"\")","v":""}]
[null,{"$f":"IFERROR(IF(ROWS($B$2:B671)>'بينات التلاميد'!$Q$5,\"\",INDEX('بينات التلاميد'!$B$5:$B$56,SMALL(IF('بينات التلاميد'!$B$5:$B$56<>\"\",ROW('بينات التلاميد'!$B$5:$B$56)-ROW($B$5)+1),ROWS($B$2:B671)))),\"\")","v":""},{"$f":"IFERROR(VLOOKUP(B671,'بينات التلاميد'!$B$5:$G$56,6,0),\"\")","v":""}]
[null,{"$f":"IFERROR(IF(ROWS($B$2:B672)>'بينات التلاميد'!$Q$5,\"\",INDEX('بينات التلاميد'!$B$5:$B$56,SMALL(IF('بينات التلاميد'!$B$5:$B$56<>\"\",ROW('بينات التلاميد'!$B$5:$B$56)-ROW($B$5)+1),ROWS($B$2:B672)))),\"\")","v":""},{"$f":"IFERROR(VLOOKUP(B672,'بينات التلاميد'!$B$5:$G$56,6,0),\"\")","v":""}]
[null,{"$f":"IFERROR(IF(ROWS($B$2:B673)>'بينات التلاميد'!$Q$5,\"\",INDEX('بينات التلاميد'!$B$5:$B$56,SMALL(IF('بينات التلاميد'!$B$5:$B$56<>\"\",ROW('بينات التلاميد'!$B$5:$B$56)-ROW($B$5)+1),ROWS($B$2:B673)))),\"\")","v":""},{"$f":"IFERROR(VLOOKUP(B673,'بينات التلاميد'!$B$5:$G$56,6,0),\"\")","v":""}]
[null,{"$f":"IFERROR(IF(ROWS($B$2:B674)>'بينات التلاميد'!$Q$5,\"\",INDEX('بينات التلاميد'!$B$5:$B$56,SMALL(IF('بينات التلاميد'!$B$5:$B$56<>\"\",ROW('بينات التلاميد'!$B$5:$B$56)-ROW($B$5)+1),ROWS($B$2:B674)))),\"\")","v":""},{"$f":"IFERROR(VLOOKUP(B674,'بينات التلاميد'!$B$5:$G$56,6,0),\"\")","v":""}]
[null,{"$f":"IFERROR(IF(ROWS($B$2:B675)>'بينات التلاميد'!$Q$5,\"\",INDEX('بينات التلاميد'!$B$5:$B$56,SMALL(IF('بينات التلاميد'!$B$5:$B$56<>\"\",ROW('بينات التلاميد'!$B$5:$B$56)-ROW($B$5)+1),ROWS($B$2:B675)))),\"\")","v":""},{"$f":"IFERROR(VLOOKUP(B675,'بينات التلاميد'!$B$5:$G$56,6,0),\"\")","v":""}]
[null,{"$f":"IFERROR(IF(ROWS($B$2:B676)>'بينات التلاميد'!$Q$5,\"\",INDEX('بينات التلاميد'!$B$5:$B$56,SMALL(IF('بينات التلاميد'!$B$5:$B$56<>\"\",ROW('بينات التلاميد'!$B$5:$B$56)-ROW($B$5)+1),ROWS($B$2:B676)))),\"\")","v":""},{"$f":"IFERROR(VLOOKUP(B676,'بينات التلاميد'!$B$5:$G$56,6,0),\"\")","v":""}]
[null,{"$f":"IFERROR(IF(ROWS($B$2:B677)>'بينات التلاميد'!$Q$5,\"\",INDEX('بينات التلاميد'!$B$5:$B$56,SMALL(IF('بينات التلاميد'!$B$5:$B$56<>\"\",ROW('بينات التلاميد'!$B$5:$B$56)-ROW($B$5)+1),ROWS($B$2:B677)))),\"\")","v":""},{"$f":"IFERROR(VLOOKUP(B677,'بينات التلاميد'!$B$5:$G$56,6,0),\"\")","v":""}]
[null,{"$f":"IFERROR(IF(ROWS($B$2:B678)>'بينات التلاميد'!$Q$5,\"\",INDEX('بينات التلاميد'!$B$5:$B$56,SMALL(IF('بينات التلاميد'!$B$5:$B$56<>\"\",ROW('بينات التلاميد'!$B$5:$B$56)-ROW($B$5)+1),ROWS($B$2:B678)))),\"\")","v":""},{"$f":"IFERROR(VLOOKUP(B678,'بينات التلاميد'!$B$5:$G$56,6,0),\"\")","v":""}]
[null,{"$f":"IFERROR(IF(ROWS($B$2:B679)>'بينات التلاميد'!$Q$5,\"\",INDEX('بينات التلاميد'!$B$5:$B$56,SMALL(IF('بينات التلاميد'!$B$5:$B$56<>\"\",ROW('بينات التلاميد'!$B$5:$B$56)-ROW($B$5)+1),ROWS($B$2:B679)))),\"\")","v":""},{"$f":"IFERROR(VLOOKUP(B679,'بينات التلاميد'!$B$5:$G$56,6,0),\"\")","v":""}]
[null,{"$f":"IFERROR(IF(ROWS($B$2:B680)>'بينات التلاميد'!$Q$5,\"\",INDEX('بينات التلاميد'!$B$5:$B$56,SMALL(IF('بينات التلاميد'!$B$5:$B$56<>\"\",ROW('بينات التلاميد'!$B$5:$B$56)-ROW($B$5)+1),ROWS($B$2:B680)))),\"\")","v":""},{"$f":"IFERROR(VLOOKUP(B680,'بينات التلاميد'!$B$5:$G$56,6,0),\"\")","v":""}]
[null,{"$f":"IFERROR(IF(ROWS($B$2:B681)>'بينات التلاميد'!$Q$5,\"\",INDEX('بينات التلاميد'!$B$5:$B$56,SMALL(IF('بينات التلاميد'!$B$5:$B$56<>\"\",ROW('بينات التلاميد'!$B$5:$B$56)-ROW($B$5)+1),ROWS($B$2:B681)))),\"\")","v":""},{"$f":"IFERROR(VLOOKUP(B681,'بينات التلاميد'!$B$5:$G$56,6,0),\"\")","v":""}]
[null,{"$f":"IFERROR(IF(ROWS($B$2:B682)>'بينات التلاميد'!$Q$5,\"\",INDEX('بينات التلاميد'!$B$5:$B$56,SMALL(IF('بينات التلاميد'!$B$5:$B$56<>\"\",ROW('بينات التلاميد'!$B$5:$B$56)-ROW($B$5)+1),ROWS($B$2:B682)))),\"\")","v":""},{"$f":"IFERROR(VLOOKUP(B682,'بينات التلاميد'!$B$5:$G$56,6,0),\"\")","v":""}]
[null,{"$f":"IFERROR(IF(ROWS($B$2:B683)>'بينات التلاميد'!$Q$5,\"\",INDEX('بينات التلاميد'!$B$5:$B$56,SMALL(IF('بينات التلاميد'!$B$5:$B$56<>\"\",ROW('بينات التلاميد'!$B$5:$B$56)-ROW($B$5)+1),ROWS($B$2:B683)))),\"\")","v":""},{"$f":"IFERROR(VLOOKUP(B683,'بينات التلاميد'!$B$5:$G$56,6,0),\"\")","v":""}]
[null,{"$f":"IFERROR(IF(ROWS($B$2:B684)>'بينات التلاميد'!$Q$5,\"\",INDEX('بينات التلاميد'!$B$5:$B$56,SMALL(IF('بينات التلاميد'!$B$5:$B$56<>\"\",ROW('بينات التلاميد'!$B$5:$B$56)-ROW($B$5)+1),ROWS($B$2:B684)))),\"\")","v":""},{"$f":"IFERROR(VLOOKUP(B684,'بينات التلاميد'!$B$5:$G$56,6,0),\"\")","v":""}]
[null,{"$f":"IFERROR(IF(ROWS($B$2:B685)>'بينات التلاميد'!$Q$5,\"\",INDEX('بينات التلاميد'!$B$5:$B$56,SMALL(IF('بينات التلاميد'!$B$5:$B$56<>\"\",ROW('بينات التلاميد'!$B$5:$B$56)-ROW($B$5)+1),ROWS($B$2:B685)))),\"\")","v":""},{"$f":"IFERROR(VLOOKUP(B685,'بينات التلاميد'!$B$5:$G$56,6,0),\"\")","v":""}]
[null,{"$f":"IFERROR(IF(ROWS($B$2:B686)>'بينات التلاميد'!$Q$5,\"\",INDEX('بينات التلاميد'!$B$5:$B$56,SMALL(IF('بينات التلاميد'!$B$5:$B$56<>\"\",ROW('بينات التلاميد'!$B$5:$B$56)-ROW($B$5)+1),ROWS($B$2:B686)))),\"\")","v":""},{"$f":"IFERROR(VLOOKUP(B686,'بينات التلاميد'!$B$5:$G$56,6,0),\"\")","v":""}]
[null,{"$f":"IFERROR(IF(ROWS($B$2:B687)>'بينات التلاميد'!$Q$5,\"\",INDEX('بينات التلاميد'!$B$5:$B$56,SMALL(IF('بينات التلاميد'!$B$5:$B$56<>\"\",ROW('بينات التلاميد'!$B$5:$B$56)-ROW($B$5)+1),ROWS($B$2:B687)))),\"\")","v":""},{"$f":"IFERROR(VLOOKUP(B687,'بينات التلاميد'!$B$5:$G$56,6,0),\"\")","v":""}]
[null,{"$f":"IF(ROWS($B$2:B688)>'بينات التلاميد'!$Q$5,\"\",INDEX('بينات التلاميد'!$B$5:$B$56,SMALL(IF('بينات التلاميد'!$B$5:$B$56<>\"\",ROW('بينات التلاميد'!$B$5:$B$56)-ROW($B$5)+1),ROWS($B$2:B688))))","v":""},{"$f":"IFERROR(VLOOKUP(B688,'بينات التلاميد'!$B$5:$G$56,6,0),\"\")","v":""}]
[null,{"$f":"IF(ROWS($B$2:B689)>'بينات التلاميد'!$Q$5,\"\",INDEX('بينات التلاميد'!$B$5:$B$56,SMALL(IF('بينات التلاميد'!$B$5:$B$56<>\"\",ROW('بينات التلاميد'!$B$5:$B$56)-ROW($B$5)+1),ROWS($B$2:B689))))","v":""},{"$f":"IFERROR(VLOOKUP(B689,'بينات التلاميد'!$B$5:$G$56,6,0),\"\")","v":""}]
[null,{"$f":"IF(ROWS($B$2:B690)>'بينات التلاميد'!$Q$5,\"\",INDEX('بينات التلاميد'!$B$5:$B$56,SMALL(IF('بينات التلاميد'!$B$5:$B$56<>\"\",ROW('بينات التلاميد'!$B$5:$B$56)-ROW($B$5)+1),ROWS($B$2:B690))))","v":""},{"$f":"IFERROR(VLOOKUP(B690,'بينات التلاميد'!$B$5:$G$56,6,0),\"\")","v":""}]
[null,{"$f":"IF(ROWS($B$2:B691)>'بينات التلاميد'!$Q$5,\"\",INDEX('بينات التلاميد'!$B$5:$B$56,SMALL(IF('بينات التلاميد'!$B$5:$B$56<>\"\",ROW('بينات التلاميد'!$B$5:$B$56)-ROW($B$5)+1),ROWS($B$2:B691))))","v":""},{"$f":"IFERROR(VLOOKUP(B691,'بينات التلاميد'!$B$5:$G$56,6,0),\"\")","v":""}]
[null,{"$f":"IF(ROWS($B$2:B692)>'بينات التلاميد'!$Q$5,\"\",INDEX('بينات التلاميد'!$B$5:$B$56,SMALL(IF('بينات التلاميد'!$B$5:$B$56<>\"\",ROW('بينات التلاميد'!$B$5:$B$56)-ROW($B$5)+1),ROWS($B$2:B692))))","v":""},{"$f":"IFERROR(VLOOKUP(B692,'بينات التلاميد'!$B$5:$G$56,6,0),\"\")","v":""}]
[null,{"$f":"IF(ROWS($B$2:B693)>'بينات التلاميد'!$Q$5,\"\",INDEX('بينات التلاميد'!$B$5:$B$56,SMALL(IF('بينات التلاميد'!$B$5:$B$56<>\"\",ROW('بينات التلاميد'!$B$5:$B$56)-ROW($B$5)+1),ROWS($B$2:B693))))","v":""},{"$f":"IFERROR(VLOOKUP(B693,'بينات التلاميد'!$B$5:$G$56,6,0),\"\")","v":""}]
[null,{"$f":"IF(ROWS($B$2:B694)>'بينات التلاميد'!$Q$5,\"\",INDEX('بينات التلاميد'!$B$5:$B$56,SMALL(IF('بينات التلاميد'!$B$5:$B$56<>\"\",ROW('بينات التلاميد'!$B$5:$B$56)-ROW($B$5)+1),ROWS($B$2:B694))))","v":""},{"$f":"IFERROR(VLOOKUP(B694,'بينات التلاميد'!$B$5:$G$56,6,0),\"\")","v":""}]
[null,{"$f":"IF(ROWS($B$2:B695)>'بينات التلاميد'!$Q$5,\"\",INDEX('بينات التلاميد'!$B$5:$B$56,SMALL(IF('بينات التلاميد'!$B$5:$B$56<>\"\",ROW('بينات التلاميد'!$B$5:$B$56)-ROW($B$5)+1),ROWS($B$2:B695))))","v":""},{"$f":"IFERROR(VLOOKUP(B695,'بينات التلاميد'!$B$5:$G$56,6,0),\"\")","v":""}]
[null,{"$f":"IF(ROWS($B$2:B696)>'بينات التلاميد'!$Q$5,\"\",INDEX('بينات التلاميد'!$B$5:$B$56,SMALL(IF('بينات التلاميد'!$B$5:$B$56<>\"\",ROW('بينات التلاميد'!$B$5:$B$56)-ROW($B$5)+1),ROWS($B$2:B696))))","v":""},{"$f":"IFERROR(VLOOKUP(B696,'بينات التلاميد'!$B$5:$G$56,6,0),\"\")","v":""}]
[null,{"$f":"IF(ROWS($B$2:B697)>'بينات التلاميد'!$Q$5,\"\",INDEX('بينات التلاميد'!$B$5:$B$56,SMALL(IF('بينات التلاميد'!$B$5:$B$56<>\"\",ROW('بينات التلاميد'!$B$5:$B$56)-ROW($B$5)+1),ROWS($B$2:B697))))","v":""},{"$f":"IFERROR(VLOOKUP(B697,'بينات التلاميد'!$B$5:$G$56,6,0),\"\")","v":""}]
[null,{"$f":"IF(ROWS($B$2:B698)>'بينات التلاميد'!$Q$5,\"\",INDEX('بينات التلاميد'!$B$5:$B$56,SMALL(IF('بينات التلاميد'!$B$5:$B$56<>\"\",ROW('بينات التلاميد'!$B$5:$B$56)-ROW($B$5)+1),ROWS($B$2:B698))))","v":""},{"$f":"IFERROR(VLOOKUP(B698,'بينات التلاميد'!$B$5:$G$56,6,0),\"\")","v":""}]
[null,{"$f":"IF(ROWS($B$2:B699)>'بينات التلاميد'!$Q$5,\"\",INDEX('بينات التلاميد'!$B$5:$B$56,SMALL(IF('بينات التلاميد'!$B$5:$B$56<>\"\",ROW('بينات التلاميد'!$B$5:$B$56)-ROW($B$5)+1),ROWS($B$2:B699))))","v":""},{"$f":"IFERROR(VLOOKUP(B699,'بينات التلاميد'!$B$5:$G$56,6,0),\"\")","v":""}]
[null,{"$f":"IF(ROWS($B$2:B700)>'بينات التلاميد'!$Q$5,\"\",INDEX('بينات التلاميد'!$B$5:$B$56,SMALL(IF('بينات التلاميد'!$B$5:$B$56<>\"\",ROW('بينات التلاميد'!$B$5:$B$56)-ROW($B$5)+1),ROWS($B$2:B700))))","v":""},{"$f":"IFERROR(VLOOKUP(B700,'بينات التلاميد'!$B$5:$G$56,6,0),\"\")","v":""}]
[null,{"$f":"IF(ROWS($B$2:B701)>'بينات التلاميد'!$Q$5,\"\",INDEX('بينات التلاميد'!$B$5:$B$56,SMALL(IF('بينات التلاميد'!$B$5:$B$56<>\"\",ROW('بينات التلاميد'!$B$5:$B$56)-ROW($B$5)+1),ROWS($B$2:B701))))","v":""},{"$f":"IFERROR(VLOOKUP(B701,'بينات التلاميد'!$B$5:$G$56,6,0),\"\")","v":""}]
[null,{"$f":"IF(ROWS($B$2:B702)>'بينات التلاميد'!$Q$5,\"\",INDEX('بينات التلاميد'!$B$5:$B$56,SMALL(IF('بينات التلاميد'!$B$5:$B$56<>\"\",ROW('بينات التلاميد'!$B$5:$B$56)-ROW($B$5)+1),ROWS($B$2:B702))))","v":""},{"$f":"IFERROR(VLOOKUP(B702,'بينات التلاميد'!$B$5:$G$56,6,0),\"\")","v":""}]
[null,{"$f":"IF(ROWS($B$2:B703)>'بينات التلاميد'!$Q$5,\"\",INDEX('بينات التلاميد'!$B$5:$B$56,SMALL(IF('بينات التلاميد'!$B$5:$B$56<>\"\",ROW('بينات التلاميد'!$B$5:$B$56)-ROW($B$5)+1),ROWS($B$2:B703))))","v":""},{"$f":"IFERROR(VLOOKUP(B703,'بينات التلاميد'!$B$5:$G$56,6,0),\"\")","v":""}]
[null,{"$f":"IF(ROWS($B$2:B704)>'بينات التلاميد'!$Q$5,\"\",INDEX('بينات التلاميد'!$B$5:$B$56,SMALL(IF('بينات التلاميد'!$B$5:$B$56<>\"\",ROW('بينات التلاميد'!$B$5:$B$56)-ROW($B$5)+1),ROWS($B$2:B704))))","v":""},{"$f":"IFERROR(VLOOKUP(B704,'بينات التلاميد'!$B$5:$G$56,6,0),\"\")","v":""}]
[null,{"$f":"IF(ROWS($B$2:B705)>'بينات التلاميد'!$Q$5,\"\",INDEX('بينات التلاميد'!$B$5:$B$56,SMALL(IF('بينات التلاميد'!$B$5:$B$56<>\"\",ROW('بينات التلاميد'!$B$5:$B$56)-ROW($B$5)+1),ROWS($B$2:B705))))","v":""},{"$f":"IFERROR(VLOOKUP(B705,'بينات التلاميد'!$B$5:$G$56,6,0),\"\")","v":""}]
[null,{"$f":"IF(ROWS($B$2:B706)>'بينات التلاميد'!$Q$5,\"\",INDEX('بينات التلاميد'!$B$5:$B$56,SMALL(IF('بينات التلاميد'!$B$5:$B$56<>\"\",ROW('بينات التلاميد'!$B$5:$B$56)-ROW($B$5)+1),ROWS($B$2:B706))))","v":""},{"$f":"IFERROR(VLOOKUP(B706,'بينات التلاميد'!$B$5:$G$56,6,0),\"\")","v":""}]
[null,{"$f":"IF(ROWS($B$2:B707)>'بينات التلاميد'!$Q$5,\"\",INDEX('بينات التلاميد'!$B$5:$B$56,SMALL(IF('بينات التلاميد'!$B$5:$B$56<>\"\",ROW('بينات التلاميد'!$B$5:$B$56)-ROW($B$5)+1),ROWS($B$2:B707))))","v":""},{"$f":"IFERROR(VLOOKUP(B707,'بينات التلاميد'!$B$5:$G$56,6,0),\"\")","v":""}]
[null,{"$f":"IF(ROWS($B$2:B708)>'بينات التلاميد'!$Q$5,\"\",INDEX('بينات التلاميد'!$B$5:$B$56,SMALL(IF('بينات التلاميد'!$B$5:$B$56<>\"\",ROW('بينات التلاميد'!$B$5:$B$56)-ROW($B$5)+1),ROWS($B$2:B708))))","v":""},{"$f":"IFERROR(VLOOKUP(B708,'بينات التلاميد'!$B$5:$G$56,6,0),\"\")","v":""}]
[null,{"$f":"IF(ROWS($B$2:B709)>'بينات التلاميد'!$Q$5,\"\",INDEX('بينات التلاميد'!$B$5:$B$56,SMALL(IF('بينات التلاميد'!$B$5:$B$56<>\"\",ROW('بينات التلاميد'!$B$5:$B$56)-ROW($B$5)+1),ROWS($B$2:B709))))","v":""},{"$f":"IFERROR(VLOOKUP(B709,'بينات التلاميد'!$B$5:$G$56,6,0),\"\")","v":""}]
[null,{"$f":"IF(ROWS($B$2:B710)>'بينات التلاميد'!$Q$5,\"\",INDEX('بينات التلاميد'!$B$5:$B$56,SMALL(IF('بينات التلاميد'!$B$5:$B$56<>\"\",ROW('بينات التلاميد'!$B$5:$B$56)-ROW($B$5)+1),ROWS($B$2:B710))))","v":""},{"$f":"IFERROR(VLOOKUP(B710,'بينات التلاميد'!$B$5:$G$56,6,0),\"\")","v":""}]
[null,{"$f":"IF(ROWS($B$2:B711)>'بينات التلاميد'!$Q$5,\"\",INDEX('بينات التلاميد'!$B$5:$B$56,SMALL(IF('بينات التلاميد'!$B$5:$B$56<>\"\",ROW('بينات التلاميد'!$B$5:$B$56)-ROW($B$5)+1),ROWS($B$2:B711))))","v":""},{"$f":"IFERROR(VLOOKUP(B711,'بينات التلاميد'!$B$5:$G$56,6,0),\"\")","v":""}]
[null,{"$f":"IF(ROWS($B$2:B712)>'بينات التلاميد'!$Q$5,\"\",INDEX('بينات التلاميد'!$B$5:$B$56,SMALL(IF('بينات التلاميد'!$B$5:$B$56<>\"\",ROW('بينات التلاميد'!$B$5:$B$56)-ROW($B$5)+1),ROWS($B$2:B712))))","v":""},{"$f":"IFERROR(VLOOKUP(B712,'بينات التلاميد'!$B$5:$G$56,6,0),\"\")","v":""}]
[null,{"$f":"IF(ROWS($B$2:B713)>'بينات التلاميد'!$Q$5,\"\",INDEX('بينات التلاميد'!$B$5:$B$56,SMALL(IF('بينات التلاميد'!$B$5:$B$56<>\"\",ROW('بينات التلاميد'!$B$5:$B$56)-ROW($B$5)+1),ROWS($B$2:B713))))","v":""},{"$f":"IFERROR(VLOOKUP(B713,'بينات التلاميد'!$B$5:$G$56,6,0),\"\")","v":""}]
[null,{"$f":"IF(ROWS($B$2:B714)>'بينات التلاميد'!$Q$5,\"\",INDEX('بينات التلاميد'!$B$5:$B$56,SMALL(IF('بينات التلاميد'!$B$5:$B$56<>\"\",ROW('بينات التلاميد'!$B$5:$B$56)-ROW($B$5)+1),ROWS($B$2:B714))))","v":""}]
[null,{"$f":"IF(ROWS($B$2:B715)>'بينات التلاميد'!$Q$5,\"\",INDEX('بينات التلاميد'!$B$5:$B$56,SMALL(IF('بينات التلاميد'!$B$5:$B$56<>\"\",ROW('بينات التلاميد'!$B$5:$B$56)-ROW($B$5)+1),ROWS($B$2:B715))))","v":""}]
[null,{"$f":"IF(ROWS($B$2:B716)>'بينات التلاميد'!$Q$5,\"\",INDEX('بينات التلاميد'!$B$5:$B$56,SMALL(IF('بينات التلاميد'!$B$5:$B$56<>\"\",ROW('بينات التلاميد'!$B$5:$B$56)-ROW($B$5)+1),ROWS($B$2:B716))))","v":""}]
[null,{"$f":"IF(ROWS($B$2:B717)>'بينات التلاميد'!$Q$5,\"\",INDEX('بينات التلاميد'!$B$5:$B$56,SMALL(IF('بينات التلاميد'!$B$5:$B$56<>\"\",ROW('بينات التلاميد'!$B$5:$B$56)-ROW($B$5)+1),ROWS($B$2:B717))))","v":""}]
[null,{"$f":"IF(ROWS($B$2:B718)>'بينات التلاميد'!$Q$5,\"\",INDEX('بينات التلاميد'!$B$5:$B$56,SMALL(IF('بينات التلاميد'!$B$5:$B$56<>\"\",ROW('بينات التلاميد'!$B$5:$B$56)-ROW($B$5)+1),ROWS($B$2:B718))))","v":""}]
[null,{"$f":"IF(ROWS($B$2:B719)>'بينات التلاميد'!$Q$5,\"\",INDEX('بينات التلاميد'!$B$5:$B$56,SMALL(IF('بينات التلاميد'!$B$5:$B$56<>\"\",ROW('بينات التلاميد'!$B$5:$B$56)-ROW($B$5)+1),ROWS($B$2:B719))))","v":""}]
[null,{"$f":"IF(ROWS($B$2:B720)>'بينات التلاميد'!$Q$5,\"\",INDEX('بينات التلاميد'!$B$5:$B$56,SMALL(IF('بينات التلاميد'!$B$5:$B$56<>\"\",ROW('بينات التلاميد'!$B$5:$B$56)-ROW($B$5)+1),ROWS($B$2:B720))))","v":""}]
[null,{"$f":"IF(ROWS($B$2:B721)>'بينات التلاميد'!$Q$5,\"\",INDEX('بينات التلاميد'!$B$5:$B$56,SMALL(IF('بينات التلاميد'!$B$5:$B$56<>\"\",ROW('بينات التلاميد'!$B$5:$B$56)-ROW($B$5)+1),ROWS($B$2:B721))))","v":""}]
[null,{"$f":"IF(ROWS($B$2:B722)>'بينات التلاميد'!$Q$5,\"\",INDEX('بينات التلاميد'!$B$5:$B$56,SMALL(IF('بينات التلاميد'!$B$5:$B$56<>\"\",ROW('بينات التلاميد'!$B$5:$B$56)-ROW($B$5)+1),ROWS($B$2:B722))))","v":""}]
[null,{"$f":"IF(ROWS($B$2:B723)>'بينات التلاميد'!$Q$5,\"\",INDEX('بينات التلاميد'!$B$5:$B$56,SMALL(IF('بينات التلاميد'!$B$5:$B$56<>\"\",ROW('بينات التلاميد'!$B$5:$B$56)-ROW($B$5)+1),ROWS($B$2:B723))))","v":""}]
[null,{"$f":"IF(ROWS($B$2:B724)>'بينات التلاميد'!$Q$5,\"\",INDEX('بينات التلاميد'!$B$5:$B$56,SMALL(IF('بينات التلاميد'!$B$5:$B$56<>\"\",ROW('بينات التلاميد'!$B$5:$B$56)-ROW($B$5)+1),ROWS($B$2:B724))))","v":""}]
[null,{"$f":"IF(ROWS($B$2:B725)>'بينات التلاميد'!$Q$5,\"\",INDEX('بينات التلاميد'!$B$5:$B$56,SMALL(IF('بينات التلاميد'!$B$5:$B$56<>\"\",ROW('بينات التلاميد'!$B$5:$B$56)-ROW($B$5)+1),ROWS($B$2:B725))))","v":""}]
[null,{"$f":"IF(ROWS($B$2:B726)>'بينات التلاميد'!$Q$5,\"\",INDEX('بينات التلاميد'!$B$5:$B$56,SMALL(IF('بينات التلاميد'!$B$5:$B$56<>\"\",ROW('بينات التلاميد'!$B$5:$B$56)-ROW($B$5)+1),ROWS($B$2:B726))))","v":""}]
[null,{"$f":"IF(ROWS($B$2:B727)>'بينات التلاميد'!$Q$5,\"\",INDEX('بينات التلاميد'!$B$5:$B$56,SMALL(IF('بينات التلاميد'!$B$5:$B$56<>\"\",ROW('بينات التلاميد'!$B$5:$B$56)-ROW($B$5)+1),ROWS($B$2:B727))))","v":""}]
[null,{"$f":"IF(ROWS($B$2:B728)>'بينات التلاميد'!$Q$5,\"\",INDEX('بينات التلاميد'!$B$5:$B$56,SMALL(IF('بينات التلاميد'!$B$5:$B$56<>\"\",ROW('بينات التلاميد'!$B$5:$B$56)-ROW($B$5)+1),ROWS($B$2:B728))))","v":""}]
[null,{"$f":"IF(ROWS($B$2:B729)>'بينات التلاميد'!$Q$5,\"\",INDEX('بينات التلاميد'!$B$5:$B$56,SMALL(IF('بينات التلاميد'!$B$5:$B$56<>\"\",ROW('بينات التلاميد'!$B$5:$B$56)-ROW($B$5)+1),ROWS($B$2:B729))))","v":""}]
[null,{"$f":"IF(ROWS($B$2:B730)>'بينات التلاميد'!$Q$5,\"\",INDEX('بينات التلاميد'!$B$5:$B$56,SMALL(IF('بينات التلاميد'!$B$5:$B$56<>\"\",ROW('بينات التلاميد'!$B$5:$B$56)-ROW($B$5)+1),ROWS($B$2:B730))))","v":""}]
[null,{"$f":"IF(ROWS($B$2:B731)>'بينات التلاميد'!$Q$5,\"\",INDEX('بينات التلاميد'!$B$5:$B$56,SMALL(IF('بينات التلاميد'!$B$5:$B$56<>\"\",ROW('بينات التلاميد'!$B$5:$B$56)-ROW($B$5)+1),ROWS($B$2:B731))))","v":""}]
[null,{"$f":"IF(ROWS($B$2:B732)>'بينات التلاميد'!$Q$5,\"\",INDEX('بينات التلاميد'!$B$5:$B$56,SMALL(IF('بينات التلاميد'!$B$5:$B$56<>\"\",ROW('بينات التلاميد'!$B$5:$B$56)-ROW($B$5)+1),ROWS($B$2:B732))))","v":""}]
[null,{"$f":"IF(ROWS($B$2:B733)>'بينات التلاميد'!$Q$5,\"\",INDEX('بينات التلاميد'!$B$5:$B$56,SMALL(IF('بينات التلاميد'!$B$5:$B$56<>\"\",ROW('بينات التلاميد'!$B$5:$B$56)-ROW($B$5)+1),ROWS($B$2:B733))))","v":""}]
[null,{"$f":"IF(ROWS($B$2:B734)>'بينات التلاميد'!$Q$5,\"\",INDEX('بينات التلاميد'!$B$5:$B$56,SMALL(IF('بينات التلاميد'!$B$5:$B$56<>\"\",ROW('بينات التلاميد'!$B$5:$B$56)-ROW($B$5)+1),ROWS($B$2:B734))))","v":""}]
[null,{"$f":"IF(ROWS($B$2:B735)>'بينات التلاميد'!$Q$5,\"\",INDEX('بينات التلاميد'!$B$5:$B$56,SMALL(IF('بينات التلاميد'!$B$5:$B$56<>\"\",ROW('بينات التلاميد'!$B$5:$B$56)-ROW($B$5)+1),ROWS($B$2:B735))))","v":""}]
[null,{"$f":"IF(ROWS($B$2:B736)>'بينات التلاميد'!$Q$5,\"\",INDEX('بينات التلاميد'!$B$5:$B$56,SMALL(IF('بينات التلاميد'!$B$5:$B$56<>\"\",ROW('بينات التلاميد'!$B$5:$B$56)-ROW($B$5)+1),ROWS($B$2:B736))))","v":""}]
[null,{"$f":"IF(ROWS($B$2:B737)>'بينات التلاميد'!$Q$5,\"\",INDEX('بينات التلاميد'!$B$5:$B$56,SMALL(IF('بينات التلاميد'!$B$5:$B$56<>\"\",ROW('بينات التلاميد'!$B$5:$B$56)-ROW($B$5)+1),ROWS($B$2:B737))))","v":""}]
[null,{"$f":"IF(ROWS($B$2:B738)>'بينات التلاميد'!$Q$5,\"\",INDEX('بينات التلاميد'!$B$5:$B$56,SMALL(IF('بينات التلاميد'!$B$5:$B$56<>\"\",ROW('بينات التلاميد'!$B$5:$B$56)-ROW($B$5)+1),ROWS($B$2:B738))))","v":""}]
[null,{"$f":"IF(ROWS($B$2:B739)>'بينات التلاميد'!$Q$5,\"\",INDEX('بينات التلاميد'!$B$5:$B$56,SMALL(IF('بينات التلاميد'!$B$5:$B$56<>\"\",ROW('بينات التلاميد'!$B$5:$B$56)-ROW($B$5)+1),ROWS($B$2:B739))))","v":""}]
[null,{"$f":"IF(ROWS($B$2:B740)>'بينات التلاميد'!$Q$5,\"\",INDEX('بينات التلاميد'!$B$5:$B$56,SMALL(IF('بينات التلاميد'!$B$5:$B$56<>\"\",ROW('بينات التلاميد'!$B$5:$B$56)-ROW($B$5)+1),ROWS($B$2:B740))))","v":""}]
[null,{"$f":"IF(ROWS($B$2:B741)>'بينات التلاميد'!$Q$5,\"\",INDEX('بينات التلاميد'!$B$5:$B$56,SMALL(IF('بينات التلاميد'!$B$5:$B$56<>\"\",ROW('بينات التلاميد'!$B$5:$B$56)-ROW($B$5)+1),ROWS($B$2:B741))))","v":""}]
[null,{"$f":"IF(ROWS($B$2:B742)>'بينات التلاميد'!$Q$5,\"\",INDEX('بينات التلاميد'!$B$5:$B$56,SMALL(IF('بينات التلاميد'!$B$5:$B$56<>\"\",ROW('بينات التلاميد'!$B$5:$B$56)-ROW($B$5)+1),ROWS($B$2:B742))))","v":""}]
[null,{"$f":"IF(ROWS($B$2:B743)>'بينات التلاميد'!$Q$5,\"\",INDEX('بينات التلاميد'!$B$5:$B$56,SMALL(IF('بينات التلاميد'!$B$5:$B$56<>\"\",ROW('بينات التلاميد'!$B$5:$B$56)-ROW($B$5)+1),ROWS($B$2:B743))))","v":""}]
[null,{"$f":"IF(ROWS($B$2:B744)>'بينات التلاميد'!$Q$5,\"\",INDEX('بينات التلاميد'!$B$5:$B$56,SMALL(IF('بينات التلاميد'!$B$5:$B$56<>\"\",ROW('بينات التلاميد'!$B$5:$B$56)-ROW($B$5)+1),ROWS($B$2:B744))))","v":""}]
[null,{"$f":"IF(ROWS($B$2:B745)>'بينات التلاميد'!$Q$5,\"\",INDEX('بينات التلاميد'!$B$5:$B$56,SMALL(IF('بينات التلاميد'!$B$5:$B$56<>\"\",ROW('بينات التلاميد'!$B$5:$B$56)-ROW($B$5)+1),ROWS($B$2:B745))))","v":""}]
[null,{"$f":"IF(ROWS($B$2:B746)>'بينات التلاميد'!$Q$5,\"\",INDEX('بينات التلاميد'!$B$5:$B$56,SMALL(IF('بينات التلاميد'!$B$5:$B$56<>\"\",ROW('بينات التلاميد'!$B$5:$B$56)-ROW($B$5)+1),ROWS($B$2:B746))))","v":""}]
[null,{"$f":"IF(ROWS($B$2:B747)>'بينات التلاميد'!$Q$5,\"\",INDEX('بينات التلاميد'!$B$5:$B$56,SMALL(IF('بينات التلاميد'!$B$5:$B$56<>\"\",ROW('بينات التلاميد'!$B$5:$B$56)-ROW($B$5)+1),ROWS($B$2:B747))))","v":""}]
[null,{"$f":"IF(ROWS($B$2:B748)>'بينات التلاميد'!$Q$5,\"\",INDEX('بينات التلاميد'!$B$5:$B$56,SMALL(IF('بينات التلاميد'!$B$5:$B$56<>\"\",ROW('بينات التلاميد'!$B$5:$B$56)-ROW($B$5)+1),ROWS($B$2:B748))))","v":""}]
[null,{"$f":"IF(ROWS($B$2:B749)>'بينات التلاميد'!$Q$5,\"\",INDEX('بينات التلاميد'!$B$5:$B$56,SMALL(IF('بينات التلاميد'!$B$5:$B$56<>\"\",ROW('بينات التلاميد'!$B$5:$B$56)-ROW($B$5)+1),ROWS($B$2:B749))))","v":""}]
[null,{"$f":"IF(ROWS($B$2:B750)>'بينات التلاميد'!$Q$5,\"\",INDEX('بينات التلاميد'!$B$5:$B$56,SMALL(IF('بينات التلاميد'!$B$5:$B$56<>\"\",ROW('بينات التلاميد'!$B$5:$B$56)-ROW($B$5)+1),ROWS($B$2:B750))))","v":""}]
[null,{"$f":"IF(ROWS($B$2:B751)>'بينات التلاميد'!$Q$5,\"\",INDEX('بينات التلاميد'!$B$5:$B$56,SMALL(IF('بينات التلاميد'!$B$5:$B$56<>\"\",ROW('بينات التلاميد'!$B$5:$B$56)-ROW($B$5)+1),ROWS($B$2:B751))))","v":""}]
[null,{"$f":"IF(ROWS($B$2:B752)>'بينات التلاميد'!$Q$5,\"\",INDEX('بينات التلاميد'!$B$5:$B$56,SMALL(IF('بينات التلاميد'!$B$5:$B$56<>\"\",ROW('بينات التلاميد'!$B$5:$B$56)-ROW($B$5)+1),ROWS($B$2:B752))))","v":""}]
[null,{"$f":"IF(ROWS($B$2:B753)>'بينات التلاميد'!$Q$5,\"\",INDEX('بينات التلاميد'!$B$5:$B$56,SMALL(IF('بينات التلاميد'!$B$5:$B$56<>\"\",ROW('بينات التلاميد'!$B$5:$B$56)-ROW($B$5)+1),ROWS($B$2:B753))))","v":""}]
[null,{"$f":"IF(ROWS($B$2:B754)>'بينات التلاميد'!$Q$5,\"\",INDEX('بينات التلاميد'!$B$5:$B$56,SMALL(IF('بينات التلاميد'!$B$5:$B$56<>\"\",ROW('بينات التلاميد'!$B$5:$B$56)-ROW($B$5)+1),ROWS($B$2:B754))))","v":""}]
[null,{"$f":"IF(ROWS($B$2:B755)>'بينات التلاميد'!$Q$5,\"\",INDEX('بينات التلاميد'!$B$5:$B$56,SMALL(IF('بينات التلاميد'!$B$5:$B$56<>\"\",ROW('بينات التلاميد'!$B$5:$B$56)-ROW($B$5)+1),ROWS($B$2:B755))))","v":""}]
[null,{"$f":"IF(ROWS($B$2:B756)>'بينات التلاميد'!$Q$5,\"\",INDEX('بينات التلاميد'!$B$5:$B$56,SMALL(IF('بينات التلاميد'!$B$5:$B$56<>\"\",ROW('بينات التلاميد'!$B$5:$B$56)-ROW($B$5)+1),ROWS($B$2:B756))))","v":""}]
[null,{"$f":"IF(ROWS($B$2:B757)>'بينات التلاميد'!$Q$5,\"\",INDEX('بينات التلاميد'!$B$5:$B$56,SMALL(IF('بينات التلاميد'!$B$5:$B$56<>\"\",ROW('بينات التلاميد'!$B$5:$B$56)-ROW($B$5)+1),ROWS($B$2:B757))))","v":""}]
[null,{"$f":"IF(ROWS($B$2:B758)>'بينات التلاميد'!$Q$5,\"\",INDEX('بينات التلاميد'!$B$5:$B$56,SMALL(IF('بينات التلاميد'!$B$5:$B$56<>\"\",ROW('بينات التلاميد'!$B$5:$B$56)-ROW($B$5)+1),ROWS($B$2:B758))))","v":""}]
[null,{"$f":"IF(ROWS($B$2:B759)>'بينات التلاميد'!$Q$5,\"\",INDEX('بينات التلاميد'!$B$5:$B$56,SMALL(IF('بينات التلاميد'!$B$5:$B$56<>\"\",ROW('بينات التلاميد'!$B$5:$B$56)-ROW($B$5)+1),ROWS($B$2:B759))))","v":""}]
[null,{"$f":"IF(ROWS($B$2:B760)>'بينات التلاميد'!$Q$5,\"\",INDEX('بينات التلاميد'!$B$5:$B$56,SMALL(IF('بينات التلاميد'!$B$5:$B$56<>\"\",ROW('بينات التلاميد'!$B$5:$B$56)-ROW($B$5)+1),ROWS($B$2:B760))))","v":""}]
[null,{"$f":"IF(ROWS($B$2:B761)>'بينات التلاميد'!$Q$5,\"\",INDEX('بينات التلاميد'!$B$5:$B$56,SMALL(IF('بينات التلاميد'!$B$5:$B$56<>\"\",ROW('بينات التلاميد'!$B$5:$B$56)-ROW($B$5)+1),ROWS($B$2:B761))))","v":""}]
[null,{"$f":"IF(ROWS($B$2:B762)>'بينات التلاميد'!$Q$5,\"\",INDEX('بينات التلاميد'!$B$5:$B$56,SMALL(IF('بينات التلاميد'!$B$5:$B$56<>\"\",ROW('بينات التلاميد'!$B$5:$B$56)-ROW($B$5)+1),ROWS($B$2:B762))))","v":""}]
[null,{"$f":"IF(ROWS($B$2:B763)>'بينات التلاميد'!$Q$5,\"\",INDEX('بينات التلاميد'!$B$5:$B$56,SMALL(IF('بينات التلاميد'!$B$5:$B$56<>\"\",ROW('بينات التلاميد'!$B$5:$B$56)-ROW($B$5)+1),ROWS($B$2:B763))))","v":""}]
[null,{"$f":"IF(ROWS($B$2:B764)>'بينات التلاميد'!$Q$5,\"\",INDEX('بينات التلاميد'!$B$5:$B$56,SMALL(IF('بينات التلاميد'!$B$5:$B$56<>\"\",ROW('بينات التلاميد'!$B$5:$B$56)-ROW($B$5)+1),ROWS($B$2:B764))))","v":""}]
[null,{"$f":"IF(ROWS($B$2:B765)>'بينات التلاميد'!$Q$5,\"\",INDEX('بينات التلاميد'!$B$5:$B$56,SMALL(IF('بينات التلاميد'!$B$5:$B$56<>\"\",ROW('بينات التلاميد'!$B$5:$B$56)-ROW($B$5)+1),ROWS($B$2:B765))))","v":""}]
[null,{"$f":"IF(ROWS($B$2:B766)>'بينات التلاميد'!$Q$5,\"\",INDEX('بينات التلاميد'!$B$5:$B$56,SMALL(IF('بينات التلاميد'!$B$5:$B$56<>\"\",ROW('بينات التلاميد'!$B$5:$B$56)-ROW($B$5)+1),ROWS($B$2:B766))))","v":""}]
[null,{"$f":"IF(ROWS($B$2:B767)>'بينات التلاميد'!$Q$5,\"\",INDEX('بينات التلاميد'!$B$5:$B$56,SMALL(IF('بينات التلاميد'!$B$5:$B$56<>\"\",ROW('بينات التلاميد'!$B$5:$B$56)-ROW($B$5)+1),ROWS($B$2:B767))))","v":""}]
[null,{"$f":"IF(ROWS($B$2:B768)>'بينات التلاميد'!$Q$5,\"\",INDEX('بينات التلاميد'!$B$5:$B$56,SMALL(IF('بينات التلاميد'!$B$5:$B$56<>\"\",ROW('بينات التلاميد'!$B$5:$B$56)-ROW($B$5)+1),ROWS($B$2:B768))))","v":""}]
[null,{"$f":"IF(ROWS($B$2:B769)>'بينات التلاميد'!$Q$5,\"\",INDEX('بينات التلاميد'!$B$5:$B$56,SMALL(IF('بينات التلاميد'!$B$5:$B$56<>\"\",ROW('بينات التلاميد'!$B$5:$B$56)-ROW($B$5)+1),ROWS($B$2:B769))))","v":""}]
[null,{"$f":"IF(ROWS($B$2:B770)>'بينات التلاميد'!$Q$5,\"\",INDEX('بينات التلاميد'!$B$5:$B$56,SMALL(IF('بينات التلاميد'!$B$5:$B$56<>\"\",ROW('بينات التلاميد'!$B$5:$B$56)-ROW($B$5)+1),ROWS($B$2:B770))))","v":""}]
[null,{"$f":"IF(ROWS($B$2:B771)>'بينات التلاميد'!$Q$5,\"\",INDEX('بينات التلاميد'!$B$5:$B$56,SMALL(IF('بينات التلاميد'!$B$5:$B$56<>\"\",ROW('بينات التلاميد'!$B$5:$B$56)-ROW($B$5)+1),ROWS($B$2:B771))))","v":""}]
[null,{"$f":"IF(ROWS($B$2:B772)>'بينات التلاميد'!$Q$5,\"\",INDEX('بينات التلاميد'!$B$5:$B$56,SMALL(IF('بينات التلاميد'!$B$5:$B$56<>\"\",ROW('بينات التلاميد'!$B$5:$B$56)-ROW($B$5)+1),ROWS($B$2:B772))))","v":""}]
[null,{"$f":"IF(ROWS($B$2:B773)>'بينات التلاميد'!$Q$5,\"\",INDEX('بينات التلاميد'!$B$5:$B$56,SMALL(IF('بينات التلاميد'!$B$5:$B$56<>\"\",ROW('بينات التلاميد'!$B$5:$B$56)-ROW($B$5)+1),ROWS($B$2:B773))))","v":""}]
[null,{"$f":"IF(ROWS($B$2:B774)>'بينات التلاميد'!$Q$5,\"\",INDEX('بينات التلاميد'!$B$5:$B$56,SMALL(IF('بينات التلاميد'!$B$5:$B$56<>\"\",ROW('بينات التلاميد'!$B$5:$B$56)-ROW($B$5)+1),ROWS($B$2:B774))))","v":""}]
[null,{"$f":"IF(ROWS($B$2:B775)>'بينات التلاميد'!$Q$5,\"\",INDEX('بينات التلاميد'!$B$5:$B$56,SMALL(IF('بينات التلاميد'!$B$5:$B$56<>\"\",ROW('بينات التلاميد'!$B$5:$B$56)-ROW($B$5)+1),ROWS($B$2:B775))))","v":""}]
[null,{"$f":"IF(ROWS($B$2:B776)>'بينات التلاميد'!$Q$5,\"\",INDEX('بينات التلاميد'!$B$5:$B$56,SMALL(IF('بينات التلاميد'!$B$5:$B$56<>\"\",ROW('بينات التلاميد'!$B$5:$B$56)-ROW($B$5)+1),ROWS($B$2:B776))))","v":""}]
[null,{"$f":"IF(ROWS($B$2:B777)>'بينات التلاميد'!$Q$5,\"\",INDEX('بينات التلاميد'!$B$5:$B$56,SMALL(IF('بينات التلاميد'!$B$5:$B$56<>\"\",ROW('بينات التلاميد'!$B$5:$B$56)-ROW($B$5)+1),ROWS($B$2:B777))))","v":""}]
[null,{"$f":"IF(ROWS($B$2:B778)>'بينات التلاميد'!$Q$5,\"\",INDEX('بينات التلاميد'!$B$5:$B$56,SMALL(IF('بينات التلاميد'!$B$5:$B$56<>\"\",ROW('بينات التلاميد'!$B$5:$B$56)-ROW($B$5)+1),ROWS($B$2:B778))))","v":""}]
[null,{"$f":"IF(ROWS($B$2:B779)>'بينات التلاميد'!$Q$5,\"\",INDEX('بينات التلاميد'!$B$5:$B$56,SMALL(IF('بينات التلاميد'!$B$5:$B$56<>\"\",ROW('بينات التلاميد'!$B$5:$B$56)-ROW($B$5)+1),ROWS($B$2:B779))))","v":""}]
[null,{"$f":"IF(ROWS($B$2:B780)>'بينات التلاميد'!$Q$5,\"\",INDEX('بينات التلاميد'!$B$5:$B$56,SMALL(IF('بينات التلاميد'!$B$5:$B$56<>\"\",ROW('بينات التلاميد'!$B$5:$B$56)-ROW($B$5)+1),ROWS($B$2:B780))))","v":""}]
[null,{"$f":"IF(ROWS($B$2:B781)>'بينات التلاميد'!$Q$5,\"\",INDEX('بينات التلاميد'!$B$5:$B$56,SMALL(IF('بينات التلاميد'!$B$5:$B$56<>\"\",ROW('بينات التلاميد'!$B$5:$B$56)-ROW($B$5)+1),ROWS($B$2:B781))))","v":""}]
[null,{"$f":"IF(ROWS($B$2:B782)>'بينات التلاميد'!$Q$5,\"\",INDEX('بينات التلاميد'!$B$5:$B$56,SMALL(IF('بينات التلاميد'!$B$5:$B$56<>\"\",ROW('بينات التلاميد'!$B$5:$B$56)-ROW($B$5)+1),ROWS($B$2:B782))))","v":""}]
[null,{"$f":"IF(ROWS($B$2:B783)>'بينات التلاميد'!$Q$5,\"\",INDEX('بينات التلاميد'!$B$5:$B$56,SMALL(IF('بينات التلاميد'!$B$5:$B$56<>\"\",ROW('بينات التلاميد'!$B$5:$B$56)-ROW($B$5)+1),ROWS($B$2:B783))))","v":""}]
[null,{"$f":"IF(ROWS($B$2:B784)>'بينات التلاميد'!$Q$5,\"\",INDEX('بينات التلاميد'!$B$5:$B$56,SMALL(IF('بينات التلاميد'!$B$5:$B$56<>\"\",ROW('بينات التلاميد'!$B$5:$B$56)-ROW($B$5)+1),ROWS($B$2:B784))))","v":""}]
[null,{"$f":"IF(ROWS($B$2:B785)>'بينات التلاميد'!$Q$5,\"\",INDEX('بينات التلاميد'!$B$5:$B$56,SMALL(IF('بينات التلاميد'!$B$5:$B$56<>\"\",ROW('بينات التلاميد'!$B$5:$B$56)-ROW($B$5)+1),ROWS($B$2:B785))))","v":""}]
[null,{"$f":"IF(ROWS($B$2:B786)>'بينات التلاميد'!$Q$5,\"\",INDEX('بينات التلاميد'!$B$5:$B$56,SMALL(IF('بينات التلاميد'!$B$5:$B$56<>\"\",ROW('بينات التلاميد'!$B$5:$B$56)-ROW($B$5)+1),ROWS($B$2:B786))))","v":""}]
[null,{"$f":"IF(ROWS($B$2:B787)>'بينات التلاميد'!$Q$5,\"\",INDEX('بينات التلاميد'!$B$5:$B$56,SMALL(IF('بينات التلاميد'!$B$5:$B$56<>\"\",ROW('بينات التلاميد'!$B$5:$B$56)-ROW($B$5)+1),ROWS($B$2:B787))))","v":""}]
[null,{"$f":"IF(ROWS($B$2:B788)>'بينات التلاميد'!$Q$5,\"\",INDEX('بينات التلاميد'!$B$5:$B$56,SMALL(IF('بينات التلاميد'!$B$5:$B$56<>\"\",ROW('بينات التلاميد'!$B$5:$B$56)-ROW($B$5)+1),ROWS($B$2:B788))))","v":""}]
[null,{"$f":"IF(ROWS($B$2:B789)>'بينات التلاميد'!$Q$5,\"\",INDEX('بينات التلاميد'!$B$5:$B$56,SMALL(IF('بينات التلاميد'!$B$5:$B$56<>\"\",ROW('بينات التلاميد'!$B$5:$B$56)-ROW($B$5)+1),ROWS($B$2:B789))))","v":""}]
[null,{"$f":"IF(ROWS($B$2:B790)>'بينات التلاميد'!$Q$5,\"\",INDEX('بينات التلاميد'!$B$5:$B$56,SMALL(IF('بينات التلاميد'!$B$5:$B$56<>\"\",ROW('بينات التلاميد'!$B$5:$B$56)-ROW($B$5)+1),ROWS($B$2:B790))))","v":""}]
[null,{"$f":"IF(ROWS($B$2:B791)>'بينات التلاميد'!$Q$5,\"\",INDEX('بينات التلاميد'!$B$5:$B$56,SMALL(IF('بينات التلاميد'!$B$5:$B$56<>\"\",ROW('بينات التلاميد'!$B$5:$B$56)-ROW($B$5)+1),ROWS($B$2:B791))))","v":""}]
[null,{"$f":"IF(ROWS($B$2:B792)>'بينات التلاميد'!$Q$5,\"\",INDEX('بينات التلاميد'!$B$5:$B$56,SMALL(IF('بينات التلاميد'!$B$5:$B$56<>\"\",ROW('بينات التلاميد'!$B$5:$B$56)-ROW($B$5)+1),ROWS($B$2:B792))))","v":""}]
[null,{"$f":"IF(ROWS($B$2:B793)>'بينات التلاميد'!$Q$5,\"\",INDEX('بينات التلاميد'!$B$5:$B$56,SMALL(IF('بينات التلاميد'!$B$5:$B$56<>\"\",ROW('بينات التلاميد'!$B$5:$B$56)-ROW($B$5)+1),ROWS($B$2:B793))))","v":""}]
[null,{"$f":"IF(ROWS($B$2:B794)>'بينات التلاميد'!$Q$5,\"\",INDEX('بينات التلاميد'!$B$5:$B$56,SMALL(IF('بينات التلاميد'!$B$5:$B$56<>\"\",ROW('بينات التلاميد'!$B$5:$B$56)-ROW($B$5)+1),ROWS($B$2:B794))))","v":""}]
[null,{"$f":"IF(ROWS($B$2:B795)>'بينات التلاميد'!$Q$5,\"\",INDEX('بينات التلاميد'!$B$5:$B$56,SMALL(IF('بينات التلاميد'!$B$5:$B$56<>\"\",ROW('بينات التلاميد'!$B$5:$B$56)-ROW($B$5)+1),ROWS($B$2:B795))))","v":""}]
[null,{"$f":"IF(ROWS($B$2:B796)>'بينات التلاميد'!$Q$5,\"\",INDEX('بينات التلاميد'!$B$5:$B$56,SMALL(IF('بينات التلاميد'!$B$5:$B$56<>\"\",ROW('بينات التلاميد'!$B$5:$B$56)-ROW($B$5)+1),ROWS($B$2:B796))))","v":""}]
[null,{"$f":"IF(ROWS($B$2:B797)>'بينات التلاميد'!$Q$5,\"\",INDEX('بينات التلاميد'!$B$5:$B$56,SMALL(IF('بينات التلاميد'!$B$5:$B$56<>\"\",ROW('بينات التلاميد'!$B$5:$B$56)-ROW($B$5)+1),ROWS($B$2:B797))))","v":""}]
[null,{"$f":"IF(ROWS($B$2:B798)>'بينات التلاميد'!$Q$5,\"\",INDEX('بينات التلاميد'!$B$5:$B$56,SMALL(IF('بينات التلاميد'!$B$5:$B$56<>\"\",ROW('بينات التلاميد'!$B$5:$B$56)-ROW($B$5)+1),ROWS($B$2:B798))))","v":""}]
[null,{"$f":"IF(ROWS($B$2:B799)>'بينات التلاميد'!$Q$5,\"\",INDEX('بينات التلاميد'!$B$5:$B$56,SMALL(IF('بينات التلاميد'!$B$5:$B$56<>\"\",ROW('بينات التلاميد'!$B$5:$B$56)-ROW($B$5)+1),ROWS($B$2:B799))))","v":""}]
[null,{"$f":"IF(ROWS($B$2:B800)>'بينات التلاميد'!$Q$5,\"\",INDEX('بينات التلاميد'!$B$5:$B$56,SMALL(IF('بينات التلاميد'!$B$5:$B$56<>\"\",ROW('بينات التلاميد'!$B$5:$B$56)-ROW($B$5)+1),ROWS($B$2:B800))))","v":""}]
[null,{"$f":"IF(ROWS($B$2:B801)>'بينات التلاميد'!$Q$5,\"\",INDEX('بينات التلاميد'!$B$5:$B$56,SMALL(IF('بينات التلاميد'!$B$5:$B$56<>\"\",ROW('بينات التلاميد'!$B$5:$B$56)-ROW($B$5)+1),ROWS($B$2:B801))))","v":""}]
[null,{"$f":"IF(ROWS($B$2:B802)>'بينات التلاميد'!$Q$5,\"\",INDEX('بينات التلاميد'!$B$5:$B$56,SMALL(IF('بينات التلاميد'!$B$5:$B$56<>\"\",ROW('بينات التلاميد'!$B$5:$B$56)-ROW($B$5)+1),ROWS($B$2:B802))))","v":""}]
[null,{"$f":"IF(ROWS($B$2:B803)>'بينات التلاميد'!$Q$5,\"\",INDEX('بينات التلاميد'!$B$5:$B$56,SMALL(IF('بينات التلاميد'!$B$5:$B$56<>\"\",ROW('بينات التلاميد'!$B$5:$B$56)-ROW($B$5)+1),ROWS($B$2:B803))))","v":""}]
[null,{"$f":"IF(ROWS($B$2:B804)>'بينات التلاميد'!$Q$5,\"\",INDEX('بينات التلاميد'!$B$5:$B$56,SMALL(IF('بينات التلاميد'!$B$5:$B$56<>\"\",ROW('بينات التلاميد'!$B$5:$B$56)-ROW($B$5)+1),ROWS($B$2:B804))))","v":""}]
[null,{"$f":"IF(ROWS($B$2:B805)>'بينات التلاميد'!$Q$5,\"\",INDEX('بينات التلاميد'!$B$5:$B$56,SMALL(IF('بينات التلاميد'!$B$5:$B$56<>\"\",ROW('بينات التلاميد'!$B$5:$B$56)-ROW($B$5)+1),ROWS($B$2:B805))))","v":""}]
[null,{"$f":"IF(ROWS($B$2:B806)>'بينات التلاميد'!$Q$5,\"\",INDEX('بينات التلاميد'!$B$5:$B$56,SMALL(IF('بينات التلاميد'!$B$5:$B$56<>\"\",ROW('بينات التلاميد'!$B$5:$B$56)-ROW($B$5)+1),ROWS($B$2:B806))))","v":""}]
[null,{"$f":"IF(ROWS($B$2:B807)>'بينات التلاميد'!$Q$5,\"\",INDEX('بينات التلاميد'!$B$5:$B$56,SMALL(IF('بينات التلاميد'!$B$5:$B$56<>\"\",ROW('بينات التلاميد'!$B$5:$B$56)-ROW($B$5)+1),ROWS($B$2:B807))))","v":""}]
[null,{"$f":"IF(ROWS($B$2:B808)>'بينات التلاميد'!$Q$5,\"\",INDEX('بينات التلاميد'!$B$5:$B$56,SMALL(IF('بينات التلاميد'!$B$5:$B$56<>\"\",ROW('بينات التلاميد'!$B$5:$B$56)-ROW($B$5)+1),ROWS($B$2:B808))))","v":""}]
[null,{"$f":"IF(ROWS($B$2:B809)>'بينات التلاميد'!$Q$5,\"\",INDEX('بينات التلاميد'!$B$5:$B$56,SMALL(IF('بينات التلاميد'!$B$5:$B$56<>\"\",ROW('بينات التلاميد'!$B$5:$B$56)-ROW($B$5)+1),ROWS($B$2:B809))))","v":""}]
[null,{"$f":"IF(ROWS($B$2:B810)>'بينات التلاميد'!$Q$5,\"\",INDEX('بينات التلاميد'!$B$5:$B$56,SMALL(IF('بينات التلاميد'!$B$5:$B$56<>\"\",ROW('بينات التلاميد'!$B$5:$B$56)-ROW($B$5)+1),ROWS($B$2:B810))))","v":""}]
[null,{"$f":"IF(ROWS($B$2:B811)>'بينات التلاميد'!$Q$5,\"\",INDEX('بينات التلاميد'!$B$5:$B$56,SMALL(IF('بينات التلاميد'!$B$5:$B$56<>\"\",ROW('بينات التلاميد'!$B$5:$B$56)-ROW($B$5)+1),ROWS($B$2:B811))))","v":""}]
[null,{"$f":"IF(ROWS($B$2:B812)>'بينات التلاميد'!$Q$5,\"\",INDEX('بينات التلاميد'!$B$5:$B$56,SMALL(IF('بينات التلاميد'!$B$5:$B$56<>\"\",ROW('بينات التلاميد'!$B$5:$B$56)-ROW($B$5)+1),ROWS($B$2:B812))))","v":""}]
[null,{"$f":"IF(ROWS($B$2:B813)>'بينات التلاميد'!$Q$5,\"\",INDEX('بينات التلاميد'!$B$5:$B$56,SMALL(IF('بينات التلاميد'!$B$5:$B$56<>\"\",ROW('بينات التلاميد'!$B$5:$B$56)-ROW($B$5)+1),ROWS($B$2:B813))))","v":""}]
[null,{"$f":"IF(ROWS($B$2:B814)>'بينات التلاميد'!$Q$5,\"\",INDEX('بينات التلاميد'!$B$5:$B$56,SMALL(IF('بينات التلاميد'!$B$5:$B$56<>\"\",ROW('بينات التلاميد'!$B$5:$B$56)-ROW($B$5)+1),ROWS($B$2:B814))))","v":""}]
[null,{"$f":"IF(ROWS($B$2:B815)>'بينات التلاميد'!$Q$5,\"\",INDEX('بينات التلاميد'!$B$5:$B$56,SMALL(IF('بينات التلاميد'!$B$5:$B$56<>\"\",ROW('بينات التلاميد'!$B$5:$B$56)-ROW($B$5)+1),ROWS($B$2:B815))))","v":""}]
[null,{"$f":"IF(ROWS($B$2:B816)>'بينات التلاميد'!$Q$5,\"\",INDEX('بينات التلاميد'!$B$5:$B$56,SMALL(IF('بينات التلاميد'!$B$5:$B$56<>\"\",ROW('بينات التلاميد'!$B$5:$B$56)-ROW($B$5)+1),ROWS($B$2:B816))))","v":""}]
[null,{"$f":"IF(ROWS($B$2:B817)>'بينات التلاميد'!$Q$5,\"\",INDEX('بينات التلاميد'!$B$5:$B$56,SMALL(IF('بينات التلاميد'!$B$5:$B$56<>\"\",ROW('بينات التلاميد'!$B$5:$B$56)-ROW($B$5)+1),ROWS($B$2:B817))))","v":""}]
[null,{"$f":"IF(ROWS($B$2:B818)>'بينات التلاميد'!$Q$5,\"\",INDEX('بينات التلاميد'!$B$5:$B$56,SMALL(IF('بينات التلاميد'!$B$5:$B$56<>\"\",ROW('بينات التلاميد'!$B$5:$B$56)-ROW($B$5)+1),ROWS($B$2:B818))))","v":""}]
[null,{"$f":"IF(ROWS($B$2:B819)>'بينات التلاميد'!$Q$5,\"\",INDEX('بينات التلاميد'!$B$5:$B$56,SMALL(IF('بينات التلاميد'!$B$5:$B$56<>\"\",ROW('بينات التلاميد'!$B$5:$B$56)-ROW($B$5)+1),ROWS($B$2:B819))))","v":""}]
[null,{"$f":"IF(ROWS($B$2:B820)>'بينات التلاميد'!$Q$5,\"\",INDEX('بينات التلاميد'!$B$5:$B$56,SMALL(IF('بينات التلاميد'!$B$5:$B$56<>\"\",ROW('بينات التلاميد'!$B$5:$B$56)-ROW($B$5)+1),ROWS($B$2:B820))))","v":""}]
[null,{"$f":"IF(ROWS($B$2:B821)>'بينات التلاميد'!$Q$5,\"\",INDEX('بينات التلاميد'!$B$5:$B$56,SMALL(IF('بينات التلاميد'!$B$5:$B$56<>\"\",ROW('بينات التلاميد'!$B$5:$B$56)-ROW($B$5)+1),ROWS($B$2:B821))))","v":""}]
[null,{"$f":"IF(ROWS($B$2:B822)>'بينات التلاميد'!$Q$5,\"\",INDEX('بينات التلاميد'!$B$5:$B$56,SMALL(IF('بينات التلاميد'!$B$5:$B$56<>\"\",ROW('بينات التلاميد'!$B$5:$B$56)-ROW($B$5)+1),ROWS($B$2:B822))))","v":""}]
[null,{"$f":"IF(ROWS($B$2:B823)>'بينات التلاميد'!$Q$5,\"\",INDEX('بينات التلاميد'!$B$5:$B$56,SMALL(IF('بينات التلاميد'!$B$5:$B$56<>\"\",ROW('بينات التلاميد'!$B$5:$B$56)-ROW($B$5)+1),ROWS($B$2:B823))))","v":""}]
[null,{"$f":"IF(ROWS($B$2:B824)>'بينات التلاميد'!$Q$5,\"\",INDEX('بينات التلاميد'!$B$5:$B$56,SMALL(IF('بينات التلاميد'!$B$5:$B$56<>\"\",ROW('بينات التلاميد'!$B$5:$B$56)-ROW($B$5)+1),ROWS($B$2:B824))))","v":""}]
[null,{"$f":"IF(ROWS($B$2:B825)>'بينات التلاميد'!$Q$5,\"\",INDEX('بينات التلاميد'!$B$5:$B$56,SMALL(IF('بينات التلاميد'!$B$5:$B$56<>\"\",ROW('بينات التلاميد'!$B$5:$B$56)-ROW($B$5)+1),ROWS($B$2:B825))))","v":""}]
[null,{"$f":"IF(ROWS($B$2:B826)>'بينات التلاميد'!$Q$5,\"\",INDEX('بينات التلاميد'!$B$5:$B$56,SMALL(IF('بينات التلاميد'!$B$5:$B$56<>\"\",ROW('بينات التلاميد'!$B$5:$B$56)-ROW($B$5)+1),ROWS($B$2:B826))))","v":""}]
[null,{"$f":"IF(ROWS($B$2:B827)>'بينات التلاميد'!$Q$5,\"\",INDEX('بينات التلاميد'!$B$5:$B$56,SMALL(IF('بينات التلاميد'!$B$5:$B$56<>\"\",ROW('بينات التلاميد'!$B$5:$B$56)-ROW($B$5)+1),ROWS($B$2:B827))))","v":""}]
[null,{"$f":"IF(ROWS($B$2:B828)>'بينات التلاميد'!$Q$5,\"\",INDEX('بينات التلاميد'!$B$5:$B$56,SMALL(IF('بينات التلاميد'!$B$5:$B$56<>\"\",ROW('بينات التلاميد'!$B$5:$B$56)-ROW($B$5)+1),ROWS($B$2:B828))))","v":""}]
[null,{"$f":"IF(ROWS($B$2:B829)>'بينات التلاميد'!$Q$5,\"\",INDEX('بينات التلاميد'!$B$5:$B$56,SMALL(IF('بينات التلاميد'!$B$5:$B$56<>\"\",ROW('بينات التلاميد'!$B$5:$B$56)-ROW($B$5)+1),ROWS($B$2:B829))))","v":""}]
[null,{"$f":"IF(ROWS($B$2:B830)>'بينات التلاميد'!$Q$5,\"\",INDEX('بينات التلاميد'!$B$5:$B$56,SMALL(IF('بينات التلاميد'!$B$5:$B$56<>\"\",ROW('بينات التلاميد'!$B$5:$B$56)-ROW($B$5)+1),ROWS($B$2:B830))))","v":""}]
[null,{"$f":"IF(ROWS($B$2:B831)>'بينات التلاميد'!$Q$5,\"\",INDEX('بينات التلاميد'!$B$5:$B$56,SMALL(IF('بينات التلاميد'!$B$5:$B$56<>\"\",ROW('بينات التلاميد'!$B$5:$B$56)-ROW($B$5)+1),ROWS($B$2:B831))))","v":""}]
[null,{"$f":"IF(ROWS($B$2:B832)>'بينات التلاميد'!$Q$5,\"\",INDEX('بينات التلاميد'!$B$5:$B$56,SMALL(IF('بينات التلاميد'!$B$5:$B$56<>\"\",ROW('بينات التلاميد'!$B$5:$B$56)-ROW($B$5)+1),ROWS($B$2:B832))))","v":""}]
[null,{"$f":"IF(ROWS($B$2:B833)>'بينات التلاميد'!$Q$5,\"\",INDEX('بينات التلاميد'!$B$5:$B$56,SMALL(IF('بينات التلاميد'!$B$5:$B$56<>\"\",ROW('بينات التلاميد'!$B$5:$B$56)-ROW($B$5)+1),ROWS($B$2:B833))))","v":""}]
[null,{"$f":"IF(ROWS($B$2:B834)>'بينات التلاميد'!$Q$5,\"\",INDEX('بينات التلاميد'!$B$5:$B$56,SMALL(IF('بينات التلاميد'!$B$5:$B$56<>\"\",ROW('بينات التلاميد'!$B$5:$B$56)-ROW($B$5)+1),ROWS($B$2:B834))))","v":""}]
[null,{"$f":"IF(ROWS($B$2:B835)>'بينات التلاميد'!$Q$5,\"\",INDEX('بينات التلاميد'!$B$5:$B$56,SMALL(IF('بينات التلاميد'!$B$5:$B$56<>\"\",ROW('بينات التلاميد'!$B$5:$B$56)-ROW($B$5)+1),ROWS($B$2:B835))))","v":""}]
[null,{"$f":"IF(ROWS($B$2:B836)>'بينات التلاميد'!$Q$5,\"\",INDEX('بينات التلاميد'!$B$5:$B$56,SMALL(IF('بينات التلاميد'!$B$5:$B$56<>\"\",ROW('بينات التلاميد'!$B$5:$B$56)-ROW($B$5)+1),ROWS($B$2:B836))))","v":""}]
[null,{"$f":"IF(ROWS($B$2:B837)>'بينات التلاميد'!$Q$5,\"\",INDEX('بينات التلاميد'!$B$5:$B$56,SMALL(IF('بينات التلاميد'!$B$5:$B$56<>\"\",ROW('بينات التلاميد'!$B$5:$B$56)-ROW($B$5)+1),ROWS($B$2:B837))))","v":""}]
[null,{"$f":"IF(ROWS($B$2:B838)>'بينات التلاميد'!$Q$5,\"\",INDEX('بينات التلاميد'!$B$5:$B$56,SMALL(IF('بينات التلاميد'!$B$5:$B$56<>\"\",ROW('بينات التلاميد'!$B$5:$B$56)-ROW($B$5)+1),ROWS($B$2:B838))))","v":""}]
[null,{"$f":"IF(ROWS($B$2:B839)>'بينات التلاميد'!$Q$5,\"\",INDEX('بينات التلاميد'!$B$5:$B$56,SMALL(IF('بينات التلاميد'!$B$5:$B$56<>\"\",ROW('بينات التلاميد'!$B$5:$B$56)-ROW($B$5)+1),ROWS($B$2:B839))))","v":""}]
[null,{"$f":"IF(ROWS($B$2:B840)>'بينات التلاميد'!$Q$5,\"\",INDEX('بينات التلاميد'!$B$5:$B$56,SMALL(IF('بينات التلاميد'!$B$5:$B$56<>\"\",ROW('بينات التلاميد'!$B$5:$B$56)-ROW($B$5)+1),ROWS($B$2:B840))))","v":""}]
[null,{"$f":"IF(ROWS($B$2:B841)>'بينات التلاميد'!$Q$5,\"\",INDEX('بينات التلاميد'!$B$5:$B$56,SMALL(IF('بينات التلاميد'!$B$5:$B$56<>\"\",ROW('بينات التلاميد'!$B$5:$B$56)-ROW($B$5)+1),ROWS($B$2:B841))))","v":""}]
[null,{"$f":"IF(ROWS($B$2:B842)>'بينات التلاميد'!$Q$5,\"\",INDEX('بينات التلاميد'!$B$5:$B$56,SMALL(IF('بينات التلاميد'!$B$5:$B$56<>\"\",ROW('بينات التلاميد'!$B$5:$B$56)-ROW($B$5)+1),ROWS($B$2:B842))))","v":""}]
[null,{"$f":"IF(ROWS($B$2:B843)>'بينات التلاميد'!$Q$5,\"\",INDEX('بينات التلاميد'!$B$5:$B$56,SMALL(IF('بينات التلاميد'!$B$5:$B$56<>\"\",ROW('بينات التلاميد'!$B$5:$B$56)-ROW($B$5)+1),ROWS($B$2:B843))))","v":""}]
[null,{"$f":"IF(ROWS($B$2:B844)>'بينات التلاميد'!$Q$5,\"\",INDEX('بينات التلاميد'!$B$5:$B$56,SMALL(IF('بينات التلاميد'!$B$5:$B$56<>\"\",ROW('بينات التلاميد'!$B$5:$B$56)-ROW($B$5)+1),ROWS($B$2:B844))))","v":""}]
[null,{"$f":"IF(ROWS($B$2:B845)>'بينات التلاميد'!$Q$5,\"\",INDEX('بينات التلاميد'!$B$5:$B$56,SMALL(IF('بينات التلاميد'!$B$5:$B$56<>\"\",ROW('بينات التلاميد'!$B$5:$B$56)-ROW($B$5)+1),ROWS($B$2:B845))))","v":""}]
[null,{"$f":"IF(ROWS($B$2:B846)>'بينات التلاميد'!$Q$5,\"\",INDEX('بينات التلاميد'!$B$5:$B$56,SMALL(IF('بينات التلاميد'!$B$5:$B$56<>\"\",ROW('بينات التلاميد'!$B$5:$B$56)-ROW($B$5)+1),ROWS($B$2:B846))))","v":""}]
[null,{"$f":"IF(ROWS($B$2:B847)>'بينات التلاميد'!$Q$5,\"\",INDEX('بينات التلاميد'!$B$5:$B$56,SMALL(IF('بينات التلاميد'!$B$5:$B$56<>\"\",ROW('بينات التلاميد'!$B$5:$B$56)-ROW($B$5)+1),ROWS($B$2:B847))))","v":""}]
[null,{"$f":"IF(ROWS($B$2:B848)>'بينات التلاميد'!$Q$5,\"\",INDEX('بينات التلاميد'!$B$5:$B$56,SMALL(IF('بينات التلاميد'!$B$5:$B$56<>\"\",ROW('بينات التلاميد'!$B$5:$B$56)-ROW($B$5)+1),ROWS($B$2:B848))))","v":""}]
[null,{"$f":"IF(ROWS($B$2:B849)>'بينات التلاميد'!$Q$5,\"\",INDEX('بينات التلاميد'!$B$5:$B$56,SMALL(IF('بينات التلاميد'!$B$5:$B$56<>\"\",ROW('بينات التلاميد'!$B$5:$B$56)-ROW($B$5)+1),ROWS($B$2:B849))))","v":""}]
[null,{"$f":"IF(ROWS($B$2:B850)>'بينات التلاميد'!$Q$5,\"\",INDEX('بينات التلاميد'!$B$5:$B$56,SMALL(IF('بينات التلاميد'!$B$5:$B$56<>\"\",ROW('بينات التلاميد'!$B$5:$B$56)-ROW($B$5)+1),ROWS($B$2:B850))))","v":""}]
[null,{"$f":"IF(ROWS($B$2:B851)>'بينات التلاميد'!$Q$5,\"\",INDEX('بينات التلاميد'!$B$5:$B$56,SMALL(IF('بينات التلاميد'!$B$5:$B$56<>\"\",ROW('بينات التلاميد'!$B$5:$B$56)-ROW($B$5)+1),ROWS($B$2:B851))))","v":""}]
[null,{"$f":"IF(ROWS($B$2:B852)>'بينات التلاميد'!$Q$5,\"\",INDEX('بينات التلاميد'!$B$5:$B$56,SMALL(IF('بينات التلاميد'!$B$5:$B$56<>\"\",ROW('بينات التلاميد'!$B$5:$B$56)-ROW($B$5)+1),ROWS($B$2:B852))))","v":""}]
[null,{"$f":"IF(ROWS($B$2:B853)>'بينات التلاميد'!$Q$5,\"\",INDEX('بينات التلاميد'!$B$5:$B$56,SMALL(IF('بينات التلاميد'!$B$5:$B$56<>\"\",ROW('بينات التلاميد'!$B$5:$B$56)-ROW($B$5)+1),ROWS($B$2:B853))))","v":""}]
[null,{"$f":"IF(ROWS($B$2:B854)>'بينات التلاميد'!$Q$5,\"\",INDEX('بينات التلاميد'!$B$5:$B$56,SMALL(IF('بينات التلاميد'!$B$5:$B$56<>\"\",ROW('بينات التلاميد'!$B$5:$B$56)-ROW($B$5)+1),ROWS($B$2:B854))))","v":""}]
[null,{"$f":"IF(ROWS($B$2:B855)>'بينات التلاميد'!$Q$5,\"\",INDEX('بينات التلاميد'!$B$5:$B$56,SMALL(IF('بينات التلاميد'!$B$5:$B$56<>\"\",ROW('بينات التلاميد'!$B$5:$B$56)-ROW($B$5)+1),ROWS($B$2:B855))))","v":""}]
[null,{"$f":"IF(ROWS($B$2:B856)>'بينات التلاميد'!$Q$5,\"\",INDEX('بينات التلاميد'!$B$5:$B$56,SMALL(IF('بينات التلاميد'!$B$5:$B$56<>\"\",ROW('بينات التلاميد'!$B$5:$B$56)-ROW($B$5)+1),ROWS($B$2:B856))))","v":""}]
[null,{"$f":"IF(ROWS($B$2:B857)>'بينات التلاميد'!$Q$5,\"\",INDEX('بينات التلاميد'!$B$5:$B$56,SMALL(IF('بينات التلاميد'!$B$5:$B$56<>\"\",ROW('بينات التلاميد'!$B$5:$B$56)-ROW($B$5)+1),ROWS($B$2:B857))))","v":""}]
[null,{"$f":"IF(ROWS($B$2:B858)>'بينات التلاميد'!$Q$5,\"\",INDEX('بينات التلاميد'!$B$5:$B$56,SMALL(IF('بينات التلاميد'!$B$5:$B$56<>\"\",ROW('بينات التلاميد'!$B$5:$B$56)-ROW($B$5)+1),ROWS($B$2:B858))))","v":""}]
[null,{"$f":"IF(ROWS($B$2:B859)>'بينات التلاميد'!$Q$5,\"\",INDEX('بينات التلاميد'!$B$5:$B$56,SMALL(IF('بينات التلاميد'!$B$5:$B$56<>\"\",ROW('بينات التلاميد'!$B$5:$B$56)-ROW($B$5)+1),ROWS($B$2:B859))))","v":""}]
[null,{"$f":"IF(ROWS($B$2:B860)>'بينات التلاميد'!$Q$5,\"\",INDEX('بينات التلاميد'!$B$5:$B$56,SMALL(IF('بينات التلاميد'!$B$5:$B$56<>\"\",ROW('بينات التلاميد'!$B$5:$B$56)-ROW($B$5)+1),ROWS($B$2:B860))))","v":""}]
[null,{"$f":"IF(ROWS($B$2:B861)>'بينات التلاميد'!$Q$5,\"\",INDEX('بينات التلاميد'!$B$5:$B$56,SMALL(IF('بينات التلاميد'!$B$5:$B$56<>\"\",ROW('بينات التلاميد'!$B$5:$B$56)-ROW($B$5)+1),ROWS($B$2:B861))))","v":""}]
[null,{"$f":"IF(ROWS($B$2:B862)>'بينات التلاميد'!$Q$5,\"\",INDEX('بينات التلاميد'!$B$5:$B$56,SMALL(IF('بينات التلاميد'!$B$5:$B$56<>\"\",ROW('بينات التلاميد'!$B$5:$B$56)-ROW($B$5)+1),ROWS($B$2:B862))))","v":""}]
[null,{"$f":"IF(ROWS($B$2:B863)>'بينات التلاميد'!$Q$5,\"\",INDEX('بينات التلاميد'!$B$5:$B$56,SMALL(IF('بينات التلاميد'!$B$5:$B$56<>\"\",ROW('بينات التلاميد'!$B$5:$B$56)-ROW($B$5)+1),ROWS($B$2:B863))))","v":""}]
[null,{"$f":"IF(ROWS($B$2:B864)>'بينات التلاميد'!$Q$5,\"\",INDEX('بينات التلاميد'!$B$5:$B$56,SMALL(IF('بينات التلاميد'!$B$5:$B$56<>\"\",ROW('بينات التلاميد'!$B$5:$B$56)-ROW($B$5)+1),ROWS($B$2:B864))))","v":""}]
[null,{"$f":"IF(ROWS($B$2:B865)>'بينات التلاميد'!$Q$5,\"\",INDEX('بينات التلاميد'!$B$5:$B$56,SMALL(IF('بينات التلاميد'!$B$5:$B$56<>\"\",ROW('بينات التلاميد'!$B$5:$B$56)-ROW($B$5)+1),ROWS($B$2:B865))))","v":""}]
[null,{"$f":"IF(ROWS($B$2:B866)>'بينات التلاميد'!$Q$5,\"\",INDEX('بينات التلاميد'!$B$5:$B$56,SMALL(IF('بينات التلاميد'!$B$5:$B$56<>\"\",ROW('بينات التلاميد'!$B$5:$B$56)-ROW($B$5)+1),ROWS($B$2:B866))))","v":""}]
[null,{"$f":"IF(ROWS($B$2:B867)>'بينات التلاميد'!$Q$5,\"\",INDEX('بينات التلاميد'!$B$5:$B$56,SMALL(IF('بينات التلاميد'!$B$5:$B$56<>\"\",ROW('بينات التلاميد'!$B$5:$B$56)-ROW($B$5)+1),ROWS($B$2:B867))))","v":""}]
[null,{"$f":"IF(ROWS($B$2:B868)>'بينات التلاميد'!$Q$5,\"\",INDEX('بينات التلاميد'!$B$5:$B$56,SMALL(IF('بينات التلاميد'!$B$5:$B$56<>\"\",ROW('بينات التلاميد'!$B$5:$B$56)-ROW($B$5)+1),ROWS($B$2:B868))))","v":""}]
[null,{"$f":"IF(ROWS($B$2:B869)>'بينات التلاميد'!$Q$5,\"\",INDEX('بينات التلاميد'!$B$5:$B$56,SMALL(IF('بينات التلاميد'!$B$5:$B$56<>\"\",ROW('بينات التلاميد'!$B$5:$B$56)-ROW($B$5)+1),ROWS($B$2:B869))))","v":""}]
[null,{"$f":"IF(ROWS($B$2:B870)>'بينات التلاميد'!$Q$5,\"\",INDEX('بينات التلاميد'!$B$5:$B$56,SMALL(IF('بينات التلاميد'!$B$5:$B$56<>\"\",ROW('بينات التلاميد'!$B$5:$B$56)-ROW($B$5)+1),ROWS($B$2:B870))))","v":""}]
[null,{"$f":"IF(ROWS($B$2:B871)>'بينات التلاميد'!$Q$5,\"\",INDEX('بينات التلاميد'!$B$5:$B$56,SMALL(IF('بينات التلاميد'!$B$5:$B$56<>\"\",ROW('بينات التلاميد'!$B$5:$B$56)-ROW($B$5)+1),ROWS($B$2:B871))))","v":""}]
[null,{"$f":"IF(ROWS($B$2:B872)>'بينات التلاميد'!$Q$5,\"\",INDEX('بينات التلاميد'!$B$5:$B$56,SMALL(IF('بينات التلاميد'!$B$5:$B$56<>\"\",ROW('بينات التلاميد'!$B$5:$B$56)-ROW($B$5)+1),ROWS($B$2:B872))))","v":""}]
[null,{"$f":"IF(ROWS($B$2:B873)>'بينات التلاميد'!$Q$5,\"\",INDEX('بينات التلاميد'!$B$5:$B$56,SMALL(IF('بينات التلاميد'!$B$5:$B$56<>\"\",ROW('بينات التلاميد'!$B$5:$B$56)-ROW($B$5)+1),ROWS($B$2:B873))))","v":""}]
[null,{"$f":"IF(ROWS($B$2:B874)>'بينات التلاميد'!$Q$5,\"\",INDEX('بينات التلاميد'!$B$5:$B$56,SMALL(IF('بينات التلاميد'!$B$5:$B$56<>\"\",ROW('بينات التلاميد'!$B$5:$B$56)-ROW($B$5)+1),ROWS($B$2:B874))))","v":""}]
[null,{"$f":"IF(ROWS($B$2:B875)>'بينات التلاميد'!$Q$5,\"\",INDEX('بينات التلاميد'!$B$5:$B$56,SMALL(IF('بينات التلاميد'!$B$5:$B$56<>\"\",ROW('بينات التلاميد'!$B$5:$B$56)-ROW($B$5)+1),ROWS($B$2:B875))))","v":""}]
[null,{"$f":"IF(ROWS($B$2:B876)>'بينات التلاميد'!$Q$5,\"\",INDEX('بينات التلاميد'!$B$5:$B$56,SMALL(IF('بينات التلاميد'!$B$5:$B$56<>\"\",ROW('بينات التلاميد'!$B$5:$B$56)-ROW($B$5)+1),ROWS($B$2:B876))))","v":""}]
[null,{"$f":"IF(ROWS($B$2:B877)>'بينات التلاميد'!$Q$5,\"\",INDEX('بينات التلاميد'!$B$5:$B$56,SMALL(IF('بينات التلاميد'!$B$5:$B$56<>\"\",ROW('بينات التلاميد'!$B$5:$B$56)-ROW($B$5)+1),ROWS($B$2:B877))))","v":""}]
[null,{"$f":"IF(ROWS($B$2:B878)>'بينات التلاميد'!$Q$5,\"\",INDEX('بينات التلاميد'!$B$5:$B$56,SMALL(IF('بينات التلاميد'!$B$5:$B$56<>\"\",ROW('بينات التلاميد'!$B$5:$B$56)-ROW($B$5)+1),ROWS($B$2:B878))))","v":""}]
[null,{"$f":"IF(ROWS($B$2:B879)>'بينات التلاميد'!$Q$5,\"\",INDEX('بينات التلاميد'!$B$5:$B$56,SMALL(IF('بينات التلاميد'!$B$5:$B$56<>\"\",ROW('بينات التلاميد'!$B$5:$B$56)-ROW($B$5)+1),ROWS($B$2:B879))))","v":""}]
[null,{"$f":"IF(ROWS($B$2:B880)>'بينات التلاميد'!$Q$5,\"\",INDEX('بينات التلاميد'!$B$5:$B$56,SMALL(IF('بينات التلاميد'!$B$5:$B$56<>\"\",ROW('بينات التلاميد'!$B$5:$B$56)-ROW($B$5)+1),ROWS($B$2:B880))))","v":""}]
[null,{"$f":"IF(ROWS($B$2:B881)>'بينات التلاميد'!$Q$5,\"\",INDEX('بينات التلاميد'!$B$5:$B$56,SMALL(IF('بينات التلاميد'!$B$5:$B$56<>\"\",ROW('بينات التلاميد'!$B$5:$B$56)-ROW($B$5)+1),ROWS($B$2:B881))))","v":""}]
[null,{"$f":"IF(ROWS($B$2:B882)>'بينات التلاميد'!$Q$5,\"\",INDEX('بينات التلاميد'!$B$5:$B$56,SMALL(IF('بينات التلاميد'!$B$5:$B$56<>\"\",ROW('بينات التلاميد'!$B$5:$B$56)-ROW($B$5)+1),ROWS($B$2:B882))))","v":""}]
[null,{"$f":"IF(ROWS($B$2:B883)>'بينات التلاميد'!$Q$5,\"\",INDEX('بينات التلاميد'!$B$5:$B$56,SMALL(IF('بينات التلاميد'!$B$5:$B$56<>\"\",ROW('بينات التلاميد'!$B$5:$B$56)-ROW($B$5)+1),ROWS($B$2:B883))))","v":""}]
[null,{"$f":"IF(ROWS($B$2:B884)>'بينات التلاميد'!$Q$5,\"\",INDEX('بينات التلاميد'!$B$5:$B$56,SMALL(IF('بينات التلاميد'!$B$5:$B$56<>\"\",ROW('بينات التلاميد'!$B$5:$B$56)-ROW($B$5)+1),ROWS($B$2:B884))))","v":""}]
[null,{"$f":"IF(ROWS($B$2:B885)>'بينات التلاميد'!$Q$5,\"\",INDEX('بينات التلاميد'!$B$5:$B$56,SMALL(IF('بينات التلاميد'!$B$5:$B$56<>\"\",ROW('بينات التلاميد'!$B$5:$B$56)-ROW($B$5)+1),ROWS($B$2:B885))))","v":""}]
[null,{"$f":"IF(ROWS($B$2:B886)>'بينات التلاميد'!$Q$5,\"\",INDEX('بينات التلاميد'!$B$5:$B$56,SMALL(IF('بينات التلاميد'!$B$5:$B$56<>\"\",ROW('بينات التلاميد'!$B$5:$B$56)-ROW($B$5)+1),ROWS($B$2:B886))))","v":""}]
[null,{"$f":"IF(ROWS($B$2:B887)>'بينات التلاميد'!$Q$5,\"\",INDEX('بينات التلاميد'!$B$5:$B$56,SMALL(IF('بينات التلاميد'!$B$5:$B$56<>\"\",ROW('بينات التلاميد'!$B$5:$B$56)-ROW($B$5)+1),ROWS($B$2:B887))))","v":""}]
[null,{"$f":"IF(ROWS($B$2:B888)>'بينات التلاميد'!$Q$5,\"\",INDEX('بينات التلاميد'!$B$5:$B$56,SMALL(IF('بينات التلاميد'!$B$5:$B$56<>\"\",ROW('بينات التلاميد'!$B$5:$B$56)-ROW($B$5)+1),ROWS($B$2:B888))))","v":""}]
[null,{"$f":"IF(ROWS($B$2:B889)>'بينات التلاميد'!$Q$5,\"\",INDEX('بينات التلاميد'!$B$5:$B$56,SMALL(IF('بينات التلاميد'!$B$5:$B$56<>\"\",ROW('بينات التلاميد'!$B$5:$B$56)-ROW($B$5)+1),ROWS($B$2:B889))))","v":""}]
[null,{"$f":"IF(ROWS($B$2:B890)>'بينات التلاميد'!$Q$5,\"\",INDEX('بينات التلاميد'!$B$5:$B$56,SMALL(IF('بينات التلاميد'!$B$5:$B$56<>\"\",ROW('بينات التلاميد'!$B$5:$B$56)-ROW($B$5)+1),ROWS($B$2:B890))))","v":""}]
[null,{"$f":"IF(ROWS($B$2:B891)>'بينات التلاميد'!$Q$5,\"\",INDEX('بينات التلاميد'!$B$5:$B$56,SMALL(IF('بينات التلاميد'!$B$5:$B$56<>\"\",ROW('بينات التلاميد'!$B$5:$B$56)-ROW($B$5)+1),ROWS($B$2:B891))))","v":""}]
[null,{"$f":"IF(ROWS($B$2:B892)>'بينات التلاميد'!$Q$5,\"\",INDEX('بينات التلاميد'!$B$5:$B$56,SMALL(IF('بينات التلاميد'!$B$5:$B$56<>\"\",ROW('بينات التلاميد'!$B$5:$B$56)-ROW($B$5)+1),ROWS($B$2:B892))))","v":""}]
[null,{"$f":"IF(ROWS($B$2:B893)>'بينات التلاميد'!$Q$5,\"\",INDEX('بينات التلاميد'!$B$5:$B$56,SMALL(IF('بينات التلاميد'!$B$5:$B$56<>\"\",ROW('بينات التلاميد'!$B$5:$B$56)-ROW($B$5)+1),ROWS($B$2:B893))))","v":""}]
[null,{"$f":"IF(ROWS($B$2:B894)>'بينات التلاميد'!$Q$5,\"\",INDEX('بينات التلاميد'!$B$5:$B$56,SMALL(IF('بينات التلاميد'!$B$5:$B$56<>\"\",ROW('بينات التلاميد'!$B$5:$B$56)-ROW($B$5)+1),ROWS($B$2:B894))))","v":""}]
[null,{"$f":"IF(ROWS($B$2:B895)>'بينات التلاميد'!$Q$5,\"\",INDEX('بينات التلاميد'!$B$5:$B$56,SMALL(IF('بينات التلاميد'!$B$5:$B$56<>\"\",ROW('بينات التلاميد'!$B$5:$B$56)-ROW($B$5)+1),ROWS($B$2:B895))))","v":""}]
[null,{"$f":"IF(ROWS($B$2:B896)>'بينات التلاميد'!$Q$5,\"\",INDEX('بينات التلاميد'!$B$5:$B$56,SMALL(IF('بينات التلاميد'!$B$5:$B$56<>\"\",ROW('بينات التلاميد'!$B$5:$B$56)-ROW($B$5)+1),ROWS($B$2:B896))))","v":""}]
[null,{"$f":"IF(ROWS($B$2:B897)>'بينات التلاميد'!$Q$5,\"\",INDEX('بينات التلاميد'!$B$5:$B$56,SMALL(IF('بينات التلاميد'!$B$5:$B$56<>\"\",ROW('بينات التلاميد'!$B$5:$B$56)-ROW($B$5)+1),ROWS($B$2:B897))))","v":""}]
[null,{"$f":"IF(ROWS($B$2:B898)>'بينات التلاميد'!$Q$5,\"\",INDEX('بينات التلاميد'!$B$5:$B$56,SMALL(IF('بينات التلاميد'!$B$5:$B$56<>\"\",ROW('بينات التلاميد'!$B$5:$B$56)-ROW($B$5)+1),ROWS($B$2:B898))))","v":""}]
[null,{"$f":"IF(ROWS($B$2:B899)>'بينات التلاميد'!$Q$5,\"\",INDEX('بينات التلاميد'!$B$5:$B$56,SMALL(IF('بينات التلاميد'!$B$5:$B$56<>\"\",ROW('بينات التلاميد'!$B$5:$B$56)-ROW($B$5)+1),ROWS($B$2:B899))))","v":""}]
[null,{"$f":"IF(ROWS($B$2:B900)>'بينات التلاميد'!$Q$5,\"\",INDEX('بينات التلاميد'!$B$5:$B$56,SMALL(IF('بينات التلاميد'!$B$5:$B$56<>\"\",ROW('بينات التلاميد'!$B$5:$B$56)-ROW($B$5)+1),ROWS($B$2:B900))))","v":""}]
[null,{"$f":"IF(ROWS($B$2:B901)>'بينات التلاميد'!$Q$5,\"\",INDEX('بينات التلاميد'!$B$5:$B$56,SMALL(IF('بينات التلاميد'!$B$5:$B$56<>\"\",ROW('بينات التلاميد'!$B$5:$B$56)-ROW($B$5)+1),ROWS($B$2:B901))))","v":""}]
[null,{"$f":"IF(ROWS($B$2:B902)>'بينات التلاميد'!$Q$5,\"\",INDEX('بينات التلاميد'!$B$5:$B$56,SMALL(IF('بينات التلاميد'!$B$5:$B$56<>\"\",ROW('بينات التلاميد'!$B$5:$B$56)-ROW($B$5)+1),ROWS($B$2:B902))))","v":""}]
[null,{"$f":"IF(ROWS($B$2:B903)>'بينات التلاميد'!$Q$5,\"\",INDEX('بينات التلاميد'!$B$5:$B$56,SMALL(IF('بينات التلاميد'!$B$5:$B$56<>\"\",ROW('بينات التلاميد'!$B$5:$B$56)-ROW($B$5)+1),ROWS($B$2:B903))))","v":""}]
[null,{"$f":"IF(ROWS($B$2:B904)>'بينات التلاميد'!$Q$5,\"\",INDEX('بينات التلاميد'!$B$5:$B$56,SMALL(IF('بينات التلاميد'!$B$5:$B$56<>\"\",ROW('بينات التلاميد'!$B$5:$B$56)-ROW($B$5)+1),ROWS($B$2:B904))))","v":""}]
[null,{"$f":"IF(ROWS($B$2:B905)>'بينات التلاميد'!$Q$5,\"\",INDEX('بينات التلاميد'!$B$5:$B$56,SMALL(IF('بينات التلاميد'!$B$5:$B$56<>\"\",ROW('بينات التلاميد'!$B$5:$B$56)-ROW($B$5)+1),ROWS($B$2:B905))))","v":""}]
[null,{"$f":"IF(ROWS($B$2:B906)>'بينات التلاميد'!$Q$5,\"\",INDEX('بينات التلاميد'!$B$5:$B$56,SMALL(IF('بينات التلاميد'!$B$5:$B$56<>\"\",ROW('بينات التلاميد'!$B$5:$B$56)-ROW($B$5)+1),ROWS($B$2:B906))))","v":""}]
[null,{"$f":"IF(ROWS($B$2:B907)>'بينات التلاميد'!$Q$5,\"\",INDEX('بينات التلاميد'!$B$5:$B$56,SMALL(IF('بينات التلاميد'!$B$5:$B$56<>\"\",ROW('بينات التلاميد'!$B$5:$B$56)-ROW($B$5)+1),ROWS($B$2:B907))))","v":""}]
[null,{"$f":"IF(ROWS($B$2:B908)>'بينات التلاميد'!$Q$5,\"\",INDEX('بينات التلاميد'!$B$5:$B$56,SMALL(IF('بينات التلاميد'!$B$5:$B$56<>\"\",ROW('بينات التلاميد'!$B$5:$B$56)-ROW($B$5)+1),ROWS($B$2:B908))))","v":""}]
[null,{"$f":"IF(ROWS($B$2:B909)>'بينات التلاميد'!$Q$5,\"\",INDEX('بينات التلاميد'!$B$5:$B$56,SMALL(IF('بينات التلاميد'!$B$5:$B$56<>\"\",ROW('بينات التلاميد'!$B$5:$B$56)-ROW($B$5)+1),ROWS($B$2:B909))))","v":""}]
[null,{"$f":"IF(ROWS($B$2:B910)>'بينات التلاميد'!$Q$5,\"\",INDEX('بينات التلاميد'!$B$5:$B$56,SMALL(IF('بينات التلاميد'!$B$5:$B$56<>\"\",ROW('بينات التلاميد'!$B$5:$B$56)-ROW($B$5)+1),ROWS($B$2:B910))))","v":""}]
[null,{"$f":"IF(ROWS($B$2:B911)>'بينات التلاميد'!$Q$5,\"\",INDEX('بينات التلاميد'!$B$5:$B$56,SMALL(IF('بينات التلاميد'!$B$5:$B$56<>\"\",ROW('بينات التلاميد'!$B$5:$B$56)-ROW($B$5)+1),ROWS($B$2:B911))))","v":""}]
[null,{"$f":"IF(ROWS($B$2:B912)>'بينات التلاميد'!$Q$5,\"\",INDEX('بينات التلاميد'!$B$5:$B$56,SMALL(IF('بينات التلاميد'!$B$5:$B$56<>\"\",ROW('بينات التلاميد'!$B$5:$B$56)-ROW($B$5)+1),ROWS($B$2:B912))))","v":""}]
[null,{"$f":"IF(ROWS($B$2:B913)>'بينات التلاميد'!$Q$5,\"\",INDEX('بينات التلاميد'!$B$5:$B$56,SMALL(IF('بينات التلاميد'!$B$5:$B$56<>\"\",ROW('بينات التلاميد'!$B$5:$B$56)-ROW($B$5)+1),ROWS($B$2:B913))))","v":""}]
[null,{"$f":"IF(ROWS($B$2:B914)>'بينات التلاميد'!$Q$5,\"\",INDEX('بينات التلاميد'!$B$5:$B$56,SMALL(IF('بينات التلاميد'!$B$5:$B$56<>\"\",ROW('بينات التلاميد'!$B$5:$B$56)-ROW($B$5)+1),ROWS($B$2:B914))))","v":""}]
[null,{"$f":"IF(ROWS($B$2:B915)>'بينات التلاميد'!$Q$5,\"\",INDEX('بينات التلاميد'!$B$5:$B$56,SMALL(IF('بينات التلاميد'!$B$5:$B$56<>\"\",ROW('بينات التلاميد'!$B$5:$B$56)-ROW($B$5)+1),ROWS($B$2:B915))))","v":""}]
[null,{"$f":"IF(ROWS($B$2:B916)>'بينات التلاميد'!$Q$5,\"\",INDEX('بينات التلاميد'!$B$5:$B$56,SMALL(IF('بينات التلاميد'!$B$5:$B$56<>\"\",ROW('بينات التلاميد'!$B$5:$B$56)-ROW($B$5)+1),ROWS($B$2:B916))))","v":""}]
[null,{"$f":"IF(ROWS($B$2:B917)>'بينات التلاميد'!$Q$5,\"\",INDEX('بينات التلاميد'!$B$5:$B$56,SMALL(IF('بينات التلاميد'!$B$5:$B$56<>\"\",ROW('بينات التلاميد'!$B$5:$B$56)-ROW($B$5)+1),ROWS($B$2:B917))))","v":""}]
[null,{"$f":"IF(ROWS($B$2:B918)>'بينات التلاميد'!$Q$5,\"\",INDEX('بينات التلاميد'!$B$5:$B$56,SMALL(IF('بينات التلاميد'!$B$5:$B$56<>\"\",ROW('بينات التلاميد'!$B$5:$B$56)-ROW($B$5)+1),ROWS($B$2:B918))))","v":""}]
[null,{"$f":"IF(ROWS($B$2:B919)>'بينات التلاميد'!$Q$5,\"\",INDEX('بينات التلاميد'!$B$5:$B$56,SMALL(IF('بينات التلاميد'!$B$5:$B$56<>\"\",ROW('بينات التلاميد'!$B$5:$B$56)-ROW($B$5)+1),ROWS($B$2:B919))))","v":""}]
[null,{"$f":"IF(ROWS($B$2:B920)>'بينات التلاميد'!$Q$5,\"\",INDEX('بينات التلاميد'!$B$5:$B$56,SMALL(IF('بينات التلاميد'!$B$5:$B$56<>\"\",ROW('بينات التلاميد'!$B$5:$B$56)-ROW($B$5)+1),ROWS($B$2:B920))))","v":""}]
[null,{"$f":"IF(ROWS($B$2:B921)>'بينات التلاميد'!$Q$5,\"\",INDEX('بينات التلاميد'!$B$5:$B$56,SMALL(IF('بينات التلاميد'!$B$5:$B$56<>\"\",ROW('بينات التلاميد'!$B$5:$B$56)-ROW($B$5)+1),ROWS($B$2:B921))))","v":""}]
[null,{"$f":"IF(ROWS($B$2:B922)>'بينات التلاميد'!$Q$5,\"\",INDEX('بينات التلاميد'!$B$5:$B$56,SMALL(IF('بينات التلاميد'!$B$5:$B$56<>\"\",ROW('بينات التلاميد'!$B$5:$B$56)-ROW($B$5)+1),ROWS($B$2:B922))))","v":""}]
[null,{"$f":"IF(ROWS($B$2:B923)>'بينات التلاميد'!$Q$5,\"\",INDEX('بينات التلاميد'!$B$5:$B$56,SMALL(IF('بينات التلاميد'!$B$5:$B$56<>\"\",ROW('بينات التلاميد'!$B$5:$B$56)-ROW($B$5)+1),ROWS($B$2:B923))))","v":""}]
[null,{"$f":"IF(ROWS($B$2:B924)>'بينات التلاميد'!$Q$5,\"\",INDEX('بينات التلاميد'!$B$5:$B$56,SMALL(IF('بينات التلاميد'!$B$5:$B$56<>\"\",ROW('بينات التلاميد'!$B$5:$B$56)-ROW($B$5)+1),ROWS($B$2:B924))))","v":""}]
[null,{"$f":"IF(ROWS($B$2:B925)>'بينات التلاميد'!$Q$5,\"\",INDEX('بينات التلاميد'!$B$5:$B$56,SMALL(IF('بينات التلاميد'!$B$5:$B$56<>\"\",ROW('بينات التلاميد'!$B$5:$B$56)-ROW($B$5)+1),ROWS($B$2:B925))))","v":""}]
[null,{"$f":"IF(ROWS($B$2:B926)>'بينات التلاميد'!$Q$5,\"\",INDEX('بينات التلاميد'!$B$5:$B$56,SMALL(IF('بينات التلاميد'!$B$5:$B$56<>\"\",ROW('بينات التلاميد'!$B$5:$B$56)-ROW($B$5)+1),ROWS($B$2:B926))))","v":""}]
[null,{"$f":"IF(ROWS($B$2:B927)>'بينات التلاميد'!$Q$5,\"\",INDEX('بينات التلاميد'!$B$5:$B$56,SMALL(IF('بينات التلاميد'!$B$5:$B$56<>\"\",ROW('بينات التلاميد'!$B$5:$B$56)-ROW($B$5)+1),ROWS($B$2:B927))))","v":""}]
[null,{"$f":"IF(ROWS($B$2:B928)>'بينات التلاميد'!$Q$5,\"\",INDEX('بينات التلاميد'!$B$5:$B$56,SMALL(IF('بينات التلاميد'!$B$5:$B$56<>\"\",ROW('بينات التلاميد'!$B$5:$B$56)-ROW($B$5)+1),ROWS($B$2:B928))))","v":""}]
[null,{"$f":"IF(ROWS($B$2:B929)>'بينات التلاميد'!$Q$5,\"\",INDEX('بينات التلاميد'!$B$5:$B$56,SMALL(IF('بينات التلاميد'!$B$5:$B$56<>\"\",ROW('بينات التلاميد'!$B$5:$B$56)-ROW($B$5)+1),ROWS($B$2:B929))))","v":""}]
[null,{"$f":"IF(ROWS($B$2:B930)>'بينات التلاميد'!$Q$5,\"\",INDEX('بينات التلاميد'!$B$5:$B$56,SMALL(IF('بينات التلاميد'!$B$5:$B$56<>\"\",ROW('بينات التلاميد'!$B$5:$B$56)-ROW($B$5)+1),ROWS($B$2:B930))))","v":""}]
[null,{"$f":"IF(ROWS($B$2:B931)>'بينات التلاميد'!$Q$5,\"\",INDEX('بينات التلاميد'!$B$5:$B$56,SMALL(IF('بينات التلاميد'!$B$5:$B$56<>\"\",ROW('بينات التلاميد'!$B$5:$B$56)-ROW($B$5)+1),ROWS($B$2:B931))))","v":""}]
[null,{"$f":"IF(ROWS($B$2:B932)>'بينات التلاميد'!$Q$5,\"\",INDEX('بينات التلاميد'!$B$5:$B$56,SMALL(IF('بينات التلاميد'!$B$5:$B$56<>\"\",ROW('بينات التلاميد'!$B$5:$B$56)-ROW($B$5)+1),ROWS($B$2:B932))))","v":""}]
[null,{"$f":"IF(ROWS($B$2:B933)>'بينات التلاميد'!$Q$5,\"\",INDEX('بينات التلاميد'!$B$5:$B$56,SMALL(IF('بينات التلاميد'!$B$5:$B$56<>\"\",ROW('بينات التلاميد'!$B$5:$B$56)-ROW($B$5)+1),ROWS($B$2:B933))))","v":""}]
[null,{"$f":"IF(ROWS($B$2:B934)>'بينات التلاميد'!$Q$5,\"\",INDEX('بينات التلاميد'!$B$5:$B$56,SMALL(IF('بينات التلاميد'!$B$5:$B$56<>\"\",ROW('بينات التلاميد'!$B$5:$B$56)-ROW($B$5)+1),ROWS($B$2:B934))))","v":""}]
[null,{"$f":"IF(ROWS($B$2:B935)>'بينات التلاميد'!$Q$5,\"\",INDEX('بينات التلاميد'!$B$5:$B$56,SMALL(IF('بينات التلاميد'!$B$5:$B$56<>\"\",ROW('بينات التلاميد'!$B$5:$B$56)-ROW($B$5)+1),ROWS($B$2:B935))))","v":""}]
[null,{"$f":"IF(ROWS($B$2:B936)>'بينات التلاميد'!$Q$5,\"\",INDEX('بينات التلاميد'!$B$5:$B$56,SMALL(IF('بينات التلاميد'!$B$5:$B$56<>\"\",ROW('بينات التلاميد'!$B$5:$B$56)-ROW($B$5)+1),ROWS($B$2:B936))))","v":""}]
[null,{"$f":"IF(ROWS($B$2:B937)>'بينات التلاميد'!$Q$5,\"\",INDEX('بينات التلاميد'!$B$5:$B$56,SMALL(IF('بينات التلاميد'!$B$5:$B$56<>\"\",ROW('بينات التلاميد'!$B$5:$B$56)-ROW($B$5)+1),ROWS($B$2:B937))))","v":""}]
[null,{"$f":"IF(ROWS($B$2:B938)>'بينات التلاميد'!$Q$5,\"\",INDEX('بينات التلاميد'!$B$5:$B$56,SMALL(IF('بينات التلاميد'!$B$5:$B$56<>\"\",ROW('بينات التلاميد'!$B$5:$B$56)-ROW($B$5)+1),ROWS($B$2:B938))))","v":""}]
[null,{"$f":"IF(ROWS($B$2:B939)>'بينات التلاميد'!$Q$5,\"\",INDEX('بينات التلاميد'!$B$5:$B$56,SMALL(IF('بينات التلاميد'!$B$5:$B$56<>\"\",ROW('بينات التلاميد'!$B$5:$B$56)-ROW($B$5)+1),ROWS($B$2:B939))))","v":""}]
[null,{"$f":"IF(ROWS($B$2:B940)>'بينات التلاميد'!$Q$5,\"\",INDEX('بينات التلاميد'!$B$5:$B$56,SMALL(IF('بينات التلاميد'!$B$5:$B$56<>\"\",ROW('بينات التلاميد'!$B$5:$B$56)-ROW($B$5)+1),ROWS($B$2:B940))))","v":""}]
[null,{"$f":"IF(ROWS($B$2:B941)>'بينات التلاميد'!$Q$5,\"\",INDEX('بينات التلاميد'!$B$5:$B$56,SMALL(IF('بينات التلاميد'!$B$5:$B$56<>\"\",ROW('بينات التلاميد'!$B$5:$B$56)-ROW($B$5)+1),ROWS($B$2:B941))))","v":""}]
[null,{"$f":"IF(ROWS($B$2:B942)>'بينات التلاميد'!$Q$5,\"\",INDEX('بينات التلاميد'!$B$5:$B$56,SMALL(IF('بينات التلاميد'!$B$5:$B$56<>\"\",ROW('بينات التلاميد'!$B$5:$B$56)-ROW($B$5)+1),ROWS($B$2:B942))))","v":""}]
[null,{"$f":"IF(ROWS($B$2:B943)>'بينات التلاميد'!$Q$5,\"\",INDEX('بينات التلاميد'!$B$5:$B$56,SMALL(IF('بينات التلاميد'!$B$5:$B$56<>\"\",ROW('بينات التلاميد'!$B$5:$B$56)-ROW($B$5)+1),ROWS($B$2:B943))))","v":""}]
[null,{"$f":"IF(ROWS($B$2:B944)>'بينات التلاميد'!$Q$5,\"\",INDEX('بينات التلاميد'!$B$5:$B$56,SMALL(IF('بينات التلاميد'!$B$5:$B$56<>\"\",ROW('بينات التلاميد'!$B$5:$B$56)-ROW($B$5)+1),ROWS($B$2:B944))))","v":""}]
[null,{"$f":"IF(ROWS($B$2:B945)>'بينات التلاميد'!$Q$5,\"\",INDEX('بينات التلاميد'!$B$5:$B$56,SMALL(IF('بينات التلاميد'!$B$5:$B$56<>\"\",ROW('بينات التلاميد'!$B$5:$B$56)-ROW($B$5)+1),ROWS($B$2:B945))))","v":""}]
[null,{"$f":"IF(ROWS($B$2:B946)>'بينات التلاميد'!$Q$5,\"\",INDEX('بينات التلاميد'!$B$5:$B$56,SMALL(IF('بينات التلاميد'!$B$5:$B$56<>\"\",ROW('بينات التلاميد'!$B$5:$B$56)-ROW($B$5)+1),ROWS($B$2:B946))))","v":""}]
[null,{"$f":"IF(ROWS($B$2:B947)>'بينات التلاميد'!$Q$5,\"\",INDEX('بينات التلاميد'!$B$5:$B$56,SMALL(IF('بينات التلاميد'!$B$5:$B$56<>\"\",ROW('بينات التلاميد'!$B$5:$B$56)-ROW($B$5)+1),ROWS($B$2:B947))))","v":""}]
[null,{"$f":"IF(ROWS($B$2:B948)>'بينات التلاميد'!$Q$5,\"\",INDEX('بينات التلاميد'!$B$5:$B$56,SMALL(IF('بينات التلاميد'!$B$5:$B$56<>\"\",ROW('بينات التلاميد'!$B$5:$B$56)-ROW($B$5)+1),ROWS($B$2:B948))))","v":""}]
[null,{"$f":"IF(ROWS($B$2:B949)>'بينات التلاميد'!$Q$5,\"\",INDEX('بينات التلاميد'!$B$5:$B$56,SMALL(IF('بينات التلاميد'!$B$5:$B$56<>\"\",ROW('بينات التلاميد'!$B$5:$B$56)-ROW($B$5)+1),ROWS($B$2:B949))))","v":""}]
[null,{"$f":"IF(ROWS($B$2:B950)>'بينات التلاميد'!$Q$5,\"\",INDEX('بينات التلاميد'!$B$5:$B$56,SMALL(IF('بينات التلاميد'!$B$5:$B$56<>\"\",ROW('بينات التلاميد'!$B$5:$B$56)-ROW($B$5)+1),ROWS($B$2:B950))))","v":""}]
[null,{"$f":"IF(ROWS($B$2:B951)>'بينات التلاميد'!$Q$5,\"\",INDEX('بينات التلاميد'!$B$5:$B$56,SMALL(IF('بينات التلاميد'!$B$5:$B$56<>\"\",ROW('بينات التلاميد'!$B$5:$B$56)-ROW($B$5)+1),ROWS($B$2:B951))))","v":""}]
[null,{"$f":"IF(ROWS($B$2:B952)>'بينات التلاميد'!$Q$5,\"\",INDEX('بينات التلاميد'!$B$5:$B$56,SMALL(IF('بينات التلاميد'!$B$5:$B$56<>\"\",ROW('بينات التلاميد'!$B$5:$B$56)-ROW($B$5)+1),ROWS($B$2:B952))))","v":""}]
[null,{"$f":"IF(ROWS($B$2:B953)>'بينات التلاميد'!$Q$5,\"\",INDEX('بينات التلاميد'!$B$5:$B$56,SMALL(IF('بينات التلاميد'!$B$5:$B$56<>\"\",ROW('بينات التلاميد'!$B$5:$B$56)-ROW($B$5)+1),ROWS($B$2:B953))))","v":""}]
[null,{"$f":"IF(ROWS($B$2:B954)>'بينات التلاميد'!$Q$5,\"\",INDEX('بينات التلاميد'!$B$5:$B$56,SMALL(IF('بينات التلاميد'!$B$5:$B$56<>\"\",ROW('بينات التلاميد'!$B$5:$B$56)-ROW($B$5)+1),ROWS($B$2:B954))))","v":""}]
[null,{"$f":"IF(ROWS($B$2:B955)>'بينات التلاميد'!$Q$5,\"\",INDEX('بينات التلاميد'!$B$5:$B$56,SMALL(IF('بينات التلاميد'!$B$5:$B$56<>\"\",ROW('بينات التلاميد'!$B$5:$B$56)-ROW($B$5)+1),ROWS($B$2:B955))))","v":""}]
[null,{"$f":"IF(ROWS($B$2:B956)>'بينات التلاميد'!$Q$5,\"\",INDEX('بينات التلاميد'!$B$5:$B$56,SMALL(IF('بينات التلاميد'!$B$5:$B$56<>\"\",ROW('بينات التلاميد'!$B$5:$B$56)-ROW($B$5)+1),ROWS($B$2:B956))))","v":""}]
[null,{"$f":"IF(ROWS($B$2:B957)>'بينات التلاميد'!$Q$5,\"\",INDEX('بينات التلاميد'!$B$5:$B$56,SMALL(IF('بينات التلاميد'!$B$5:$B$56<>\"\",ROW('بينات التلاميد'!$B$5:$B$56)-ROW($B$5)+1),ROWS($B$2:B957))))","v":""}]
[null,{"$f":"IF(ROWS($B$2:B958)>'بينات التلاميد'!$Q$5,\"\",INDEX('بينات التلاميد'!$B$5:$B$56,SMALL(IF('بينات التلاميد'!$B$5:$B$56<>\"\",ROW('بينات التلاميد'!$B$5:$B$56)-ROW($B$5)+1),ROWS($B$2:B958))))","v":""}]
[null,{"$f":"IF(ROWS($B$2:B959)>'بينات التلاميد'!$Q$5,\"\",INDEX('بينات التلاميد'!$B$5:$B$56,SMALL(IF('بينات التلاميد'!$B$5:$B$56<>\"\",ROW('بينات التلاميد'!$B$5:$B$56)-ROW($B$5)+1),ROWS($B$2:B959))))","v":""}]
[null,{"$f":"IF(ROWS($B$2:B960)>'بينات التلاميد'!$Q$5,\"\",INDEX('بينات التلاميد'!$B$5:$B$56,SMALL(IF('بينات التلاميد'!$B$5:$B$56<>\"\",ROW('بينات التلاميد'!$B$5:$B$56)-ROW($B$5)+1),ROWS($B$2:B960))))","v":""}]
[null,{"$f":"IF(ROWS($B$2:B961)>'بينات التلاميد'!$Q$5,\"\",INDEX('بينات التلاميد'!$B$5:$B$56,SMALL(IF('بينات التلاميد'!$B$5:$B$56<>\"\",ROW('بينات التلاميد'!$B$5:$B$56)-ROW($B$5)+1),ROWS($B$2:B961))))","v":""}]
[null,{"$f":"IF(ROWS($B$2:B962)>'بينات التلاميد'!$Q$5,\"\",INDEX('بينات التلاميد'!$B$5:$B$56,SMALL(IF('بينات التلاميد'!$B$5:$B$56<>\"\",ROW('بينات التلاميد'!$B$5:$B$56)-ROW($B$5)+1),ROWS($B$2:B962))))","v":""}]
[null,{"$f":"IF(ROWS($B$2:B963)>'بينات التلاميد'!$Q$5,\"\",INDEX('بينات التلاميد'!$B$5:$B$56,SMALL(IF('بينات التلاميد'!$B$5:$B$56<>\"\",ROW('بينات التلاميد'!$B$5:$B$56)-ROW($B$5)+1),ROWS($B$2:B963))))","v":""}]
[null,{"$f":"IF(ROWS($B$2:B964)>'بينات التلاميد'!$Q$5,\"\",INDEX('بينات التلاميد'!$B$5:$B$56,SMALL(IF('بينات التلاميد'!$B$5:$B$56<>\"\",ROW('بينات التلاميد'!$B$5:$B$56)-ROW($B$5)+1),ROWS($B$2:B964))))","v":""}]
[null,{"$f":"IF(ROWS($B$2:B965)>'بينات التلاميد'!$Q$5,\"\",INDEX('بينات التلاميد'!$B$5:$B$56,SMALL(IF('بينات التلاميد'!$B$5:$B$56<>\"\",ROW('بينات التلاميد'!$B$5:$B$56)-ROW($B$5)+1),ROWS($B$2:B965))))","v":""}]
[null,{"$f":"IF(ROWS($B$2:B966)>'بينات التلاميد'!$Q$5,\"\",INDEX('بينات التلاميد'!$B$5:$B$56,SMALL(IF('بينات التلاميد'!$B$5:$B$56<>\"\",ROW('بينات التلاميد'!$B$5:$B$56)-ROW($B$5)+1),ROWS($B$2:B966))))","v":""}]
[null,{"$f":"IF(ROWS($B$2:B967)>'بينات التلاميد'!$Q$5,\"\",INDEX('بينات التلاميد'!$B$5:$B$56,SMALL(IF('بينات التلاميد'!$B$5:$B$56<>\"\",ROW('بينات التلاميد'!$B$5:$B$56)-ROW($B$5)+1),ROWS($B$2:B967))))","v":""}]
[null,{"$f":"IF(ROWS($B$2:B968)>'بينات التلاميد'!$Q$5,\"\",INDEX('بينات التلاميد'!$B$5:$B$56,SMALL(IF('بينات التلاميد'!$B$5:$B$56<>\"\",ROW('بينات التلاميد'!$B$5:$B$56)-ROW($B$5)+1),ROWS($B$2:B968))))","v":""}]
[null,{"$f":"IF(ROWS($B$2:B969)>'بينات التلاميد'!$Q$5,\"\",INDEX('بينات التلاميد'!$B$5:$B$56,SMALL(IF('بينات التلاميد'!$B$5:$B$56<>\"\",ROW('بينات التلاميد'!$B$5:$B$56)-ROW($B$5)+1),ROWS($B$2:B969))))","v":""}]
[null,{"$f":"IF(ROWS($B$2:B970)>'بينات التلاميد'!$Q$5,\"\",INDEX('بينات التلاميد'!$B$5:$B$56,SMALL(IF('بينات التلاميد'!$B$5:$B$56<>\"\",ROW('بينات التلاميد'!$B$5:$B$56)-ROW($B$5)+1),ROWS($B$2:B970))))","v":""}]
[null,{"$f":"IF(ROWS($B$2:B971)>'بينات التلاميد'!$Q$5,\"\",INDEX('بينات التلاميد'!$B$5:$B$56,SMALL(IF('بينات التلاميد'!$B$5:$B$56<>\"\",ROW('بينات التلاميد'!$B$5:$B$56)-ROW($B$5)+1),ROWS($B$2:B971))))","v":""}]
[null,{"$f":"IF(ROWS($B$2:B972)>'بينات التلاميد'!$Q$5,\"\",INDEX('بينات التلاميد'!$B$5:$B$56,SMALL(IF('بينات التلاميد'!$B$5:$B$56<>\"\",ROW('بينات التلاميد'!$B$5:$B$56)-ROW($B$5)+1),ROWS($B$2:B972))))","v":""}]
[null,{"$f":"IF(ROWS($B$2:B973)>'بينات التلاميد'!$Q$5,\"\",INDEX('بينات التلاميد'!$B$5:$B$56,SMALL(IF('بينات التلاميد'!$B$5:$B$56<>\"\",ROW('بينات التلاميد'!$B$5:$B$56)-ROW($B$5)+1),ROWS($B$2:B973))))","v":""}]
[null,{"$f":"IF(ROWS($B$2:B974)>'بينات التلاميد'!$Q$5,\"\",INDEX('بينات التلاميد'!$B$5:$B$56,SMALL(IF('بينات التلاميد'!$B$5:$B$56<>\"\",ROW('بينات التلاميد'!$B$5:$B$56)-ROW($B$5)+1),ROWS($B$2:B974))))","v":""}]
[null,{"$f":"IF(ROWS($B$2:B975)>'بينات التلاميد'!$Q$5,\"\",INDEX('بينات التلاميد'!$B$5:$B$56,SMALL(IF('بينات التلاميد'!$B$5:$B$56<>\"\",ROW('بينات التلاميد'!$B$5:$B$56)-ROW($B$5)+1),ROWS($B$2:B975))))","v":""}]
[null,{"$f":"IF(ROWS($B$2:B976)>'بينات التلاميد'!$Q$5,\"\",INDEX('بينات التلاميد'!$B$5:$B$56,SMALL(IF('بينات التلاميد'!$B$5:$B$56<>\"\",ROW('بينات التلاميد'!$B$5:$B$56)-ROW($B$5)+1),ROWS($B$2:B976))))","v":""}]
[null,{"$f":"IF(ROWS($B$2:B977)>'بينات التلاميد'!$Q$5,\"\",INDEX('بينات التلاميد'!$B$5:$B$56,SMALL(IF('بينات التلاميد'!$B$5:$B$56<>\"\",ROW('بينات التلاميد'!$B$5:$B$56)-ROW($B$5)+1),ROWS($B$2:B977))))","v":""}]
[null,{"$f":"IF(ROWS($B$2:B978)>'بينات التلاميد'!$Q$5,\"\",INDEX('بينات التلاميد'!$B$5:$B$56,SMALL(IF('بينات التلاميد'!$B$5:$B$56<>\"\",ROW('بينات التلاميد'!$B$5:$B$56)-ROW($B$5)+1),ROWS($B$2:B978))))","v":""}]
[null,{"$f":"IF(ROWS($B$2:B979)>'بينات التلاميد'!$Q$5,\"\",INDEX('بينات التلاميد'!$B$5:$B$56,SMALL(IF('بينات التلاميد'!$B$5:$B$56<>\"\",ROW('بينات التلاميد'!$B$5:$B$56)-ROW($B$5)+1),ROWS($B$2:B979))))","v":""}]
[null,{"$f":"IF(ROWS($B$2:B980)>'بينات التلاميد'!$Q$5,\"\",INDEX('بينات التلاميد'!$B$5:$B$56,SMALL(IF('بينات التلاميد'!$B$5:$B$56<>\"\",ROW('بينات التلاميد'!$B$5:$B$56)-ROW($B$5)+1),ROWS($B$2:B980))))","v":""}]
[null,{"$f":"IF(ROWS($B$2:B981)>'بينات التلاميد'!$Q$5,\"\",INDEX('بينات التلاميد'!$B$5:$B$56,SMALL(IF('بينات التلاميد'!$B$5:$B$56<>\"\",ROW('بينات التلاميد'!$B$5:$B$56)-ROW($B$5)+1),ROWS($B$2:B981))))","v":""}]
[null,{"$f":"IF(ROWS($B$2:B982)>'بينات التلاميد'!$Q$5,\"\",INDEX('بينات التلاميد'!$B$5:$B$56,SMALL(IF('بينات التلاميد'!$B$5:$B$56<>\"\",ROW('بينات التلاميد'!$B$5:$B$56)-ROW($B$5)+1),ROWS($B$2:B982))))","v":""}]
[null,{"$f":"IF(ROWS($B$2:B983)>'بينات التلاميد'!$Q$5,\"\",INDEX('بينات التلاميد'!$B$5:$B$56,SMALL(IF('بينات التلاميد'!$B$5:$B$56<>\"\",ROW('بينات التلاميد'!$B$5:$B$56)-ROW($B$5)+1),ROWS($B$2:B983))))","v":""}]
[null,{"$f":"IF(ROWS($B$2:B984)>'بينات التلاميد'!$Q$5,\"\",INDEX('بينات التلاميد'!$B$5:$B$56,SMALL(IF('بينات التلاميد'!$B$5:$B$56<>\"\",ROW('بينات التلاميد'!$B$5:$B$56)-ROW($B$5)+1),ROWS($B$2:B984))))","v":""}]
[null,{"$f":"IF(ROWS($B$2:B985)>'بينات التلاميد'!$Q$5,\"\",INDEX('بينات التلاميد'!$B$5:$B$56,SMALL(IF('بينات التلاميد'!$B$5:$B$56<>\"\",ROW('بينات التلاميد'!$B$5:$B$56)-ROW($B$5)+1),ROWS($B$2:B985))))","v":""}]
[null,{"$f":"IF(ROWS($B$2:B986)>'بينات التلاميد'!$Q$5,\"\",INDEX('بينات التلاميد'!$B$5:$B$56,SMALL(IF('بينات التلاميد'!$B$5:$B$56<>\"\",ROW('بينات التلاميد'!$B$5:$B$56)-ROW($B$5)+1),ROWS($B$2:B986))))","v":""}]
[null,{"$f":"IF(ROWS($B$2:B987)>'بينات التلاميد'!$Q$5,\"\",INDEX('بينات التلاميد'!$B$5:$B$56,SMALL(IF('بينات التلاميد'!$B$5:$B$56<>\"\",ROW('بينات التلاميد'!$B$5:$B$56)-ROW($B$5)+1),ROWS($B$2:B987))))","v":""}]
[null,{"$f":"IF(ROWS($B$2:B988)>'بينات التلاميد'!$Q$5,\"\",INDEX('بينات التلاميد'!$B$5:$B$56,SMALL(IF('بينات التلاميد'!$B$5:$B$56<>\"\",ROW('بينات التلاميد'!$B$5:$B$56)-ROW($B$5)+1),ROWS($B$2:B988))))","v":""}]
[null,{"$f":"IF(ROWS($B$2:B989)>'بينات التلاميد'!$Q$5,\"\",INDEX('بينات التلاميد'!$B$5:$B$56,SMALL(IF('بينات التلاميد'!$B$5:$B$56<>\"\",ROW('بينات التلاميد'!$B$5:$B$56)-ROW($B$5)+1),ROWS($B$2:B989))))","v":""}]
[null,{"$f":"IF(ROWS($B$2:B990)>'بينات التلاميد'!$Q$5,\"\",INDEX('بينات التلاميد'!$B$5:$B$56,SMALL(IF('بينات التلاميد'!$B$5:$B$56<>\"\",ROW('بينات التلاميد'!$B$5:$B$56)-ROW($B$5)+1),ROWS($B$2:B990))))","v":""}]
[null,{"$f":"IF(ROWS($B$2:B991)>'بينات التلاميد'!$Q$5,\"\",INDEX('بينات التلاميد'!$B$5:$B$56,SMALL(IF('بينات التلاميد'!$B$5:$B$56<>\"\",ROW('بينات التلاميد'!$B$5:$B$56)-ROW($B$5)+1),ROWS($B$2:B991))))","v":""}]
[null,{"$f":"IF(ROWS($B$2:B992)>'بينات التلاميد'!$Q$5,\"\",INDEX('بينات التلاميد'!$B$5:$B$56,SMALL(IF('بينات التلاميد'!$B$5:$B$56<>\"\",ROW('بينات التلاميد'!$B$5:$B$56)-ROW($B$5)+1),ROWS($B$2:B992))))","v":""}]
[null,{"$f":"IF(ROWS($B$2:B993)>'بينات التلاميد'!$Q$5,\"\",INDEX('بينات التلاميد'!$B$5:$B$56,SMALL(IF('بينات التلاميد'!$B$5:$B$56<>\"\",ROW('بينات التلاميد'!$B$5:$B$56)-ROW($B$5)+1),ROWS($B$2:B993))))","v":""}]
[null,{"$f":"IF(ROWS($B$2:B994)>'بينات التلاميد'!$Q$5,\"\",INDEX('بينات التلاميد'!$B$5:$B$56,SMALL(IF('بينات التلاميد'!$B$5:$B$56<>\"\",ROW('بينات التلاميد'!$B$5:$B$56)-ROW($B$5)+1),ROWS($B$2:B994))))","v":""}]
[null,{"$f":"IF(ROWS($B$2:B995)>'بينات التلاميد'!$Q$5,\"\",INDEX('بينات التلاميد'!$B$5:$B$56,SMALL(IF('بينات التلاميد'!$B$5:$B$56<>\"\",ROW('بينات التلاميد'!$B$5:$B$56)-ROW($B$5)+1),ROWS($B$2:B995))))","v":""}]
[null,{"$f":"IF(ROWS($B$2:B996)>'بينات التلاميد'!$Q$5,\"\",INDEX('بينات التلاميد'!$B$5:$B$56,SMALL(IF('بينات التلاميد'!$B$5:$B$56<>\"\",ROW('بينات التلاميد'!$B$5:$B$56)-ROW($B$5)+1),ROWS($B$2:B996))))","v":""}]
[null,{"$f":"IF(ROWS($B$2:B997)>'بينات التلاميد'!$Q$5,\"\",INDEX('بينات التلاميد'!$B$5:$B$56,SMALL(IF('بينات التلاميد'!$B$5:$B$56<>\"\",ROW('بينات التلاميد'!$B$5:$B$56)-ROW($B$5)+1),ROWS($B$2:B997))))","v":""}]
[null,{"$f":"IF(ROWS($B$2:B998)>'بينات التلاميد'!$Q$5,\"\",INDEX('بينات التلاميد'!$B$5:$B$56,SMALL(IF('بينات التلاميد'!$B$5:$B$56<>\"\",ROW('بينات التلاميد'!$B$5:$B$56)-ROW($B$5)+1),ROWS($B$2:B998))))","v":""}]
[null,{"$f":"IF(ROWS($B$2:B999)>'بينات التلاميد'!$Q$5,\"\",INDEX('بينات التلاميد'!$B$5:$B$56,SMALL(IF('بينات التلاميد'!$B$5:$B$56<>\"\",ROW('بينات التلاميد'!$B$5:$B$56)-ROW($B$5)+1),ROWS($B$2:B999))))","v":""}]
[null,{"$f":"IF(ROWS($B$2:B1000)>'بينات التلاميد'!$Q$5,\"\",INDEX('بينات التلاميد'!$B$5:$B$56,SMALL(IF('بينات التلاميد'!$B$5:$B$56<>\"\",ROW('بينات التلاميد'!$B$5:$B$56)-ROW($B$5)+1),ROWS($B$2:B1000))))","v":""}]
[null,{"$f":"IF(ROWS($B$2:B1001)>'بينات التلاميد'!$Q$5,\"\",INDEX('بينات التلاميد'!$B$5:$B$56,SMALL(IF('بينات التلاميد'!$B$5:$B$56<>\"\",ROW('بينات التلاميد'!$B$5:$B$56)-ROW($B$5)+1),ROWS($B$2:B1001))))","v":""}]
[null,{"$f":"IF(ROWS($B$2:B1002)>'بينات التلاميد'!$Q$5,\"\",INDEX('بينات التلاميد'!$B$5:$B$56,SMALL(IF('بينات التلاميد'!$B$5:$B$56<>\"\",ROW('بينات التلاميد'!$B$5:$B$56)-ROW($B$5)+1),ROWS($B$2:B1002))))","v":""}]
[null,{"$f":"IF(ROWS($B$2:B1003)>'بينات التلاميد'!$Q$5,\"\",INDEX('بينات التلاميد'!$B$5:$B$56,SMALL(IF('بينات التلاميد'!$B$5:$B$56<>\"\",ROW('بينات التلاميد'!$B$5:$B$56)-ROW($B$5)+1),ROWS($B$2:B1003))))","v":""}]
[null,{"$f":"IF(ROWS($B$2:B1004)>'بينات التلاميد'!$Q$5,\"\",INDEX('بينات التلاميد'!$B$5:$B$56,SMALL(IF('بينات التلاميد'!$B$5:$B$56<>\"\",ROW('بينات التلاميد'!$B$5:$B$56)-ROW($B$5)+1),ROWS($B$2:B1004))))","v":""}]
[null,{"$f":"IF(ROWS($B$2:B1005)>'بينات التلاميد'!$Q$5,\"\",INDEX('بينات التلاميد'!$B$5:$B$56,SMALL(IF('بينات التلاميد'!$B$5:$B$56<>\"\",ROW('بينات التلاميد'!$B$5:$B$56)-ROW($B$5)+1),ROWS($B$2:B1005))))","v":""}]
[null,{"$f":"IF(ROWS($B$2:B1006)>'بينات التلاميد'!$Q$5,\"\",INDEX('بينات التلاميد'!$B$5:$B$56,SMALL(IF('بينات التلاميد'!$B$5:$B$56<>\"\",ROW('بينات التلاميد'!$B$5:$B$56)-ROW($B$5)+1),ROWS($B$2:B1006))))","v":""}]
[null,{"$f":"IF(ROWS($B$2:B1007)>'بينات التلاميد'!$Q$5,\"\",INDEX('بينات التلاميد'!$B$5:$B$56,SMALL(IF('بينات التلاميد'!$B$5:$B$56<>\"\",ROW('بينات التلاميد'!$B$5:$B$56)-ROW($B$5)+1),ROWS($B$2:B1007))))","v":""}]
[null,{"$f":"IF(ROWS($B$2:B1008)>'بينات التلاميد'!$Q$5,\"\",INDEX('بينات التلاميد'!$B$5:$B$56,SMALL(IF('بينات التلاميد'!$B$5:$B$56<>\"\",ROW('بينات التلاميد'!$B$5:$B$56)-ROW($B$5)+1),ROWS($B$2:B1008))))","v":""}]
[null,{"$f":"IF(ROWS($B$2:B1009)>'بينات التلاميد'!$Q$5,\"\",INDEX('بينات التلاميد'!$B$5:$B$56,SMALL(IF('بينات التلاميد'!$B$5:$B$56<>\"\",ROW('بينات التلاميد'!$B$5:$B$56)-ROW($B$5)+1),ROWS($B$2:B1009))))","v":""}]
[null,{"$f":"IF(ROWS($B$2:B1010)>'بينات التلاميد'!$Q$5,\"\",INDEX('بينات التلاميد'!$B$5:$B$56,SMALL(IF('بينات التلاميد'!$B$5:$B$56<>\"\",ROW('بينات التلاميد'!$B$5:$B$56)-ROW($B$5)+1),ROWS($B$2:B1010))))","v":""}]
[null,{"$f":"IF(ROWS($B$2:B1011)>'بينات التلاميد'!$Q$5,\"\",INDEX('بينات التلاميد'!$B$5:$B$56,SMALL(IF('بينات التلاميد'!$B$5:$B$56<>\"\",ROW('بينات التلاميد'!$B$5:$B$56)-ROW($B$5)+1),ROWS($B$2:B1011))))","v":""}]
[null,{"$f":"IF(ROWS($B$2:B1012)>'بينات التلاميد'!$Q$5,\"\",INDEX('بينات التلاميد'!$B$5:$B$56,SMALL(IF('بينات التلاميد'!$B$5:$B$56<>\"\",ROW('بينات التلاميد'!$B$5:$B$56)-ROW($B$5)+1),ROWS($B$2:B1012))))","v":""}]
[null,{"$f":"IF(ROWS($B$2:B1013)>'بينات التلاميد'!$Q$5,\"\",INDEX('بينات التلاميد'!$B$5:$B$56,SMALL(IF('بينات التلاميد'!$B$5:$B$56<>\"\",ROW('بينات التلاميد'!$B$5:$B$56)-ROW($B$5)+1),ROWS($B$2:B1013))))","v":""}]
[null,{"$f":"IF(ROWS($B$2:B1014)>'بينات التلاميد'!$Q$5,\"\",INDEX('بينات التلاميد'!$B$5:$B$56,SMALL(IF('بينات التلاميد'!$B$5:$B$56<>\"\",ROW('بينات التلاميد'!$B$5:$B$56)-ROW($B$5)+1),ROWS($B$2:B1014))))","v":""}]
[null,{"$f":"IF(ROWS($B$2:B1015)>'بينات التلاميد'!$Q$5,\"\",INDEX('بينات التلاميد'!$B$5:$B$56,SMALL(IF('بينات التلاميد'!$B$5:$B$56<>\"\",ROW('بينات التلاميد'!$B$5:$B$56)-ROW($B$5)+1),ROWS($B$2:B1015))))","v":""}]
[null,{"$f":"IF(ROWS($B$2:B1016)>'بينات التلاميد'!$Q$5,\"\",INDEX('بينات التلاميد'!$B$5:$B$56,SMALL(IF('بينات التلاميد'!$B$5:$B$56<>\"\",ROW('بينات التلاميد'!$B$5:$B$56)-ROW($B$5)+1),ROWS($B$2:B1016))))","v":""}]
[null,{"$f":"IF(ROWS($B$2:B1017)>'بينات التلاميد'!$Q$5,\"\",INDEX('بينات التلاميد'!$B$5:$B$56,SMALL(IF('بينات التلاميد'!$B$5:$B$56<>\"\",ROW('بينات التلاميد'!$B$5:$B$56)-ROW($B$5)+1),ROWS($B$2:B1017))))","v":""}]
[null,{"$f":"IF(ROWS($B$2:B1018)>'بينات التلاميد'!$Q$5,\"\",INDEX('بينات التلاميد'!$B$5:$B$56,SMALL(IF('بينات التلاميد'!$B$5:$B$56<>\"\",ROW('بينات التلاميد'!$B$5:$B$56)-ROW($B$5)+1),ROWS($B$2:B1018))))","v":""}]
[null,{"$f":"IF(ROWS($B$2:B1019)>'بينات التلاميد'!$Q$5,\"\",INDEX('بينات التلاميد'!$B$5:$B$56,SMALL(IF('بينات التلاميد'!$B$5:$B$56<>\"\",ROW('بينات التلاميد'!$B$5:$B$56)-ROW($B$5)+1),ROWS($B$2:B1019))))","v":""}]
[null,{"$f":"IF(ROWS($B$2:B1020)>'بينات التلاميد'!$Q$5,\"\",INDEX('بينات التلاميد'!$B$5:$B$56,SMALL(IF('بينات التلاميد'!$B$5:$B$56<>\"\",ROW('بينات التلاميد'!$B$5:$B$56)-ROW($B$5)+1),ROWS($B$2:B1020))))","v":""}]
[null,{"$f":"IF(ROWS($B$2:B1021)>'بينات التلاميد'!$Q$5,\"\",INDEX('بينات التلاميد'!$B$5:$B$56,SMALL(IF('بينات التلاميد'!$B$5:$B$56<>\"\",ROW('بينات التلاميد'!$B$5:$B$56)-ROW($B$5)+1),ROWS($B$2:B1021))))","v":""}]
[null,{"$f":"IF(ROWS($B$2:B1022)>'بينات التلاميد'!$Q$5,\"\",INDEX('بينات التلاميد'!$B$5:$B$56,SMALL(IF('بينات التلاميد'!$B$5:$B$56<>\"\",ROW('بينات التلاميد'!$B$5:$B$56)-ROW($B$5)+1),ROWS($B$2:B1022))))","v":""}]
[null,{"$f":"IF(ROWS($B$2:B1023)>'بينات التلاميد'!$Q$5,\"\",INDEX('بينات التلاميد'!$B$5:$B$56,SMALL(IF('بينات التلاميد'!$B$5:$B$56<>\"\",ROW('بينات التلاميد'!$B$5:$B$56)-ROW($B$5)+1),ROWS($B$2:B1023))))","v":""}]
[null,{"$f":"IF(ROWS($B$2:B1024)>'بينات التلاميد'!$Q$5,\"\",INDEX('بينات التلاميد'!$B$5:$B$56,SMALL(IF('بينات التلاميد'!$B$5:$B$56<>\"\",ROW('بينات التلاميد'!$B$5:$B$56)-ROW($B$5)+1),ROWS($B$2:B1024))))","v":""}]
[null,{"$f":"IF(ROWS($B$2:B1025)>'بينات التلاميد'!$Q$5,\"\",INDEX('بينات التلاميد'!$B$5:$B$56,SMALL(IF('بينات التلاميد'!$B$5:$B$56<>\"\",ROW('بينات التلاميد'!$B$5:$B$56)-ROW($B$5)+1),ROWS($B$2:B1025))))","v":""}]
[null,{"$f":"IF(ROWS($B$2:B1026)>'بينات التلاميد'!$Q$5,\"\",INDEX('بينات التلاميد'!$B$5:$B$56,SMALL(IF('بينات التلاميد'!$B$5:$B$56<>\"\",ROW('بينات التلاميد'!$B$5:$B$56)-ROW($B$5)+1),ROWS($B$2:B1026))))","v":""}]
[null,{"$f":"IF(ROWS($B$2:B1027)>'بينات التلاميد'!$Q$5,\"\",INDEX('بينات التلاميد'!$B$5:$B$56,SMALL(IF('بينات التلاميد'!$B$5:$B$56<>\"\",ROW('بينات التلاميد'!$B$5:$B$56)-ROW($B$5)+1),ROWS($B$2:B1027))))","v":""}]
[null,{"$f":"IF(ROWS($B$2:B1028)>'بينات التلاميد'!$Q$5,\"\",INDEX('بينات التلاميد'!$B$5:$B$56,SMALL(IF('بينات التلاميد'!$B$5:$B$56<>\"\",ROW('بينات التلاميد'!$B$5:$B$56)-ROW($B$5)+1),ROWS($B$2:B1028))))","v":""}]
[null,{"$f":"IF(ROWS($B$2:B1029)>'بينات التلاميد'!$Q$5,\"\",INDEX('بينات التلاميد'!$B$5:$B$56,SMALL(IF('بينات التلاميد'!$B$5:$B$56<>\"\",ROW('بينات التلاميد'!$B$5:$B$56)-ROW($B$5)+1),ROWS($B$2:B1029))))","v":""}]
[null,{"$f":"IF(ROWS($B$2:B1030)>'بينات التلاميد'!$Q$5,\"\",INDEX('بينات التلاميد'!$B$5:$B$56,SMALL(IF('بينات التلاميد'!$B$5:$B$56<>\"\",ROW('بينات التلاميد'!$B$5:$B$56)-ROW($B$5)+1),ROWS($B$2:B1030))))","v":""}]
[null,{"$f":"IF(ROWS($B$2:B1031)>'بينات التلاميد'!$Q$5,\"\",INDEX('بينات التلاميد'!$B$5:$B$56,SMALL(IF('بينات التلاميد'!$B$5:$B$56<>\"\",ROW('بينات التلاميد'!$B$5:$B$56)-ROW($B$5)+1),ROWS($B$2:B1031))))","v":""}]
[null,{"$f":"IF(ROWS($B$2:B1032)>'بينات التلاميد'!$Q$5,\"\",INDEX('بينات التلاميد'!$B$5:$B$56,SMALL(IF('بينات التلاميد'!$B$5:$B$56<>\"\",ROW('بينات التلاميد'!$B$5:$B$56)-ROW($B$5)+1),ROWS($B$2:B1032))))","v":""}]
[null,{"$f":"IF(ROWS($B$2:B1033)>'بينات التلاميد'!$Q$5,\"\",INDEX('بينات التلاميد'!$B$5:$B$56,SMALL(IF('بينات التلاميد'!$B$5:$B$56<>\"\",ROW('بينات التلاميد'!$B$5:$B$56)-ROW($B$5)+1),ROWS($B$2:B1033))))","v":""}]
[null,{"$f":"IF(ROWS($B$2:B1034)>'بينات التلاميد'!$Q$5,\"\",INDEX('بينات التلاميد'!$B$5:$B$56,SMALL(IF('بينات التلاميد'!$B$5:$B$56<>\"\",ROW('بينات التلاميد'!$B$5:$B$56)-ROW($B$5)+1),ROWS($B$2:B1034))))","v":""}]
[null,{"$f":"IF(ROWS($B$2:B1035)>'بينات التلاميد'!$Q$5,\"\",INDEX('بينات التلاميد'!$B$5:$B$56,SMALL(IF('بينات التلاميد'!$B$5:$B$56<>\"\",ROW('بينات التلاميد'!$B$5:$B$56)-ROW($B$5)+1),ROWS($B$2:B1035))))","v":""}]
[null,{"$f":"IF(ROWS($B$2:B1036)>'بينات التلاميد'!$Q$5,\"\",INDEX('بينات التلاميد'!$B$5:$B$56,SMALL(IF('بينات التلاميد'!$B$5:$B$56<>\"\",ROW('بينات التلاميد'!$B$5:$B$56)-ROW($B$5)+1),ROWS($B$2:B1036))))","v":""}]
[null,{"$f":"IF(ROWS($B$2:B1037)>'بينات التلاميد'!$Q$5,\"\",INDEX('بينات التلاميد'!$B$5:$B$56,SMALL(IF('بينات التلاميد'!$B$5:$B$56<>\"\",ROW('بينات التلاميد'!$B$5:$B$56)-ROW($B$5)+1),ROWS($B$2:B1037))))","v":""}]
[null,{"$f":"IF(ROWS($B$2:B1038)>'بينات التلاميد'!$Q$5,\"\",INDEX('بينات التلاميد'!$B$5:$B$56,SMALL(IF('بينات التلاميد'!$B$5:$B$56<>\"\",ROW('بينات التلاميد'!$B$5:$B$56)-ROW($B$5)+1),ROWS($B$2:B1038))))","v":""}]
[null,{"$f":"IF(ROWS($B$2:B1039)>'بينات التلاميد'!$Q$5,\"\",INDEX('بينات التلاميد'!$B$5:$B$56,SMALL(IF('بينات التلاميد'!$B$5:$B$56<>\"\",ROW('بينات التلاميد'!$B$5:$B$56)-ROW($B$5)+1),ROWS($B$2:B1039))))","v":""}]
[null,{"$f":"IF(ROWS($B$2:B1040)>'بينات التلاميد'!$Q$5,\"\",INDEX('بينات التلاميد'!$B$5:$B$56,SMALL(IF('بينات التلاميد'!$B$5:$B$56<>\"\",ROW('بينات التلاميد'!$B$5:$B$56)-ROW($B$5)+1),ROWS($B$2:B1040))))","v":""}]
[null,{"$f":"IF(ROWS($B$2:B1041)>'بينات التلاميد'!$Q$5,\"\",INDEX('بينات التلاميد'!$B$5:$B$56,SMALL(IF('بينات التلاميد'!$B$5:$B$56<>\"\",ROW('بينات التلاميد'!$B$5:$B$56)-ROW($B$5)+1),ROWS($B$2:B1041))))","v":""}]
[null,{"$f":"IF(ROWS($B$2:B1042)>'بينات التلاميد'!$Q$5,\"\",INDEX('بينات التلاميد'!$B$5:$B$56,SMALL(IF('بينات التلاميد'!$B$5:$B$56<>\"\",ROW('بينات التلاميد'!$B$5:$B$56)-ROW($B$5)+1),ROWS($B$2:B1042))))","v":""}]
[null,{"$f":"IF(ROWS($B$2:B1043)>'بينات التلاميد'!$Q$5,\"\",INDEX('بينات التلاميد'!$B$5:$B$56,SMALL(IF('بينات التلاميد'!$B$5:$B$56<>\"\",ROW('بينات التلاميد'!$B$5:$B$56)-ROW($B$5)+1),ROWS($B$2:B1043))))","v":""}]
[null,{"$f":"IF(ROWS($B$2:B1044)>'بينات التلاميد'!$Q$5,\"\",INDEX('بينات التلاميد'!$B$5:$B$56,SMALL(IF('بينات التلاميد'!$B$5:$B$56<>\"\",ROW('بينات التلاميد'!$B$5:$B$56)-ROW($B$5)+1),ROWS($B$2:B1044))))","v":""}]
[null,{"$f":"IF(ROWS($B$2:B1045)>'بينات التلاميد'!$Q$5,\"\",INDEX('بينات التلاميد'!$B$5:$B$56,SMALL(IF('بينات التلاميد'!$B$5:$B$56<>\"\",ROW('بينات التلاميد'!$B$5:$B$56)-ROW($B$5)+1),ROWS($B$2:B1045))))","v":""}]
[null,{"$f":"IF(ROWS($B$2:B1046)>'بينات التلاميد'!$Q$5,\"\",INDEX('بينات التلاميد'!$B$5:$B$56,SMALL(IF('بينات التلاميد'!$B$5:$B$56<>\"\",ROW('بينات التلاميد'!$B$5:$B$56)-ROW($B$5)+1),ROWS($B$2:B1046))))","v":""}]
[null,{"$f":"IF(ROWS($B$2:B1047)>'بينات التلاميد'!$Q$5,\"\",INDEX('بينات التلاميد'!$B$5:$B$56,SMALL(IF('بينات التلاميد'!$B$5:$B$56<>\"\",ROW('بينات التلاميد'!$B$5:$B$56)-ROW($B$5)+1),ROWS($B$2:B1047))))","v":""}]
[null,{"$f":"IF(ROWS($B$2:B1048)>'بينات التلاميد'!$Q$5,\"\",INDEX('بينات التلاميد'!$B$5:$B$56,SMALL(IF('بينات التلاميد'!$B$5:$B$56<>\"\",ROW('بينات التلاميد'!$B$5:$B$56)-ROW($B$5)+1),ROWS($B$2:B1048))))","v":""}]
[null,{"$f":"IF(ROWS($B$2:B1049)>'بينات التلاميد'!$Q$5,\"\",INDEX('بينات التلاميد'!$B$5:$B$56,SMALL(IF('بينات التلاميد'!$B$5:$B$56<>\"\",ROW('بينات التلاميد'!$B$5:$B$56)-ROW($B$5)+1),ROWS($B$2:B1049))))","v":""}]
[null,{"$f":"IF(ROWS($B$2:B1050)>'بينات التلاميد'!$Q$5,\"\",INDEX('بينات التلاميد'!$B$5:$B$56,SMALL(IF('بينات التلاميد'!$B$5:$B$56<>\"\",ROW('بينات التلاميد'!$B$5:$B$56)-ROW($B$5)+1),ROWS($B$2:B1050))))","v":""}]
[null,{"$f":"IF(ROWS($B$2:B1051)>'بينات التلاميد'!$Q$5,\"\",INDEX('بينات التلاميد'!$B$5:$B$56,SMALL(IF('بينات التلاميد'!$B$5:$B$56<>\"\",ROW('بينات التلاميد'!$B$5:$B$56)-ROW($B$5)+1),ROWS($B$2:B1051))))","v":""}]
[null,{"$f":"IF(ROWS($B$2:B1052)>'بينات التلاميد'!$Q$5,\"\",INDEX('بينات التلاميد'!$B$5:$B$56,SMALL(IF('بينات التلاميد'!$B$5:$B$56<>\"\",ROW('بينات التلاميد'!$B$5:$B$56)-ROW($B$5)+1),ROWS($B$2:B1052))))","v":""}]
[null,{"$f":"IF(ROWS($B$2:B1053)>'بينات التلاميد'!$Q$5,\"\",INDEX('بينات التلاميد'!$B$5:$B$56,SMALL(IF('بينات التلاميد'!$B$5:$B$56<>\"\",ROW('بينات التلاميد'!$B$5:$B$56)-ROW($B$5)+1),ROWS($B$2:B1053))))","v":""}]
[null,{"$f":"IF(ROWS($B$2:B1054)>'بينات التلاميد'!$Q$5,\"\",INDEX('بينات التلاميد'!$B$5:$B$56,SMALL(IF('بينات التلاميد'!$B$5:$B$56<>\"\",ROW('بينات التلاميد'!$B$5:$B$56)-ROW($B$5)+1),ROWS($B$2:B1054))))","v":""}]
[null,{"$f":"IF(ROWS($B$2:B1055)>'بينات التلاميد'!$Q$5,\"\",INDEX('بينات التلاميد'!$B$5:$B$56,SMALL(IF('بينات التلاميد'!$B$5:$B$56<>\"\",ROW('بينات التلاميد'!$B$5:$B$56)-ROW($B$5)+1),ROWS($B$2:B1055))))","v":""}]
[null,{"$f":"IF(ROWS($B$2:B1056)>'بينات التلاميد'!$Q$5,\"\",INDEX('بينات التلاميد'!$B$5:$B$56,SMALL(IF('بينات التلاميد'!$B$5:$B$56<>\"\",ROW('بينات التلاميد'!$B$5:$B$56)-ROW($B$5)+1),ROWS($B$2:B1056))))","v":""}]
[null,{"$f":"IF(ROWS($B$2:B1057)>'بينات التلاميد'!$Q$5,\"\",INDEX('بينات التلاميد'!$B$5:$B$56,SMALL(IF('بينات التلاميد'!$B$5:$B$56<>\"\",ROW('بينات التلاميد'!$B$5:$B$56)-ROW($B$5)+1),ROWS($B$2:B1057))))","v":""}]
[null,{"$f":"IF(ROWS($B$2:B1058)>'بينات التلاميد'!$Q$5,\"\",INDEX('بينات التلاميد'!$B$5:$B$56,SMALL(IF('بينات التلاميد'!$B$5:$B$56<>\"\",ROW('بينات التلاميد'!$B$5:$B$56)-ROW($B$5)+1),ROWS($B$2:B1058))))","v":""}]
[null,{"$f":"IF(ROWS($B$2:B1059)>'بينات التلاميد'!$Q$5,\"\",INDEX('بينات التلاميد'!$B$5:$B$56,SMALL(IF('بينات التلاميد'!$B$5:$B$56<>\"\",ROW('بينات التلاميد'!$B$5:$B$56)-ROW($B$5)+1),ROWS($B$2:B1059))))","v":""}]
[null,{"$f":"IF(ROWS($B$2:B1060)>'بينات التلاميد'!$Q$5,\"\",INDEX('بينات التلاميد'!$B$5:$B$56,SMALL(IF('بينات التلاميد'!$B$5:$B$56<>\"\",ROW('بينات التلاميد'!$B$5:$B$56)-ROW($B$5)+1),ROWS($B$2:B1060))))","v":""}]
[null,{"$f":"IF(ROWS($B$2:B1061)>'بينات التلاميد'!$Q$5,\"\",INDEX('بينات التلاميد'!$B$5:$B$56,SMALL(IF('بينات التلاميد'!$B$5:$B$56<>\"\",ROW('بينات التلاميد'!$B$5:$B$56)-ROW($B$5)+1),ROWS($B$2:B1061))))","v":""}]
[null,{"$f":"IF(ROWS($B$2:B1062)>'بينات التلاميد'!$Q$5,\"\",INDEX('بينات التلاميد'!$B$5:$B$56,SMALL(IF('بينات التلاميد'!$B$5:$B$56<>\"\",ROW('بينات التلاميد'!$B$5:$B$56)-ROW($B$5)+1),ROWS($B$2:B1062))))","v":""}]
[null,{"$f":"IF(ROWS($B$2:B1063)>'بينات التلاميد'!$Q$5,\"\",INDEX('بينات التلاميد'!$B$5:$B$56,SMALL(IF('بينات التلاميد'!$B$5:$B$56<>\"\",ROW('بينات التلاميد'!$B$5:$B$56)-ROW($B$5)+1),ROWS($B$2:B1063))))","v":""}]
[null,{"$f":"IF(ROWS($B$2:B1064)>'بينات التلاميد'!$Q$5,\"\",INDEX('بينات التلاميد'!$B$5:$B$56,SMALL(IF('بينات التلاميد'!$B$5:$B$56<>\"\",ROW('بينات التلاميد'!$B$5:$B$56)-ROW($B$5)+1),ROWS($B$2:B1064))))","v":""}]
[null,{"$f":"IF(ROWS($B$2:B1065)>'بينات التلاميد'!$Q$5,\"\",INDEX('بينات التلاميد'!$B$5:$B$56,SMALL(IF('بينات التلاميد'!$B$5:$B$56<>\"\",ROW('بينات التلاميد'!$B$5:$B$56)-ROW($B$5)+1),ROWS($B$2:B1065))))","v":""}]
[null,{"$f":"IF(ROWS($B$2:B1066)>'بينات التلاميد'!$Q$5,\"\",INDEX('بينات التلاميد'!$B$5:$B$56,SMALL(IF('بينات التلاميد'!$B$5:$B$56<>\"\",ROW('بينات التلاميد'!$B$5:$B$56)-ROW($B$5)+1),ROWS($B$2:B1066))))","v":""}]
[null,{"$f":"IF(ROWS($B$2:B1067)>'بينات التلاميد'!$Q$5,\"\",INDEX('بينات التلاميد'!$B$5:$B$56,SMALL(IF('بينات التلاميد'!$B$5:$B$56<>\"\",ROW('بينات التلاميد'!$B$5:$B$56)-ROW($B$5)+1),ROWS($B$2:B1067))))","v":""}]
[null,{"$f":"IF(ROWS($B$2:B1068)>'بينات التلاميد'!$Q$5,\"\",INDEX('بينات التلاميد'!$B$5:$B$56,SMALL(IF('بينات التلاميد'!$B$5:$B$56<>\"\",ROW('بينات التلاميد'!$B$5:$B$56)-ROW($B$5)+1),ROWS($B$2:B1068))))","v":""}]
[null,{"$f":"IF(ROWS($B$2:B1069)>'بينات التلاميد'!$Q$5,\"\",INDEX('بينات التلاميد'!$B$5:$B$56,SMALL(IF('بينات التلاميد'!$B$5:$B$56<>\"\",ROW('بينات التلاميد'!$B$5:$B$56)-ROW($B$5)+1),ROWS($B$2:B1069))))","v":""}]
[null,{"$f":"IF(ROWS($B$2:B1070)>'بينات التلاميد'!$Q$5,\"\",INDEX('بينات التلاميد'!$B$5:$B$56,SMALL(IF('بينات التلاميد'!$B$5:$B$56<>\"\",ROW('بينات التلاميد'!$B$5:$B$56)-ROW($B$5)+1),ROWS($B$2:B1070))))","v":""}]
[null,{"$f":"IF(ROWS($B$2:B1071)>'بينات التلاميد'!$Q$5,\"\",INDEX('بينات التلاميد'!$B$5:$B$56,SMALL(IF('بينات التلاميد'!$B$5:$B$56<>\"\",ROW('بينات التلاميد'!$B$5:$B$56)-ROW($B$5)+1),ROWS($B$2:B1071))))","v":""}]
[null,{"$f":"IF(ROWS($B$2:B1072)>'بينات التلاميد'!$Q$5,\"\",INDEX('بينات التلاميد'!$B$5:$B$56,SMALL(IF('بينات التلاميد'!$B$5:$B$56<>\"\",ROW('بينات التلاميد'!$B$5:$B$56)-ROW($B$5)+1),ROWS($B$2:B1072))))","v":""}]
[null,{"$f":"IF(ROWS($B$2:B1073)>'بينات التلاميد'!$Q$5,\"\",INDEX('بينات التلاميد'!$B$5:$B$56,SMALL(IF('بينات التلاميد'!$B$5:$B$56<>\"\",ROW('بينات التلاميد'!$B$5:$B$56)-ROW($B$5)+1),ROWS($B$2:B1073))))","v":""}]
[null,{"$f":"IF(ROWS($B$2:B1074)>'بينات التلاميد'!$Q$5,\"\",INDEX('بينات التلاميد'!$B$5:$B$56,SMALL(IF('بينات التلاميد'!$B$5:$B$56<>\"\",ROW('بينات التلاميد'!$B$5:$B$56)-ROW($B$5)+1),ROWS($B$2:B1074))))","v":""}]
[null,{"$f":"IF(ROWS($B$2:B1075)>'بينات التلاميد'!$Q$5,\"\",INDEX('بينات التلاميد'!$B$5:$B$56,SMALL(IF('بينات التلاميد'!$B$5:$B$56<>\"\",ROW('بينات التلاميد'!$B$5:$B$56)-ROW($B$5)+1),ROWS($B$2:B1075))))","v":""}]
[null,{"$f":"IF(ROWS($B$2:B1076)>'بينات التلاميد'!$Q$5,\"\",INDEX('بينات التلاميد'!$B$5:$B$56,SMALL(IF('بينات التلاميد'!$B$5:$B$56<>\"\",ROW('بينات التلاميد'!$B$5:$B$56)-ROW($B$5)+1),ROWS($B$2:B1076))))","v":""}]
[null,{"$f":"IF(ROWS($B$2:B1077)>'بينات التلاميد'!$Q$5,\"\",INDEX('بينات التلاميد'!$B$5:$B$56,SMALL(IF('بينات التلاميد'!$B$5:$B$56<>\"\",ROW('بينات التلاميد'!$B$5:$B$56)-ROW($B$5)+1),ROWS($B$2:B1077))))","v":""}]
[null,{"$f":"IF(ROWS($B$2:B1078)>'بينات التلاميد'!$Q$5,\"\",INDEX('بينات التلاميد'!$B$5:$B$56,SMALL(IF('بينات التلاميد'!$B$5:$B$56<>\"\",ROW('بينات التلاميد'!$B$5:$B$56)-ROW($B$5)+1),ROWS($B$2:B1078))))","v":""}]
[null,{"$f":"IF(ROWS($B$2:B1079)>'بينات التلاميد'!$Q$5,\"\",INDEX('بينات التلاميد'!$B$5:$B$56,SMALL(IF('بينات التلاميد'!$B$5:$B$56<>\"\",ROW('بينات التلاميد'!$B$5:$B$56)-ROW($B$5)+1),ROWS($B$2:B1079))))","v":""}]
[null,{"$f":"IF(ROWS($B$2:B1080)>'بينات التلاميد'!$Q$5,\"\",INDEX('بينات التلاميد'!$B$5:$B$56,SMALL(IF('بينات التلاميد'!$B$5:$B$56<>\"\",ROW('بينات التلاميد'!$B$5:$B$56)-ROW($B$5)+1),ROWS($B$2:B1080))))","v":""}]
[null,{"$f":"IF(ROWS($B$2:B1081)>'بينات التلاميد'!$Q$5,\"\",INDEX('بينات التلاميد'!$B$5:$B$56,SMALL(IF('بينات التلاميد'!$B$5:$B$56<>\"\",ROW('بينات التلاميد'!$B$5:$B$56)-ROW($B$5)+1),ROWS($B$2:B1081))))","v":""}]
[null,{"$f":"IF(ROWS($B$2:B1082)>'بينات التلاميد'!$Q$5,\"\",INDEX('بينات التلاميد'!$B$5:$B$56,SMALL(IF('بينات التلاميد'!$B$5:$B$56<>\"\",ROW('بينات التلاميد'!$B$5:$B$56)-ROW($B$5)+1),ROWS($B$2:B1082))))","v":""}]
[null,{"$f":"IF(ROWS($B$2:B1083)>'بينات التلاميد'!$Q$5,\"\",INDEX('بينات التلاميد'!$B$5:$B$56,SMALL(IF('بينات التلاميد'!$B$5:$B$56<>\"\",ROW('بينات التلاميد'!$B$5:$B$56)-ROW($B$5)+1),ROWS($B$2:B1083))))","v":""}]
[null,{"$f":"IF(ROWS($B$2:B1084)>'بينات التلاميد'!$Q$5,\"\",INDEX('بينات التلاميد'!$B$5:$B$56,SMALL(IF('بينات التلاميد'!$B$5:$B$56<>\"\",ROW('بينات التلاميد'!$B$5:$B$56)-ROW($B$5)+1),ROWS($B$2:B1084))))","v":""}]
[null,{"$f":"IF(ROWS($B$2:B1085)>'بينات التلاميد'!$Q$5,\"\",INDEX('بينات التلاميد'!$B$5:$B$56,SMALL(IF('بينات التلاميد'!$B$5:$B$56<>\"\",ROW('بينات التلاميد'!$B$5:$B$56)-ROW($B$5)+1),ROWS($B$2:B1085))))","v":""}]
[null,{"$f":"IF(ROWS($B$2:B1086)>'بينات التلاميد'!$Q$5,\"\",INDEX('بينات التلاميد'!$B$5:$B$56,SMALL(IF('بينات التلاميد'!$B$5:$B$56<>\"\",ROW('بينات التلاميد'!$B$5:$B$56)-ROW($B$5)+1),ROWS($B$2:B1086))))","v":""}]
[null,{"$f":"IF(ROWS($B$2:B1087)>'بينات التلاميد'!$Q$5,\"\",INDEX('بينات التلاميد'!$B$5:$B$56,SMALL(IF('بينات التلاميد'!$B$5:$B$56<>\"\",ROW('بينات التلاميد'!$B$5:$B$56)-ROW($B$5)+1),ROWS($B$2:B1087))))","v":""}]
[null,{"$f":"IF(ROWS($B$2:B1088)>'بينات التلاميد'!$Q$5,\"\",INDEX('بينات التلاميد'!$B$5:$B$56,SMALL(IF('بينات التلاميد'!$B$5:$B$56<>\"\",ROW('بينات التلاميد'!$B$5:$B$56)-ROW($B$5)+1),ROWS($B$2:B1088))))","v":""}]
[null,{"$f":"IF(ROWS($B$2:B1089)>'بينات التلاميد'!$Q$5,\"\",INDEX('بينات التلاميد'!$B$5:$B$56,SMALL(IF('بينات التلاميد'!$B$5:$B$56<>\"\",ROW('بينات التلاميد'!$B$5:$B$56)-ROW($B$5)+1),ROWS($B$2:B1089))))","v":""}]
[null,{"$f":"IF(ROWS($B$2:B1090)>'بينات التلاميد'!$Q$5,\"\",INDEX('بينات التلاميد'!$B$5:$B$56,SMALL(IF('بينات التلاميد'!$B$5:$B$56<>\"\",ROW('بينات التلاميد'!$B$5:$B$56)-ROW($B$5)+1),ROWS($B$2:B1090))))","v":""}]
[null,{"$f":"IF(ROWS($B$2:B1091)>'بينات التلاميد'!$Q$5,\"\",INDEX('بينات التلاميد'!$B$5:$B$56,SMALL(IF('بينات التلاميد'!$B$5:$B$56<>\"\",ROW('بينات التلاميد'!$B$5:$B$56)-ROW($B$5)+1),ROWS($B$2:B1091))))","v":""}]
[null,{"$f":"IF(ROWS($B$2:B1092)>'بينات التلاميد'!$Q$5,\"\",INDEX('بينات التلاميد'!$B$5:$B$56,SMALL(IF('بينات التلاميد'!$B$5:$B$56<>\"\",ROW('بينات التلاميد'!$B$5:$B$56)-ROW($B$5)+1),ROWS($B$2:B1092))))","v":""}]
[null,{"$f":"IF(ROWS($B$2:B1093)>'بينات التلاميد'!$Q$5,\"\",INDEX('بينات التلاميد'!$B$5:$B$56,SMALL(IF('بينات التلاميد'!$B$5:$B$56<>\"\",ROW('بينات التلاميد'!$B$5:$B$56)-ROW($B$5)+1),ROWS($B$2:B1093))))","v":""}]
[null,{"$f":"IF(ROWS($B$2:B1094)>'بينات التلاميد'!$Q$5,\"\",INDEX('بينات التلاميد'!$B$5:$B$56,SMALL(IF('بينات التلاميد'!$B$5:$B$56<>\"\",ROW('بينات التلاميد'!$B$5:$B$56)-ROW($B$5)+1),ROWS($B$2:B1094))))","v":""}]
[null,{"$f":"IF(ROWS($B$2:B1095)>'بينات التلاميد'!$Q$5,\"\",INDEX('بينات التلاميد'!$B$5:$B$56,SMALL(IF('بينات التلاميد'!$B$5:$B$56<>\"\",ROW('بينات التلاميد'!$B$5:$B$56)-ROW($B$5)+1),ROWS($B$2:B1095))))","v":""}]
[null,{"$f":"IF(ROWS($B$2:B1096)>'بينات التلاميد'!$Q$5,\"\",INDEX('بينات التلاميد'!$B$5:$B$56,SMALL(IF('بينات التلاميد'!$B$5:$B$56<>\"\",ROW('بينات التلاميد'!$B$5:$B$56)-ROW($B$5)+1),ROWS($B$2:B1096))))","v":""}]
[null,{"$f":"IF(ROWS($B$2:B1097)>'بينات التلاميد'!$Q$5,\"\",INDEX('بينات التلاميد'!$B$5:$B$56,SMALL(IF('بينات التلاميد'!$B$5:$B$56<>\"\",ROW('بينات التلاميد'!$B$5:$B$56)-ROW($B$5)+1),ROWS($B$2:B1097))))","v":""}]
[null,{"$f":"IF(ROWS($B$2:B1098)>'بينات التلاميد'!$Q$5,\"\",INDEX('بينات التلاميد'!$B$5:$B$56,SMALL(IF('بينات التلاميد'!$B$5:$B$56<>\"\",ROW('بينات التلاميد'!$B$5:$B$56)-ROW($B$5)+1),ROWS($B$2:B1098))))","v":""}]
[null,{"$f":"IF(ROWS($B$2:B1099)>'بينات التلاميد'!$Q$5,\"\",INDEX('بينات التلاميد'!$B$5:$B$56,SMALL(IF('بينات التلاميد'!$B$5:$B$56<>\"\",ROW('بينات التلاميد'!$B$5:$B$56)-ROW($B$5)+1),ROWS($B$2:B1099))))","v":""}]
[null,{"$f":"IF(ROWS($B$2:B1100)>'بينات التلاميد'!$Q$5,\"\",INDEX('بينات التلاميد'!$B$5:$B$56,SMALL(IF('بينات التلاميد'!$B$5:$B$56<>\"\",ROW('بينات التلاميد'!$B$5:$B$56)-ROW($B$5)+1),ROWS($B$2:B1100))))","v":""}]
[null,{"$f":"IF(ROWS($B$2:B1101)>'بينات التلاميد'!$Q$5,\"\",INDEX('بينات التلاميد'!$B$5:$B$56,SMALL(IF('بينات التلاميد'!$B$5:$B$56<>\"\",ROW('بينات التلاميد'!$B$5:$B$56)-ROW($B$5)+1),ROWS($B$2:B1101))))","v":""}]
[null,{"$f":"IF(ROWS($B$2:B1102)>'بينات التلاميد'!$Q$5,\"\",INDEX('بينات التلاميد'!$B$5:$B$56,SMALL(IF('بينات التلاميد'!$B$5:$B$56<>\"\",ROW('بينات التلاميد'!$B$5:$B$56)-ROW($B$5)+1),ROWS($B$2:B1102))))","v":""}]
[null,{"$f":"IF(ROWS($B$2:B1103)>'بينات التلاميد'!$Q$5,\"\",INDEX('بينات التلاميد'!$B$5:$B$56,SMALL(IF('بينات التلاميد'!$B$5:$B$56<>\"\",ROW('بينات التلاميد'!$B$5:$B$56)-ROW($B$5)+1),ROWS($B$2:B1103))))","v":""}]
[null,{"$f":"IF(ROWS($B$2:B1104)>'بينات التلاميد'!$Q$5,\"\",INDEX('بينات التلاميد'!$B$5:$B$56,SMALL(IF('بينات التلاميد'!$B$5:$B$56<>\"\",ROW('بينات التلاميد'!$B$5:$B$56)-ROW($B$5)+1),ROWS($B$2:B1104))))","v":""}]
[null,{"$f":"IF(ROWS($B$2:B1105)>'بينات التلاميد'!$Q$5,\"\",INDEX('بينات التلاميد'!$B$5:$B$56,SMALL(IF('بينات التلاميد'!$B$5:$B$56<>\"\",ROW('بينات التلاميد'!$B$5:$B$56)-ROW($B$5)+1),ROWS($B$2:B1105))))","v":""}]
[null,{"$f":"IF(ROWS($B$2:B1106)>'بينات التلاميد'!$Q$5,\"\",INDEX('بينات التلاميد'!$B$5:$B$56,SMALL(IF('بينات التلاميد'!$B$5:$B$56<>\"\",ROW('بينات التلاميد'!$B$5:$B$56)-ROW($B$5)+1),ROWS($B$2:B1106))))","v":""}]
[null,{"$f":"IF(ROWS($B$2:B1107)>'بينات التلاميد'!$Q$5,\"\",INDEX('بينات التلاميد'!$B$5:$B$56,SMALL(IF('بينات التلاميد'!$B$5:$B$56<>\"\",ROW('بينات التلاميد'!$B$5:$B$56)-ROW($B$5)+1),ROWS($B$2:B1107))))","v":""}]
[null,{"$f":"IF(ROWS($B$2:B1108)>'بينات التلاميد'!$Q$5,\"\",INDEX('بينات التلاميد'!$B$5:$B$56,SMALL(IF('بينات التلاميد'!$B$5:$B$56<>\"\",ROW('بينات التلاميد'!$B$5:$B$56)-ROW($B$5)+1),ROWS($B$2:B1108))))","v":""}]
[null,{"$f":"IF(ROWS($B$2:B1109)>'بينات التلاميد'!$Q$5,\"\",INDEX('بينات التلاميد'!$B$5:$B$56,SMALL(IF('بينات التلاميد'!$B$5:$B$56<>\"\",ROW('بينات التلاميد'!$B$5:$B$56)-ROW($B$5)+1),ROWS($B$2:B1109))))","v":""}]
[null,{"$f":"IF(ROWS($B$2:B1110)>'بينات التلاميد'!$Q$5,\"\",INDEX('بينات التلاميد'!$B$5:$B$56,SMALL(IF('بينات التلاميد'!$B$5:$B$56<>\"\",ROW('بينات التلاميد'!$B$5:$B$56)-ROW($B$5)+1),ROWS($B$2:B1110))))","v":""}]
[null,{"$f":"IF(ROWS($B$2:B1111)>'بينات التلاميد'!$Q$5,\"\",INDEX('بينات التلاميد'!$B$5:$B$56,SMALL(IF('بينات التلاميد'!$B$5:$B$56<>\"\",ROW('بينات التلاميد'!$B$5:$B$56)-ROW($B$5)+1),ROWS($B$2:B1111))))","v":""}]
[null,{"$f":"IF(ROWS($B$2:B1112)>'بينات التلاميد'!$Q$5,\"\",INDEX('بينات التلاميد'!$B$5:$B$56,SMALL(IF('بينات التلاميد'!$B$5:$B$56<>\"\",ROW('بينات التلاميد'!$B$5:$B$56)-ROW($B$5)+1),ROWS($B$2:B1112))))","v":""}]
[null,{"$f":"IF(ROWS($B$2:B1113)>'بينات التلاميد'!$Q$5,\"\",INDEX('بينات التلاميد'!$B$5:$B$56,SMALL(IF('بينات التلاميد'!$B$5:$B$56<>\"\",ROW('بينات التلاميد'!$B$5:$B$56)-ROW($B$5)+1),ROWS($B$2:B1113))))","v":""}]
[null,{"$f":"IF(ROWS($B$2:B1114)>'بينات التلاميد'!$Q$5,\"\",INDEX('بينات التلاميد'!$B$5:$B$56,SMALL(IF('بينات التلاميد'!$B$5:$B$56<>\"\",ROW('بينات التلاميد'!$B$5:$B$56)-ROW($B$5)+1),ROWS($B$2:B1114))))","v":""}]
[null,{"$f":"IF(ROWS($B$2:B1115)>'بينات التلاميد'!$Q$5,\"\",INDEX('بينات التلاميد'!$B$5:$B$56,SMALL(IF('بينات التلاميد'!$B$5:$B$56<>\"\",ROW('بينات التلاميد'!$B$5:$B$56)-ROW($B$5)+1),ROWS($B$2:B1115))))","v":""}]
[null,{"$f":"IF(ROWS($B$2:B1116)>'بينات التلاميد'!$Q$5,\"\",INDEX('بينات التلاميد'!$B$5:$B$56,SMALL(IF('بينات التلاميد'!$B$5:$B$56<>\"\",ROW('بينات التلاميد'!$B$5:$B$56)-ROW($B$5)+1),ROWS($B$2:B1116))))","v":""}]
[null,{"$f":"IF(ROWS($B$2:B1117)>'بينات التلاميد'!$Q$5,\"\",INDEX('بينات التلاميد'!$B$5:$B$56,SMALL(IF('بينات التلاميد'!$B$5:$B$56<>\"\",ROW('بينات التلاميد'!$B$5:$B$56)-ROW($B$5)+1),ROWS($B$2:B1117))))","v":""}]
[null,{"$f":"IF(ROWS($B$2:B1118)>'بينات التلاميد'!$Q$5,\"\",INDEX('بينات التلاميد'!$B$5:$B$56,SMALL(IF('بينات التلاميد'!$B$5:$B$56<>\"\",ROW('بينات التلاميد'!$B$5:$B$56)-ROW($B$5)+1),ROWS($B$2:B1118))))","v":""}]
[null,{"$f":"IF(ROWS($B$2:B1119)>'بينات التلاميد'!$Q$5,\"\",INDEX('بينات التلاميد'!$B$5:$B$56,SMALL(IF('بينات التلاميد'!$B$5:$B$56<>\"\",ROW('بينات التلاميد'!$B$5:$B$56)-ROW($B$5)+1),ROWS($B$2:B1119))))","v":""}]
[null,{"$f":"IF(ROWS($B$2:B1120)>'بينات التلاميد'!$Q$5,\"\",INDEX('بينات التلاميد'!$B$5:$B$56,SMALL(IF('بينات التلاميد'!$B$5:$B$56<>\"\",ROW('بينات التلاميد'!$B$5:$B$56)-ROW($B$5)+1),ROWS($B$2:B1120))))","v":""}]
[null,{"$f":"IF(ROWS($B$2:B1121)>'بينات التلاميد'!$Q$5,\"\",INDEX('بينات التلاميد'!$B$5:$B$56,SMALL(IF('بينات التلاميد'!$B$5:$B$56<>\"\",ROW('بينات التلاميد'!$B$5:$B$56)-ROW($B$5)+1),ROWS($B$2:B1121))))","v":""}]
[null,{"$f":"IF(ROWS($B$2:B1122)>'بينات التلاميد'!$Q$5,\"\",INDEX('بينات التلاميد'!$B$5:$B$56,SMALL(IF('بينات التلاميد'!$B$5:$B$56<>\"\",ROW('بينات التلاميد'!$B$5:$B$56)-ROW($B$5)+1),ROWS($B$2:B1122))))","v":""}]
[null,{"$f":"IF(ROWS($B$2:B1123)>'بينات التلاميد'!$Q$5,\"\",INDEX('بينات التلاميد'!$B$5:$B$56,SMALL(IF('بينات التلاميد'!$B$5:$B$56<>\"\",ROW('بينات التلاميد'!$B$5:$B$56)-ROW($B$5)+1),ROWS($B$2:B1123))))","v":""}]
[null,{"$f":"IF(ROWS($B$2:B1124)>'بينات التلاميد'!$Q$5,\"\",INDEX('بينات التلاميد'!$B$5:$B$56,SMALL(IF('بينات التلاميد'!$B$5:$B$56<>\"\",ROW('بينات التلاميد'!$B$5:$B$56)-ROW($B$5)+1),ROWS($B$2:B1124))))","v":""}]
[null,{"$f":"IF(ROWS($B$2:B1125)>'بينات التلاميد'!$Q$5,\"\",INDEX('بينات التلاميد'!$B$5:$B$56,SMALL(IF('بينات التلاميد'!$B$5:$B$56<>\"\",ROW('بينات التلاميد'!$B$5:$B$56)-ROW($B$5)+1),ROWS($B$2:B1125))))","v":""}]
[null,{"$f":"IF(ROWS($B$2:B1126)>'بينات التلاميد'!$Q$5,\"\",INDEX('بينات التلاميد'!$B$5:$B$56,SMALL(IF('بينات التلاميد'!$B$5:$B$56<>\"\",ROW('بينات التلاميد'!$B$5:$B$56)-ROW($B$5)+1),ROWS($B$2:B1126))))","v":""}]
[null,{"$f":"IF(ROWS($B$2:B1127)>'بينات التلاميد'!$Q$5,\"\",INDEX('بينات التلاميد'!$B$5:$B$56,SMALL(IF('بينات التلاميد'!$B$5:$B$56<>\"\",ROW('بينات التلاميد'!$B$5:$B$56)-ROW($B$5)+1),ROWS($B$2:B1127))))","v":""}]
[null,{"$f":"IF(ROWS($B$2:B1128)>'بينات التلاميد'!$Q$5,\"\",INDEX('بينات التلاميد'!$B$5:$B$56,SMALL(IF('بينات التلاميد'!$B$5:$B$56<>\"\",ROW('بينات التلاميد'!$B$5:$B$56)-ROW($B$5)+1),ROWS($B$2:B1128))))","v":""}]
[null,{"$f":"IF(ROWS($B$2:B1129)>'بينات التلاميد'!$Q$5,\"\",INDEX('بينات التلاميد'!$B$5:$B$56,SMALL(IF('بينات التلاميد'!$B$5:$B$56<>\"\",ROW('بينات التلاميد'!$B$5:$B$56)-ROW($B$5)+1),ROWS($B$2:B1129))))","v":""}]
[null,{"$f":"IF(ROWS($B$2:B1130)>'بينات التلاميد'!$Q$5,\"\",INDEX('بينات التلاميد'!$B$5:$B$56,SMALL(IF('بينات التلاميد'!$B$5:$B$56<>\"\",ROW('بينات التلاميد'!$B$5:$B$56)-ROW($B$5)+1),ROWS($B$2:B1130))))","v":""}]
[null,{"$f":"IF(ROWS($B$2:B1131)>'بينات التلاميد'!$Q$5,\"\",INDEX('بينات التلاميد'!$B$5:$B$56,SMALL(IF('بينات التلاميد'!$B$5:$B$56<>\"\",ROW('بينات التلاميد'!$B$5:$B$56)-ROW($B$5)+1),ROWS($B$2:B1131))))","v":""}]
[null,{"$f":"IF(ROWS($B$2:B1132)>'بينات التلاميد'!$Q$5,\"\",INDEX('بينات التلاميد'!$B$5:$B$56,SMALL(IF('بينات التلاميد'!$B$5:$B$56<>\"\",ROW('بينات التلاميد'!$B$5:$B$56)-ROW($B$5)+1),ROWS($B$2:B1132))))","v":""}]
[null,{"$f":"IF(ROWS($B$2:B1133)>'بينات التلاميد'!$Q$5,\"\",INDEX('بينات التلاميد'!$B$5:$B$56,SMALL(IF('بينات التلاميد'!$B$5:$B$56<>\"\",ROW('بينات التلاميد'!$B$5:$B$56)-ROW($B$5)+1),ROWS($B$2:B1133))))","v":""}]
[null,{"$f":"IF(ROWS($B$2:B1134)>'بينات التلاميد'!$Q$5,\"\",INDEX('بينات التلاميد'!$B$5:$B$56,SMALL(IF('بينات التلاميد'!$B$5:$B$56<>\"\",ROW('بينات التلاميد'!$B$5:$B$56)-ROW($B$5)+1),ROWS($B$2:B1134))))","v":""}]
[null,{"$f":"IF(ROWS($B$2:B1135)>'بينات التلاميد'!$Q$5,\"\",INDEX('بينات التلاميد'!$B$5:$B$56,SMALL(IF('بينات التلاميد'!$B$5:$B$56<>\"\",ROW('بينات التلاميد'!$B$5:$B$56)-ROW($B$5)+1),ROWS($B$2:B1135))))","v":""}]
[null,{"$f":"IF(ROWS($B$2:B1136)>'بينات التلاميد'!$Q$5,\"\",INDEX('بينات التلاميد'!$B$5:$B$56,SMALL(IF('بينات التلاميد'!$B$5:$B$56<>\"\",ROW('بينات التلاميد'!$B$5:$B$56)-ROW($B$5)+1),ROWS($B$2:B1136))))","v":""}]
[null,{"$f":"IF(ROWS($B$2:B1137)>'بينات التلاميد'!$Q$5,\"\",INDEX('بينات التلاميد'!$B$5:$B$56,SMALL(IF('بينات التلاميد'!$B$5:$B$56<>\"\",ROW('بينات التلاميد'!$B$5:$B$56)-ROW($B$5)+1),ROWS($B$2:B1137))))","v":""}]
[null,{"$f":"IF(ROWS($B$2:B1138)>'بينات التلاميد'!$Q$5,\"\",INDEX('بينات التلاميد'!$B$5:$B$56,SMALL(IF('بينات التلاميد'!$B$5:$B$56<>\"\",ROW('بينات التلاميد'!$B$5:$B$56)-ROW($B$5)+1),ROWS($B$2:B1138))))","v":""}]
[null,{"$f":"IF(ROWS($B$2:B1139)>'بينات التلاميد'!$Q$5,\"\",INDEX('بينات التلاميد'!$B$5:$B$56,SMALL(IF('بينات التلاميد'!$B$5:$B$56<>\"\",ROW('بينات التلاميد'!$B$5:$B$56)-ROW($B$5)+1),ROWS($B$2:B1139))))","v":""}]
[null,{"$f":"IF(ROWS($B$2:B1140)>'بينات التلاميد'!$Q$5,\"\",INDEX('بينات التلاميد'!$B$5:$B$56,SMALL(IF('بينات التلاميد'!$B$5:$B$56<>\"\",ROW('بينات التلاميد'!$B$5:$B$56)-ROW($B$5)+1),ROWS($B$2:B1140))))","v":""}]
[null,{"$f":"IF(ROWS($B$2:B1141)>'بينات التلاميد'!$Q$5,\"\",INDEX('بينات التلاميد'!$B$5:$B$56,SMALL(IF('بينات التلاميد'!$B$5:$B$56<>\"\",ROW('بينات التلاميد'!$B$5:$B$56)-ROW($B$5)+1),ROWS($B$2:B1141))))","v":""}]
[null,{"$f":"IF(ROWS($B$2:B1142)>'بينات التلاميد'!$Q$5,\"\",INDEX('بينات التلاميد'!$B$5:$B$56,SMALL(IF('بينات التلاميد'!$B$5:$B$56<>\"\",ROW('بينات التلاميد'!$B$5:$B$56)-ROW($B$5)+1),ROWS($B$2:B1142))))","v":""}]
[null,{"$f":"IF(ROWS($B$2:B1143)>'بينات التلاميد'!$Q$5,\"\",INDEX('بينات التلاميد'!$B$5:$B$56,SMALL(IF('بينات التلاميد'!$B$5:$B$56<>\"\",ROW('بينات التلاميد'!$B$5:$B$56)-ROW($B$5)+1),ROWS($B$2:B1143))))","v":""}]
[null,{"$f":"IF(ROWS($B$2:B1144)>'بينات التلاميد'!$Q$5,\"\",INDEX('بينات التلاميد'!$B$5:$B$56,SMALL(IF('بينات التلاميد'!$B$5:$B$56<>\"\",ROW('بينات التلاميد'!$B$5:$B$56)-ROW($B$5)+1),ROWS($B$2:B1144))))","v":""}]
[null,{"$f":"IF(ROWS($B$2:B1145)>'بينات التلاميد'!$Q$5,\"\",INDEX('بينات التلاميد'!$B$5:$B$56,SMALL(IF('بينات التلاميد'!$B$5:$B$56<>\"\",ROW('بينات التلاميد'!$B$5:$B$56)-ROW($B$5)+1),ROWS($B$2:B1145))))","v":""}]
[null,{"$f":"IF(ROWS($B$2:B1146)>'بينات التلاميد'!$Q$5,\"\",INDEX('بينات التلاميد'!$B$5:$B$56,SMALL(IF('بينات التلاميد'!$B$5:$B$56<>\"\",ROW('بينات التلاميد'!$B$5:$B$56)-ROW($B$5)+1),ROWS($B$2:B1146))))","v":""}]
[null,{"$f":"IF(ROWS($B$2:B1147)>'بينات التلاميد'!$Q$5,\"\",INDEX('بينات التلاميد'!$B$5:$B$56,SMALL(IF('بينات التلاميد'!$B$5:$B$56<>\"\",ROW('بينات التلاميد'!$B$5:$B$56)-ROW($B$5)+1),ROWS($B$2:B1147))))","v":""}]
[null,{"$f":"IF(ROWS($B$2:B1148)>'بينات التلاميد'!$Q$5,\"\",INDEX('بينات التلاميد'!$B$5:$B$56,SMALL(IF('بينات التلاميد'!$B$5:$B$56<>\"\",ROW('بينات التلاميد'!$B$5:$B$56)-ROW($B$5)+1),ROWS($B$2:B1148))))","v":""}]
[null,{"$f":"IF(ROWS($B$2:B1149)>'بينات التلاميد'!$Q$5,\"\",INDEX('بينات التلاميد'!$B$5:$B$56,SMALL(IF('بينات التلاميد'!$B$5:$B$56<>\"\",ROW('بينات التلاميد'!$B$5:$B$56)-ROW($B$5)+1),ROWS($B$2:B1149))))","v":""}]
[null,{"$f":"IF(ROWS($B$2:B1150)>'بينات التلاميد'!$Q$5,\"\",INDEX('بينات التلاميد'!$B$5:$B$56,SMALL(IF('بينات التلاميد'!$B$5:$B$56<>\"\",ROW('بينات التلاميد'!$B$5:$B$56)-ROW($B$5)+1),ROWS($B$2:B1150))))","v":""}]
[null,{"$f":"IF(ROWS($B$2:B1151)>'بينات التلاميد'!$Q$5,\"\",INDEX('بينات التلاميد'!$B$5:$B$56,SMALL(IF('بينات التلاميد'!$B$5:$B$56<>\"\",ROW('بينات التلاميد'!$B$5:$B$56)-ROW($B$5)+1),ROWS($B$2:B1151))))","v":""}]
[null,{"$f":"IF(ROWS($B$2:B1152)>'بينات التلاميد'!$Q$5,\"\",INDEX('بينات التلاميد'!$B$5:$B$56,SMALL(IF('بينات التلاميد'!$B$5:$B$56<>\"\",ROW('بينات التلاميد'!$B$5:$B$56)-ROW($B$5)+1),ROWS($B$2:B1152))))","v":""}]
[null,{"$f":"IF(ROWS($B$2:B1153)>'بينات التلاميد'!$Q$5,\"\",INDEX('بينات التلاميد'!$B$5:$B$56,SMALL(IF('بينات التلاميد'!$B$5:$B$56<>\"\",ROW('بينات التلاميد'!$B$5:$B$56)-ROW($B$5)+1),ROWS($B$2:B1153))))","v":""}]
[null,{"$f":"IF(ROWS($B$2:B1154)>'بينات التلاميد'!$Q$5,\"\",INDEX('بينات التلاميد'!$B$5:$B$56,SMALL(IF('بينات التلاميد'!$B$5:$B$56<>\"\",ROW('بينات التلاميد'!$B$5:$B$56)-ROW($B$5)+1),ROWS($B$2:B1154))))","v":""}]
[null,{"$f":"IF(ROWS($B$2:B1155)>'بينات التلاميد'!$Q$5,\"\",INDEX('بينات التلاميد'!$B$5:$B$56,SMALL(IF('بينات التلاميد'!$B$5:$B$56<>\"\",ROW('بينات التلاميد'!$B$5:$B$56)-ROW($B$5)+1),ROWS($B$2:B1155))))","v":""}]
[null,{"$f":"IF(ROWS($B$2:B1156)>'بينات التلاميد'!$Q$5,\"\",INDEX('بينات التلاميد'!$B$5:$B$56,SMALL(IF('بينات التلاميد'!$B$5:$B$56<>\"\",ROW('بينات التلاميد'!$B$5:$B$56)-ROW($B$5)+1),ROWS($B$2:B1156))))","v":""}]
[null,{"$f":"IF(ROWS($B$2:B1157)>'بينات التلاميد'!$Q$5,\"\",INDEX('بينات التلاميد'!$B$5:$B$56,SMALL(IF('بينات التلاميد'!$B$5:$B$56<>\"\",ROW('بينات التلاميد'!$B$5:$B$56)-ROW($B$5)+1),ROWS($B$2:B1157))))","v":""}]
[null,{"$f":"IF(ROWS($B$2:B1158)>'بينات التلاميد'!$Q$5,\"\",INDEX('بينات التلاميد'!$B$5:$B$56,SMALL(IF('بينات التلاميد'!$B$5:$B$56<>\"\",ROW('بينات التلاميد'!$B$5:$B$56)-ROW($B$5)+1),ROWS($B$2:B1158))))","v":""}]
[null,{"$f":"IF(ROWS($B$2:B1159)>'بينات التلاميد'!$Q$5,\"\",INDEX('بينات التلاميد'!$B$5:$B$56,SMALL(IF('بينات التلاميد'!$B$5:$B$56<>\"\",ROW('بينات التلاميد'!$B$5:$B$56)-ROW($B$5)+1),ROWS($B$2:B1159))))","v":""}]
[null,{"$f":"IF(ROWS($B$2:B1160)>'بينات التلاميد'!$Q$5,\"\",INDEX('بينات التلاميد'!$B$5:$B$56,SMALL(IF('بينات التلاميد'!$B$5:$B$56<>\"\",ROW('بينات التلاميد'!$B$5:$B$56)-ROW($B$5)+1),ROWS($B$2:B1160))))","v":""}]
[null,{"$f":"IF(ROWS($B$2:B1161)>'بينات التلاميد'!$Q$5,\"\",INDEX('بينات التلاميد'!$B$5:$B$56,SMALL(IF('بينات التلاميد'!$B$5:$B$56<>\"\",ROW('بينات التلاميد'!$B$5:$B$56)-ROW($B$5)+1),ROWS($B$2:B1161))))","v":""}]
[null,{"$f":"IF(ROWS($B$2:B1162)>'بينات التلاميد'!$Q$5,\"\",INDEX('بينات التلاميد'!$B$5:$B$56,SMALL(IF('بينات التلاميد'!$B$5:$B$56<>\"\",ROW('بينات التلاميد'!$B$5:$B$56)-ROW($B$5)+1),ROWS($B$2:B1162))))","v":""}]
[null,{"$f":"IF(ROWS($B$2:B1163)>'بينات التلاميد'!$Q$5,\"\",INDEX('بينات التلاميد'!$B$5:$B$56,SMALL(IF('بينات التلاميد'!$B$5:$B$56<>\"\",ROW('بينات التلاميد'!$B$5:$B$56)-ROW($B$5)+1),ROWS($B$2:B1163))))","v":""}]
[null,{"$f":"IF(ROWS($B$2:B1164)>'بينات التلاميد'!$Q$5,\"\",INDEX('بينات التلاميد'!$B$5:$B$56,SMALL(IF('بينات التلاميد'!$B$5:$B$56<>\"\",ROW('بينات التلاميد'!$B$5:$B$56)-ROW($B$5)+1),ROWS($B$2:B1164))))","v":""}]
[null,{"$f":"IF(ROWS($B$2:B1165)>'بينات التلاميد'!$Q$5,\"\",INDEX('بينات التلاميد'!$B$5:$B$56,SMALL(IF('بينات التلاميد'!$B$5:$B$56<>\"\",ROW('بينات التلاميد'!$B$5:$B$56)-ROW($B$5)+1),ROWS($B$2:B1165))))","v":""}]
[null,{"$f":"IF(ROWS($B$2:B1166)>'بينات التلاميد'!$Q$5,\"\",INDEX('بينات التلاميد'!$B$5:$B$56,SMALL(IF('بينات التلاميد'!$B$5:$B$56<>\"\",ROW('بينات التلاميد'!$B$5:$B$56)-ROW($B$5)+1),ROWS($B$2:B1166))))","v":""}]
[null,{"$f":"IF(ROWS($B$2:B1167)>'بينات التلاميد'!$Q$5,\"\",INDEX('بينات التلاميد'!$B$5:$B$56,SMALL(IF('بينات التلاميد'!$B$5:$B$56<>\"\",ROW('بينات التلاميد'!$B$5:$B$56)-ROW($B$5)+1),ROWS($B$2:B1167))))","v":""}]
[null,{"$f":"IF(ROWS($B$2:B1168)>'بينات التلاميد'!$Q$5,\"\",INDEX('بينات التلاميد'!$B$5:$B$56,SMALL(IF('بينات التلاميد'!$B$5:$B$56<>\"\",ROW('بينات التلاميد'!$B$5:$B$56)-ROW($B$5)+1),ROWS($B$2:B1168))))","v":""}]
[null,{"$f":"IF(ROWS($B$2:B1169)>'بينات التلاميد'!$Q$5,\"\",INDEX('بينات التلاميد'!$B$5:$B$56,SMALL(IF('بينات التلاميد'!$B$5:$B$56<>\"\",ROW('بينات التلاميد'!$B$5:$B$56)-ROW($B$5)+1),ROWS($B$2:B1169))))","v":""}]
[null,{"$f":"IF(ROWS($B$2:B1170)>'بينات التلاميد'!$Q$5,\"\",INDEX('بينات التلاميد'!$B$5:$B$56,SMALL(IF('بينات التلاميد'!$B$5:$B$56<>\"\",ROW('بينات التلاميد'!$B$5:$B$56)-ROW($B$5)+1),ROWS($B$2:B1170))))","v":""}]
[null,{"$f":"IF(ROWS($B$2:B1171)>'بينات التلاميد'!$Q$5,\"\",INDEX('بينات التلاميد'!$B$5:$B$56,SMALL(IF('بينات التلاميد'!$B$5:$B$56<>\"\",ROW('بينات التلاميد'!$B$5:$B$56)-ROW($B$5)+1),ROWS($B$2:B1171))))","v":""}]
[null,{"$f":"IF(ROWS($B$2:B1172)>'بينات التلاميد'!$Q$5,\"\",INDEX('بينات التلاميد'!$B$5:$B$56,SMALL(IF('بينات التلاميد'!$B$5:$B$56<>\"\",ROW('بينات التلاميد'!$B$5:$B$56)-ROW($B$5)+1),ROWS($B$2:B1172))))","v":""}]
[null,{"$f":"IF(ROWS($B$2:B1173)>'بينات التلاميد'!$Q$5,\"\",INDEX('بينات التلاميد'!$B$5:$B$56,SMALL(IF('بينات التلاميد'!$B$5:$B$56<>\"\",ROW('بينات التلاميد'!$B$5:$B$56)-ROW($B$5)+1),ROWS($B$2:B1173))))","v":""}]
[null,{"$f":"IF(ROWS($B$2:B1174)>'بينات التلاميد'!$Q$5,\"\",INDEX('بينات التلاميد'!$B$5:$B$56,SMALL(IF('بينات التلاميد'!$B$5:$B$56<>\"\",ROW('بينات التلاميد'!$B$5:$B$56)-ROW($B$5)+1),ROWS($B$2:B1174))))","v":""}]
[null,{"$f":"IF(ROWS($B$2:B1175)>'بينات التلاميد'!$Q$5,\"\",INDEX('بينات التلاميد'!$B$5:$B$56,SMALL(IF('بينات التلاميد'!$B$5:$B$56<>\"\",ROW('بينات التلاميد'!$B$5:$B$56)-ROW($B$5)+1),ROWS($B$2:B1175))))","v":""}]
[null,{"$f":"IF(ROWS($B$2:B1176)>'بينات التلاميد'!$Q$5,\"\",INDEX('بينات التلاميد'!$B$5:$B$56,SMALL(IF('بينات التلاميد'!$B$5:$B$56<>\"\",ROW('بينات التلاميد'!$B$5:$B$56)-ROW($B$5)+1),ROWS($B$2:B1176))))","v":""}]
[null,{"$f":"IF(ROWS($B$2:B1177)>'بينات التلاميد'!$Q$5,\"\",INDEX('بينات التلاميد'!$B$5:$B$56,SMALL(IF('بينات التلاميد'!$B$5:$B$56<>\"\",ROW('بينات التلاميد'!$B$5:$B$56)-ROW($B$5)+1),ROWS($B$2:B1177))))","v":""}]
[null,{"$f":"IF(ROWS($B$2:B1178)>'بينات التلاميد'!$Q$5,\"\",INDEX('بينات التلاميد'!$B$5:$B$56,SMALL(IF('بينات التلاميد'!$B$5:$B$56<>\"\",ROW('بينات التلاميد'!$B$5:$B$56)-ROW($B$5)+1),ROWS($B$2:B1178))))","v":""}]
[null,{"$f":"IF(ROWS($B$2:B1179)>'بينات التلاميد'!$Q$5,\"\",INDEX('بينات التلاميد'!$B$5:$B$56,SMALL(IF('بينات التلاميد'!$B$5:$B$56<>\"\",ROW('بينات التلاميد'!$B$5:$B$56)-ROW($B$5)+1),ROWS($B$2:B1179))))","v":""}]
[null,{"$f":"IF(ROWS($B$2:B1180)>'بينات التلاميد'!$Q$5,\"\",INDEX('بينات التلاميد'!$B$5:$B$56,SMALL(IF('بينات التلاميد'!$B$5:$B$56<>\"\",ROW('بينات التلاميد'!$B$5:$B$56)-ROW($B$5)+1),ROWS($B$2:B1180))))","v":""}]
[null,{"$f":"IF(ROWS($B$2:B1181)>'بينات التلاميد'!$Q$5,\"\",INDEX('بينات التلاميد'!$B$5:$B$56,SMALL(IF('بينات التلاميد'!$B$5:$B$56<>\"\",ROW('بينات التلاميد'!$B$5:$B$56)-ROW($B$5)+1),ROWS($B$2:B1181))))","v":""}]
[null,{"$f":"IF(ROWS($B$2:B1182)>'بينات التلاميد'!$Q$5,\"\",INDEX('بينات التلاميد'!$B$5:$B$56,SMALL(IF('بينات التلاميد'!$B$5:$B$56<>\"\",ROW('بينات التلاميد'!$B$5:$B$56)-ROW($B$5)+1),ROWS($B$2:B1182))))","v":""}]
[null,{"$f":"IF(ROWS($B$2:B1183)>'بينات التلاميد'!$Q$5,\"\",INDEX('بينات التلاميد'!$B$5:$B$56,SMALL(IF('بينات التلاميد'!$B$5:$B$56<>\"\",ROW('بينات التلاميد'!$B$5:$B$56)-ROW($B$5)+1),ROWS($B$2:B1183))))","v":""}]
[null,{"$f":"IF(ROWS($B$2:B1184)>'بينات التلاميد'!$Q$5,\"\",INDEX('بينات التلاميد'!$B$5:$B$56,SMALL(IF('بينات التلاميد'!$B$5:$B$56<>\"\",ROW('بينات التلاميد'!$B$5:$B$56)-ROW($B$5)+1),ROWS($B$2:B1184))))","v":""}]
[null,{"$f":"IF(ROWS($B$2:B1185)>'بينات التلاميد'!$Q$5,\"\",INDEX('بينات التلاميد'!$B$5:$B$56,SMALL(IF('بينات التلاميد'!$B$5:$B$56<>\"\",ROW('بينات التلاميد'!$B$5:$B$56)-ROW($B$5)+1),ROWS($B$2:B1185))))","v":""}]
[null,{"$f":"IF(ROWS($B$2:B1186)>'بينات التلاميد'!$Q$5,\"\",INDEX('بينات التلاميد'!$B$5:$B$56,SMALL(IF('بينات التلاميد'!$B$5:$B$56<>\"\",ROW('بينات التلاميد'!$B$5:$B$56)-ROW($B$5)+1),ROWS($B$2:B1186))))","v":""}]
[null,{"$f":"IF(ROWS($B$2:B1187)>'بينات التلاميد'!$Q$5,\"\",INDEX('بينات التلاميد'!$B$5:$B$56,SMALL(IF('بينات التلاميد'!$B$5:$B$56<>\"\",ROW('بينات التلاميد'!$B$5:$B$56)-ROW($B$5)+1),ROWS($B$2:B1187))))","v":""}]
[null,{"$f":"IF(ROWS($B$2:B1188)>'بينات التلاميد'!$Q$5,\"\",INDEX('بينات التلاميد'!$B$5:$B$56,SMALL(IF('بينات التلاميد'!$B$5:$B$56<>\"\",ROW('بينات التلاميد'!$B$5:$B$56)-ROW($B$5)+1),ROWS($B$2:B1188))))","v":""}]
[null,{"$f":"IF(ROWS($B$2:B1189)>'بينات التلاميد'!$Q$5,\"\",INDEX('بينات التلاميد'!$B$5:$B$56,SMALL(IF('بينات التلاميد'!$B$5:$B$56<>\"\",ROW('بينات التلاميد'!$B$5:$B$56)-ROW($B$5)+1),ROWS($B$2:B1189))))","v":""}]
[null,{"$f":"IF(ROWS($B$2:B1190)>'بينات التلاميد'!$Q$5,\"\",INDEX('بينات التلاميد'!$B$5:$B$56,SMALL(IF('بينات التلاميد'!$B$5:$B$56<>\"\",ROW('بينات التلاميد'!$B$5:$B$56)-ROW($B$5)+1),ROWS($B$2:B1190))))","v":""}]
[null,{"$f":"IF(ROWS($B$2:B1191)>'بينات التلاميد'!$Q$5,\"\",INDEX('بينات التلاميد'!$B$5:$B$56,SMALL(IF('بينات التلاميد'!$B$5:$B$56<>\"\",ROW('بينات التلاميد'!$B$5:$B$56)-ROW($B$5)+1),ROWS($B$2:B1191))))","v":""}]
[null,{"$f":"IF(ROWS($B$2:B1192)>'بينات التلاميد'!$Q$5,\"\",INDEX('بينات التلاميد'!$B$5:$B$56,SMALL(IF('بينات التلاميد'!$B$5:$B$56<>\"\",ROW('بينات التلاميد'!$B$5:$B$56)-ROW($B$5)+1),ROWS($B$2:B1192))))","v":""}]
[null,{"$f":"IF(ROWS($B$2:B1193)>'بينات التلاميد'!$Q$5,\"\",INDEX('بينات التلاميد'!$B$5:$B$56,SMALL(IF('بينات التلاميد'!$B$5:$B$56<>\"\",ROW('بينات التلاميد'!$B$5:$B$56)-ROW($B$5)+1),ROWS($B$2:B1193))))","v":""}]
[null,{"$f":"IF(ROWS($B$2:B1194)>'بينات التلاميد'!$Q$5,\"\",INDEX('بينات التلاميد'!$B$5:$B$56,SMALL(IF('بينات التلاميد'!$B$5:$B$56<>\"\",ROW('بينات التلاميد'!$B$5:$B$56)-ROW($B$5)+1),ROWS($B$2:B1194))))","v":""}]
[null,{"$f":"IF(ROWS($B$2:B1195)>'بينات التلاميد'!$Q$5,\"\",INDEX('بينات التلاميد'!$B$5:$B$56,SMALL(IF('بينات التلاميد'!$B$5:$B$56<>\"\",ROW('بينات التلاميد'!$B$5:$B$56)-ROW($B$5)+1),ROWS($B$2:B1195))))","v":""}]
[null,{"$f":"IF(ROWS($B$2:B1196)>'بينات التلاميد'!$Q$5,\"\",INDEX('بينات التلاميد'!$B$5:$B$56,SMALL(IF('بينات التلاميد'!$B$5:$B$56<>\"\",ROW('بينات التلاميد'!$B$5:$B$56)-ROW($B$5)+1),ROWS($B$2:B1196))))","v":""}]
[null,{"$f":"IF(ROWS($B$2:B1197)>'بينات التلاميد'!$Q$5,\"\",INDEX('بينات التلاميد'!$B$5:$B$56,SMALL(IF('بينات التلاميد'!$B$5:$B$56<>\"\",ROW('بينات التلاميد'!$B$5:$B$56)-ROW($B$5)+1),ROWS($B$2:B1197))))","v":""}]
[null,{"$f":"IF(ROWS($B$2:B1198)>'بينات التلاميد'!$Q$5,\"\",INDEX('بينات التلاميد'!$B$5:$B$56,SMALL(IF('بينات التلاميد'!$B$5:$B$56<>\"\",ROW('بينات التلاميد'!$B$5:$B$56)-ROW($B$5)+1),ROWS($B$2:B1198))))","v":""}]
[null,{"$f":"IF(ROWS($B$2:B1199)>'بينات التلاميد'!$Q$5,\"\",INDEX('بينات التلاميد'!$B$5:$B$56,SMALL(IF('بينات التلاميد'!$B$5:$B$56<>\"\",ROW('بينات التلاميد'!$B$5:$B$56)-ROW($B$5)+1),ROWS($B$2:B1199))))","v":""}]
[null,{"$f":"IF(ROWS($B$2:B1200)>'بينات التلاميد'!$Q$5,\"\",INDEX('بينات التلاميد'!$B$5:$B$56,SMALL(IF('بينات التلاميد'!$B$5:$B$56<>\"\",ROW('بينات التلاميد'!$B$5:$B$56)-ROW($B$5)+1),ROWS($B$2:B1200))))","v":""}]
[null,{"$f":"IF(ROWS($B$2:B1201)>'بينات التلاميد'!$Q$5,\"\",INDEX('بينات التلاميد'!$B$5:$B$56,SMALL(IF('بينات التلاميد'!$B$5:$B$56<>\"\",ROW('بينات التلاميد'!$B$5:$B$56)-ROW($B$5)+1),ROWS($B$2:B1201))))","v":""}]
[null,{"$f":"IF(ROWS($B$2:B1202)>'بينات التلاميد'!$Q$5,\"\",INDEX('بينات التلاميد'!$B$5:$B$56,SMALL(IF('بينات التلاميد'!$B$5:$B$56<>\"\",ROW('بينات التلاميد'!$B$5:$B$56)-ROW($B$5)+1),ROWS($B$2:B1202))))","v":""}]
[null,{"$f":"IF(ROWS($B$2:B1203)>'بينات التلاميد'!$Q$5,\"\",INDEX('بينات التلاميد'!$B$5:$B$56,SMALL(IF('بينات التلاميد'!$B$5:$B$56<>\"\",ROW('بينات التلاميد'!$B$5:$B$56)-ROW($B$5)+1),ROWS($B$2:B1203))))","v":""}]
[null,{"$f":"IF(ROWS($B$2:B1204)>'بينات التلاميد'!$Q$5,\"\",INDEX('بينات التلاميد'!$B$5:$B$56,SMALL(IF('بينات التلاميد'!$B$5:$B$56<>\"\",ROW('بينات التلاميد'!$B$5:$B$56)-ROW($B$5)+1),ROWS($B$2:B1204))))","v":""}]
[null,{"$f":"IF(ROWS($B$2:B1205)>'بينات التلاميد'!$Q$5,\"\",INDEX('بينات التلاميد'!$B$5:$B$56,SMALL(IF('بينات التلاميد'!$B$5:$B$56<>\"\",ROW('بينات التلاميد'!$B$5:$B$56)-ROW($B$5)+1),ROWS($B$2:B1205))))","v":""}]
[null,{"$f":"IF(ROWS($B$2:B1206)>'بينات التلاميد'!$Q$5,\"\",INDEX('بينات التلاميد'!$B$5:$B$56,SMALL(IF('بينات التلاميد'!$B$5:$B$56<>\"\",ROW('بينات التلاميد'!$B$5:$B$56)-ROW($B$5)+1),ROWS($B$2:B1206))))","v":""}]
[null,{"$f":"IF(ROWS($B$2:B1207)>'بينات التلاميد'!$Q$5,\"\",INDEX('بينات التلاميد'!$B$5:$B$56,SMALL(IF('بينات التلاميد'!$B$5:$B$56<>\"\",ROW('بينات التلاميد'!$B$5:$B$56)-ROW($B$5)+1),ROWS($B$2:B1207))))","v":""}]
[null,{"$f":"IF(ROWS($B$2:B1208)>'بينات التلاميد'!$Q$5,\"\",INDEX('بينات التلاميد'!$B$5:$B$56,SMALL(IF('بينات التلاميد'!$B$5:$B$56<>\"\",ROW('بينات التلاميد'!$B$5:$B$56)-ROW($B$5)+1),ROWS($B$2:B1208))))","v":""}]
[null,{"$f":"IF(ROWS($B$2:B1209)>'بينات التلاميد'!$Q$5,\"\",INDEX('بينات التلاميد'!$B$5:$B$56,SMALL(IF('بينات التلاميد'!$B$5:$B$56<>\"\",ROW('بينات التلاميد'!$B$5:$B$56)-ROW($B$5)+1),ROWS($B$2:B1209))))","v":""}]
[null,{"$f":"IF(ROWS($B$2:B1210)>'بينات التلاميد'!$Q$5,\"\",INDEX('بينات التلاميد'!$B$5:$B$56,SMALL(IF('بينات التلاميد'!$B$5:$B$56<>\"\",ROW('بينات التلاميد'!$B$5:$B$56)-ROW($B$5)+1),ROWS($B$2:B1210))))","v":""}]
[null,{"$f":"IF(ROWS($B$2:B1211)>'بينات التلاميد'!$Q$5,\"\",INDEX('بينات التلاميد'!$B$5:$B$56,SMALL(IF('بينات التلاميد'!$B$5:$B$56<>\"\",ROW('بينات التلاميد'!$B$5:$B$56)-ROW($B$5)+1),ROWS($B$2:B1211))))","v":""}]
[null,{"$f":"IF(ROWS($B$2:B1212)>'بينات التلاميد'!$Q$5,\"\",INDEX('بينات التلاميد'!$B$5:$B$56,SMALL(IF('بينات التلاميد'!$B$5:$B$56<>\"\",ROW('بينات التلاميد'!$B$5:$B$56)-ROW($B$5)+1),ROWS($B$2:B1212))))","v":""}]
[null,{"$f":"IF(ROWS($B$2:B1213)>'بينات التلاميد'!$Q$5,\"\",INDEX('بينات التلاميد'!$B$5:$B$56,SMALL(IF('بينات التلاميد'!$B$5:$B$56<>\"\",ROW('بينات التلاميد'!$B$5:$B$56)-ROW($B$5)+1),ROWS($B$2:B1213))))","v":""}]
[null,{"$f":"IF(ROWS($B$2:B1214)>'بينات التلاميد'!$Q$5,\"\",INDEX('بينات التلاميد'!$B$5:$B$56,SMALL(IF('بينات التلاميد'!$B$5:$B$56<>\"\",ROW('بينات التلاميد'!$B$5:$B$56)-ROW($B$5)+1),ROWS($B$2:B1214))))","v":""}]
[null,{"$f":"IF(ROWS($B$2:B1215)>'بينات التلاميد'!$Q$5,\"\",INDEX('بينات التلاميد'!$B$5:$B$56,SMALL(IF('بينات التلاميد'!$B$5:$B$56<>\"\",ROW('بينات التلاميد'!$B$5:$B$56)-ROW($B$5)+1),ROWS($B$2:B1215))))","v":""}]
[null,{"$f":"IF(ROWS($B$2:B1216)>'بينات التلاميد'!$Q$5,\"\",INDEX('بينات التلاميد'!$B$5:$B$56,SMALL(IF('بينات التلاميد'!$B$5:$B$56<>\"\",ROW('بينات التلاميد'!$B$5:$B$56)-ROW($B$5)+1),ROWS($B$2:B1216))))","v":""}]
[null,{"$f":"IF(ROWS($B$2:B1217)>'بينات التلاميد'!$Q$5,\"\",INDEX('بينات التلاميد'!$B$5:$B$56,SMALL(IF('بينات التلاميد'!$B$5:$B$56<>\"\",ROW('بينات التلاميد'!$B$5:$B$56)-ROW($B$5)+1),ROWS($B$2:B1217))))","v":""}]
[null,{"$f":"IF(ROWS($B$2:B1218)>'بينات التلاميد'!$Q$5,\"\",INDEX('بينات التلاميد'!$B$5:$B$56,SMALL(IF('بينات التلاميد'!$B$5:$B$56<>\"\",ROW('بينات التلاميد'!$B$5:$B$56)-ROW($B$5)+1),ROWS($B$2:B1218))))","v":""}]
[null,{"$f":"IF(ROWS($B$2:B1219)>'بينات التلاميد'!$Q$5,\"\",INDEX('بينات التلاميد'!$B$5:$B$56,SMALL(IF('بينات التلاميد'!$B$5:$B$56<>\"\",ROW('بينات التلاميد'!$B$5:$B$56)-ROW($B$5)+1),ROWS($B$2:B1219))))","v":""}]
[null,{"$f":"IF(ROWS($B$2:B1220)>'بينات التلاميد'!$Q$5,\"\",INDEX('بينات التلاميد'!$B$5:$B$56,SMALL(IF('بينات التلاميد'!$B$5:$B$56<>\"\",ROW('بينات التلاميد'!$B$5:$B$56)-ROW($B$5)+1),ROWS($B$2:B1220))))","v":""}]
[null,{"$f":"IF(ROWS($B$2:B1221)>'بينات التلاميد'!$Q$5,\"\",INDEX('بينات التلاميد'!$B$5:$B$56,SMALL(IF('بينات التلاميد'!$B$5:$B$56<>\"\",ROW('بينات التلاميد'!$B$5:$B$56)-ROW($B$5)+1),ROWS($B$2:B1221))))","v":""}]
[null,{"$f":"IF(ROWS($B$2:B1222)>'بينات التلاميد'!$Q$5,\"\",INDEX('بينات التلاميد'!$B$5:$B$56,SMALL(IF('بينات التلاميد'!$B$5:$B$56<>\"\",ROW('بينات التلاميد'!$B$5:$B$56)-ROW($B$5)+1),ROWS($B$2:B1222))))","v":""}]
[null,{"$f":"IF(ROWS($B$2:B1223)>'بينات التلاميد'!$Q$5,\"\",INDEX('بينات التلاميد'!$B$5:$B$56,SMALL(IF('بينات التلاميد'!$B$5:$B$56<>\"\",ROW('بينات التلاميد'!$B$5:$B$56)-ROW($B$5)+1),ROWS($B$2:B1223))))","v":""}]
[null,{"$f":"IF(ROWS($B$2:B1224)>'بينات التلاميد'!$Q$5,\"\",INDEX('بينات التلاميد'!$B$5:$B$56,SMALL(IF('بينات التلاميد'!$B$5:$B$56<>\"\",ROW('بينات التلاميد'!$B$5:$B$56)-ROW($B$5)+1),ROWS($B$2:B1224))))","v":""}]
[null,{"$f":"IF(ROWS($B$2:B1225)>'بينات التلاميد'!$Q$5,\"\",INDEX('بينات التلاميد'!$B$5:$B$56,SMALL(IF('بينات التلاميد'!$B$5:$B$56<>\"\",ROW('بينات التلاميد'!$B$5:$B$56)-ROW($B$5)+1),ROWS($B$2:B1225))))","v":""}]
[null,{"$f":"IF(ROWS($B$2:B1226)>'بينات التلاميد'!$Q$5,\"\",INDEX('بينات التلاميد'!$B$5:$B$56,SMALL(IF('بينات التلاميد'!$B$5:$B$56<>\"\",ROW('بينات التلاميد'!$B$5:$B$56)-ROW($B$5)+1),ROWS($B$2:B1226))))","v":""}]
[null,{"$f":"IF(ROWS($B$2:B1227)>'بينات التلاميد'!$Q$5,\"\",INDEX('بينات التلاميد'!$B$5:$B$56,SMALL(IF('بينات التلاميد'!$B$5:$B$56<>\"\",ROW('بينات التلاميد'!$B$5:$B$56)-ROW($B$5)+1),ROWS($B$2:B1227))))","v":""}]
[null,{"$f":"IF(ROWS($B$2:B1228)>'بينات التلاميد'!$Q$5,\"\",INDEX('بينات التلاميد'!$B$5:$B$56,SMALL(IF('بينات التلاميد'!$B$5:$B$56<>\"\",ROW('بينات التلاميد'!$B$5:$B$56)-ROW($B$5)+1),ROWS($B$2:B1228))))","v":""}]
[null,{"$f":"IF(ROWS($B$2:B1229)>'بينات التلاميد'!$Q$5,\"\",INDEX('بينات التلاميد'!$B$5:$B$56,SMALL(IF('بينات التلاميد'!$B$5:$B$56<>\"\",ROW('بينات التلاميد'!$B$5:$B$56)-ROW($B$5)+1),ROWS($B$2:B1229))))","v":""}]
[null,{"$f":"IF(ROWS($B$2:B1230)>'بينات التلاميد'!$Q$5,\"\",INDEX('بينات التلاميد'!$B$5:$B$56,SMALL(IF('بينات التلاميد'!$B$5:$B$56<>\"\",ROW('بينات التلاميد'!$B$5:$B$56)-ROW($B$5)+1),ROWS($B$2:B1230))))","v":""}]
[null,{"$f":"IF(ROWS($B$2:B1231)>'بينات التلاميد'!$Q$5,\"\",INDEX('بينات التلاميد'!$B$5:$B$56,SMALL(IF('بينات التلاميد'!$B$5:$B$56<>\"\",ROW('بينات التلاميد'!$B$5:$B$56)-ROW($B$5)+1),ROWS($B$2:B1231))))","v":""}]
[null,{"$f":"IF(ROWS($B$2:B1232)>'بينات التلاميد'!$Q$5,\"\",INDEX('بينات التلاميد'!$B$5:$B$56,SMALL(IF('بينات التلاميد'!$B$5:$B$56<>\"\",ROW('بينات التلاميد'!$B$5:$B$56)-ROW($B$5)+1),ROWS($B$2:B1232))))","v":""}]
[null,{"$f":"IF(ROWS($B$2:B1233)>'بينات التلاميد'!$Q$5,\"\",INDEX('بينات التلاميد'!$B$5:$B$56,SMALL(IF('بينات التلاميد'!$B$5:$B$56<>\"\",ROW('بينات التلاميد'!$B$5:$B$56)-ROW($B$5)+1),ROWS($B$2:B1233))))","v":""}]
[null,{"$f":"IF(ROWS($B$2:B1234)>'بينات التلاميد'!$Q$5,\"\",INDEX('بينات التلاميد'!$B$5:$B$56,SMALL(IF('بينات التلاميد'!$B$5:$B$56<>\"\",ROW('بينات التلاميد'!$B$5:$B$56)-ROW($B$5)+1),ROWS($B$2:B1234))))","v":""}]
[null,{"$f":"IF(ROWS($B$2:B1235)>'بينات التلاميد'!$Q$5,\"\",INDEX('بينات التلاميد'!$B$5:$B$56,SMALL(IF('بينات التلاميد'!$B$5:$B$56<>\"\",ROW('بينات التلاميد'!$B$5:$B$56)-ROW($B$5)+1),ROWS($B$2:B1235))))","v":""}]
[null,{"$f":"IF(ROWS($B$2:B1236)>'بينات التلاميد'!$Q$5,\"\",INDEX('بينات التلاميد'!$B$5:$B$56,SMALL(IF('بينات التلاميد'!$B$5:$B$56<>\"\",ROW('بينات التلاميد'!$B$5:$B$56)-ROW($B$5)+1),ROWS($B$2:B1236))))","v":""}]
[null,{"$f":"IF(ROWS($B$2:B1237)>'بينات التلاميد'!$Q$5,\"\",INDEX('بينات التلاميد'!$B$5:$B$56,SMALL(IF('بينات التلاميد'!$B$5:$B$56<>\"\",ROW('بينات التلاميد'!$B$5:$B$56)-ROW($B$5)+1),ROWS($B$2:B1237))))","v":""}]
[null,{"$f":"IF(ROWS($B$2:B1238)>'بينات التلاميد'!$Q$5,\"\",INDEX('بينات التلاميد'!$B$5:$B$56,SMALL(IF('بينات التلاميد'!$B$5:$B$56<>\"\",ROW('بينات التلاميد'!$B$5:$B$56)-ROW($B$5)+1),ROWS($B$2:B1238))))","v":""}]
[null,{"$f":"IF(ROWS($B$2:B1239)>'بينات التلاميد'!$Q$5,\"\",INDEX('بينات التلاميد'!$B$5:$B$56,SMALL(IF('بينات التلاميد'!$B$5:$B$56<>\"\",ROW('بينات التلاميد'!$B$5:$B$56)-ROW($B$5)+1),ROWS($B$2:B1239))))","v":""}]
[null,{"$f":"IF(ROWS($B$2:B1240)>'بينات التلاميد'!$Q$5,\"\",INDEX('بينات التلاميد'!$B$5:$B$56,SMALL(IF('بينات التلاميد'!$B$5:$B$56<>\"\",ROW('بينات التلاميد'!$B$5:$B$56)-ROW($B$5)+1),ROWS($B$2:B1240))))","v":""}]
[null,{"$f":"IF(ROWS($B$2:B1241)>'بينات التلاميد'!$Q$5,\"\",INDEX('بينات التلاميد'!$B$5:$B$56,SMALL(IF('بينات التلاميد'!$B$5:$B$56<>\"\",ROW('بينات التلاميد'!$B$5:$B$56)-ROW($B$5)+1),ROWS($B$2:B1241))))","v":""}]
[null,{"$f":"IF(ROWS($B$2:B1242)>'بينات التلاميد'!$Q$5,\"\",INDEX('بينات التلاميد'!$B$5:$B$56,SMALL(IF('بينات التلاميد'!$B$5:$B$56<>\"\",ROW('بينات التلاميد'!$B$5:$B$56)-ROW($B$5)+1),ROWS($B$2:B1242))))","v":""}]
[null,{"$f":"IF(ROWS($B$2:B1243)>'بينات التلاميد'!$Q$5,\"\",INDEX('بينات التلاميد'!$B$5:$B$56,SMALL(IF('بينات التلاميد'!$B$5:$B$56<>\"\",ROW('بينات التلاميد'!$B$5:$B$56)-ROW($B$5)+1),ROWS($B$2:B1243))))","v":""}]
[null,{"$f":"IF(ROWS($B$2:B1244)>'بينات التلاميد'!$Q$5,\"\",INDEX('بينات التلاميد'!$B$5:$B$56,SMALL(IF('بينات التلاميد'!$B$5:$B$56<>\"\",ROW('بينات التلاميد'!$B$5:$B$56)-ROW($B$5)+1),ROWS($B$2:B1244))))","v":""}]
[null,{"$f":"IF(ROWS($B$2:B1245)>'بينات التلاميد'!$Q$5,\"\",INDEX('بينات التلاميد'!$B$5:$B$56,SMALL(IF('بينات التلاميد'!$B$5:$B$56<>\"\",ROW('بينات التلاميد'!$B$5:$B$56)-ROW($B$5)+1),ROWS($B$2:B1245))))","v":""}]
[null,{"$f":"IF(ROWS($B$2:B1246)>'بينات التلاميد'!$Q$5,\"\",INDEX('بينات التلاميد'!$B$5:$B$56,SMALL(IF('بينات التلاميد'!$B$5:$B$56<>\"\",ROW('بينات التلاميد'!$B$5:$B$56)-ROW($B$5)+1),ROWS($B$2:B1246))))","v":""}]
[null,{"$f":"IF(ROWS($B$2:B1247)>'بينات التلاميد'!$Q$5,\"\",INDEX('بينات التلاميد'!$B$5:$B$56,SMALL(IF('بينات التلاميد'!$B$5:$B$56<>\"\",ROW('بينات التلاميد'!$B$5:$B$56)-ROW($B$5)+1),ROWS($B$2:B1247))))","v":""}]
[null,{"$f":"IF(ROWS($B$2:B1248)>'بينات التلاميد'!$Q$5,\"\",INDEX('بينات التلاميد'!$B$5:$B$56,SMALL(IF('بينات التلاميد'!$B$5:$B$56<>\"\",ROW('بينات التلاميد'!$B$5:$B$56)-ROW($B$5)+1),ROWS($B$2:B1248))))","v":""}]
[null,{"$f":"IF(ROWS($B$2:B1249)>'بينات التلاميد'!$Q$5,\"\",INDEX('بينات التلاميد'!$B$5:$B$56,SMALL(IF('بينات التلاميد'!$B$5:$B$56<>\"\",ROW('بينات التلاميد'!$B$5:$B$56)-ROW($B$5)+1),ROWS($B$2:B1249))))","v":""}]
[null,{"$f":"IF(ROWS($B$2:B1250)>'بينات التلاميد'!$Q$5,\"\",INDEX('بينات التلاميد'!$B$5:$B$56,SMALL(IF('بينات التلاميد'!$B$5:$B$56<>\"\",ROW('بينات التلاميد'!$B$5:$B$56)-ROW($B$5)+1),ROWS($B$2:B1250))))","v":""}]
[null,{"$f":"IF(ROWS($B$2:B1251)>'بينات التلاميد'!$Q$5,\"\",INDEX('بينات التلاميد'!$B$5:$B$56,SMALL(IF('بينات التلاميد'!$B$5:$B$56<>\"\",ROW('بينات التلاميد'!$B$5:$B$56)-ROW($B$5)+1),ROWS($B$2:B1251))))","v":""}]
[null,{"$f":"IF(ROWS($B$2:B1252)>'بينات التلاميد'!$Q$5,\"\",INDEX('بينات التلاميد'!$B$5:$B$56,SMALL(IF('بينات التلاميد'!$B$5:$B$56<>\"\",ROW('بينات التلاميد'!$B$5:$B$56)-ROW($B$5)+1),ROWS($B$2:B1252))))","v":""}]
[null,{"$f":"IF(ROWS($B$2:B1253)>'بينات التلاميد'!$Q$5,\"\",INDEX('بينات التلاميد'!$B$5:$B$56,SMALL(IF('بينات التلاميد'!$B$5:$B$56<>\"\",ROW('بينات التلاميد'!$B$5:$B$56)-ROW($B$5)+1),ROWS($B$2:B1253))))","v":""}]
[null,{"$f":"IF(ROWS($B$2:B1254)>'بينات التلاميد'!$Q$5,\"\",INDEX('بينات التلاميد'!$B$5:$B$56,SMALL(IF('بينات التلاميد'!$B$5:$B$56<>\"\",ROW('بينات التلاميد'!$B$5:$B$56)-ROW($B$5)+1),ROWS($B$2:B1254))))","v":""}]
[null,{"$f":"IF(ROWS($B$2:B1255)>'بينات التلاميد'!$Q$5,\"\",INDEX('بينات التلاميد'!$B$5:$B$56,SMALL(IF('بينات التلاميد'!$B$5:$B$56<>\"\",ROW('بينات التلاميد'!$B$5:$B$56)-ROW($B$5)+1),ROWS($B$2:B1255))))","v":""}]
[null,{"$f":"IF(ROWS($B$2:B1256)>'بينات التلاميد'!$Q$5,\"\",INDEX('بينات التلاميد'!$B$5:$B$56,SMALL(IF('بينات التلاميد'!$B$5:$B$56<>\"\",ROW('بينات التلاميد'!$B$5:$B$56)-ROW($B$5)+1),ROWS($B$2:B1256))))","v":""}]
[null,{"$f":"IF(ROWS($B$2:B1257)>'بينات التلاميد'!$Q$5,\"\",INDEX('بينات التلاميد'!$B$5:$B$56,SMALL(IF('بينات التلاميد'!$B$5:$B$56<>\"\",ROW('بينات التلاميد'!$B$5:$B$56)-ROW($B$5)+1),ROWS($B$2:B1257))))","v":""}]
[null,{"$f":"IF(ROWS($B$2:B1258)>'بينات التلاميد'!$Q$5,\"\",INDEX('بينات التلاميد'!$B$5:$B$56,SMALL(IF('بينات التلاميد'!$B$5:$B$56<>\"\",ROW('بينات التلاميد'!$B$5:$B$56)-ROW($B$5)+1),ROWS($B$2:B1258))))","v":""}]
[null,{"$f":"IF(ROWS($B$2:B1259)>'بينات التلاميد'!$Q$5,\"\",INDEX('بينات التلاميد'!$B$5:$B$56,SMALL(IF('بينات التلاميد'!$B$5:$B$56<>\"\",ROW('بينات التلاميد'!$B$5:$B$56)-ROW($B$5)+1),ROWS($B$2:B1259))))","v":""}]
[null,{"$f":"IF(ROWS($B$2:B1260)>'بينات التلاميد'!$Q$5,\"\",INDEX('بينات التلاميد'!$B$5:$B$56,SMALL(IF('بينات التلاميد'!$B$5:$B$56<>\"\",ROW('بينات التلاميد'!$B$5:$B$56)-ROW($B$5)+1),ROWS($B$2:B1260))))","v":""}]
[null,{"$f":"IF(ROWS($B$2:B1261)>'بينات التلاميد'!$Q$5,\"\",INDEX('بينات التلاميد'!$B$5:$B$56,SMALL(IF('بينات التلاميد'!$B$5:$B$56<>\"\",ROW('بينات التلاميد'!$B$5:$B$56)-ROW($B$5)+1),ROWS($B$2:B1261))))","v":""}]
[null,{"$f":"IF(ROWS($B$2:B1262)>'بينات التلاميد'!$Q$5,\"\",INDEX('بينات التلاميد'!$B$5:$B$56,SMALL(IF('بينات التلاميد'!$B$5:$B$56<>\"\",ROW('بينات التلاميد'!$B$5:$B$56)-ROW($B$5)+1),ROWS($B$2:B1262))))","v":""}]
[null,{"$f":"IF(ROWS($B$2:B1263)>'بينات التلاميد'!$Q$5,\"\",INDEX('بينات التلاميد'!$B$5:$B$56,SMALL(IF('بينات التلاميد'!$B$5:$B$56<>\"\",ROW('بينات التلاميد'!$B$5:$B$56)-ROW($B$5)+1),ROWS($B$2:B1263))))","v":""}]
[null,{"$f":"IF(ROWS($B$2:B1264)>'بينات التلاميد'!$Q$5,\"\",INDEX('بينات التلاميد'!$B$5:$B$56,SMALL(IF('بينات التلاميد'!$B$5:$B$56<>\"\",ROW('بينات التلاميد'!$B$5:$B$56)-ROW($B$5)+1),ROWS($B$2:B1264))))","v":""}]
[null,{"$f":"IF(ROWS($B$2:B1265)>'بينات التلاميد'!$Q$5,\"\",INDEX('بينات التلاميد'!$B$5:$B$56,SMALL(IF('بينات التلاميد'!$B$5:$B$56<>\"\",ROW('بينات التلاميد'!$B$5:$B$56)-ROW($B$5)+1),ROWS($B$2:B1265))))","v":""}]
[null,{"$f":"IF(ROWS($B$2:B1266)>'بينات التلاميد'!$Q$5,\"\",INDEX('بينات التلاميد'!$B$5:$B$56,SMALL(IF('بينات التلاميد'!$B$5:$B$56<>\"\",ROW('بينات التلاميد'!$B$5:$B$56)-ROW($B$5)+1),ROWS($B$2:B1266))))","v":""}]
[null,{"$f":"IF(ROWS($B$2:B1267)>'بينات التلاميد'!$Q$5,\"\",INDEX('بينات التلاميد'!$B$5:$B$56,SMALL(IF('بينات التلاميد'!$B$5:$B$56<>\"\",ROW('بينات التلاميد'!$B$5:$B$56)-ROW($B$5)+1),ROWS($B$2:B1267))))","v":""}]
[null,{"$f":"IF(ROWS($B$2:B1268)>'بينات التلاميد'!$Q$5,\"\",INDEX('بينات التلاميد'!$B$5:$B$56,SMALL(IF('بينات التلاميد'!$B$5:$B$56<>\"\",ROW('بينات التلاميد'!$B$5:$B$56)-ROW($B$5)+1),ROWS($B$2:B1268))))","v":""}]
[null,{"$f":"IF(ROWS($B$2:B1269)>'بينات التلاميد'!$Q$5,\"\",INDEX('بينات التلاميد'!$B$5:$B$56,SMALL(IF('بينات التلاميد'!$B$5:$B$56<>\"\",ROW('بينات التلاميد'!$B$5:$B$56)-ROW($B$5)+1),ROWS($B$2:B1269))))","v":""}]
[null,{"$f":"IF(ROWS($B$2:B1270)>'بينات التلاميد'!$Q$5,\"\",INDEX('بينات التلاميد'!$B$5:$B$56,SMALL(IF('بينات التلاميد'!$B$5:$B$56<>\"\",ROW('بينات التلاميد'!$B$5:$B$56)-ROW($B$5)+1),ROWS($B$2:B1270))))","v":""}]
[null,{"$f":"IF(ROWS($B$2:B1271)>'بينات التلاميد'!$Q$5,\"\",INDEX('بينات التلاميد'!$B$5:$B$56,SMALL(IF('بينات التلاميد'!$B$5:$B$56<>\"\",ROW('بينات التلاميد'!$B$5:$B$56)-ROW($B$5)+1),ROWS($B$2:B1271))))","v":""}]
[null,{"$f":"IF(ROWS($B$2:B1272)>'بينات التلاميد'!$Q$5,\"\",INDEX('بينات التلاميد'!$B$5:$B$56,SMALL(IF('بينات التلاميد'!$B$5:$B$56<>\"\",ROW('بينات التلاميد'!$B$5:$B$56)-ROW($B$5)+1),ROWS($B$2:B1272))))","v":""}]
[null,{"$f":"IF(ROWS($B$2:B1273)>'بينات التلاميد'!$Q$5,\"\",INDEX('بينات التلاميد'!$B$5:$B$56,SMALL(IF('بينات التلاميد'!$B$5:$B$56<>\"\",ROW('بينات التلاميد'!$B$5:$B$56)-ROW($B$5)+1),ROWS($B$2:B1273))))","v":""}]
[null,{"$f":"IF(ROWS($B$2:B1274)>'بينات التلاميد'!$Q$5,\"\",INDEX('بينات التلاميد'!$B$5:$B$56,SMALL(IF('بينات التلاميد'!$B$5:$B$56<>\"\",ROW('بينات التلاميد'!$B$5:$B$56)-ROW($B$5)+1),ROWS($B$2:B1274))))","v":""}]
[null,{"$f":"IF(ROWS($B$2:B1275)>'بينات التلاميد'!$Q$5,\"\",INDEX('بينات التلاميد'!$B$5:$B$56,SMALL(IF('بينات التلاميد'!$B$5:$B$56<>\"\",ROW('بينات التلاميد'!$B$5:$B$56)-ROW($B$5)+1),ROWS($B$2:B1275))))","v":""}]
[null,{"$f":"IF(ROWS($B$2:B1276)>'بينات التلاميد'!$Q$5,\"\",INDEX('بينات التلاميد'!$B$5:$B$56,SMALL(IF('بينات التلاميد'!$B$5:$B$56<>\"\",ROW('بينات التلاميد'!$B$5:$B$56)-ROW($B$5)+1),ROWS($B$2:B1276))))","v":""}]
[null,{"$f":"IF(ROWS($B$2:B1277)>'بينات التلاميد'!$Q$5,\"\",INDEX('بينات التلاميد'!$B$5:$B$56,SMALL(IF('بينات التلاميد'!$B$5:$B$56<>\"\",ROW('بينات التلاميد'!$B$5:$B$56)-ROW($B$5)+1),ROWS($B$2:B1277))))","v":""}]
[null,{"$f":"IF(ROWS($B$2:B1278)>'بينات التلاميد'!$Q$5,\"\",INDEX('بينات التلاميد'!$B$5:$B$56,SMALL(IF('بينات التلاميد'!$B$5:$B$56<>\"\",ROW('بينات التلاميد'!$B$5:$B$56)-ROW($B$5)+1),ROWS($B$2:B1278))))","v":""}]
[null,{"$f":"IF(ROWS($B$2:B1279)>'بينات التلاميد'!$Q$5,\"\",INDEX('بينات التلاميد'!$B$5:$B$56,SMALL(IF('بينات التلاميد'!$B$5:$B$56<>\"\",ROW('بينات التلاميد'!$B$5:$B$56)-ROW($B$5)+1),ROWS($B$2:B1279))))","v":""}]
[null,{"$f":"IF(ROWS($B$2:B1280)>'بينات التلاميد'!$Q$5,\"\",INDEX('بينات التلاميد'!$B$5:$B$56,SMALL(IF('بينات التلاميد'!$B$5:$B$56<>\"\",ROW('بينات التلاميد'!$B$5:$B$56)-ROW($B$5)+1),ROWS($B$2:B1280))))","v":""}]
[null,{"$f":"IF(ROWS($B$2:B1281)>'بينات التلاميد'!$Q$5,\"\",INDEX('بينات التلاميد'!$B$5:$B$56,SMALL(IF('بينات التلاميد'!$B$5:$B$56<>\"\",ROW('بينات التلاميد'!$B$5:$B$56)-ROW($B$5)+1),ROWS($B$2:B1281))))","v":""}]
[null,{"$f":"IF(ROWS($B$2:B1282)>'بينات التلاميد'!$Q$5,\"\",INDEX('بينات التلاميد'!$B$5:$B$56,SMALL(IF('بينات التلاميد'!$B$5:$B$56<>\"\",ROW('بينات التلاميد'!$B$5:$B$56)-ROW($B$5)+1),ROWS($B$2:B1282))))","v":""}]
[null,{"$f":"IF(ROWS($B$2:B1283)>'بينات التلاميد'!$Q$5,\"\",INDEX('بينات التلاميد'!$B$5:$B$56,SMALL(IF('بينات التلاميد'!$B$5:$B$56<>\"\",ROW('بينات التلاميد'!$B$5:$B$56)-ROW($B$5)+1),ROWS($B$2:B1283))))","v":""}]
[null,{"$f":"IF(ROWS($B$2:B1284)>'بينات التلاميد'!$Q$5,\"\",INDEX('بينات التلاميد'!$B$5:$B$56,SMALL(IF('بينات التلاميد'!$B$5:$B$56<>\"\",ROW('بينات التلاميد'!$B$5:$B$56)-ROW($B$5)+1),ROWS($B$2:B1284))))","v":""}]
[null,{"$f":"IF(ROWS($B$2:B1285)>'بينات التلاميد'!$Q$5,\"\",INDEX('بينات التلاميد'!$B$5:$B$56,SMALL(IF('بينات التلاميد'!$B$5:$B$56<>\"\",ROW('بينات التلاميد'!$B$5:$B$56)-ROW($B$5)+1),ROWS($B$2:B1285))))","v":""}]
[null,{"$f":"IF(ROWS($B$2:B1286)>'بينات التلاميد'!$Q$5,\"\",INDEX('بينات التلاميد'!$B$5:$B$56,SMALL(IF('بينات التلاميد'!$B$5:$B$56<>\"\",ROW('بينات التلاميد'!$B$5:$B$56)-ROW($B$5)+1),ROWS($B$2:B1286))))","v":""}]
[null,{"$f":"IF(ROWS($B$2:B1287)>'بينات التلاميد'!$Q$5,\"\",INDEX('بينات التلاميد'!$B$5:$B$56,SMALL(IF('بينات التلاميد'!$B$5:$B$56<>\"\",ROW('بينات التلاميد'!$B$5:$B$56)-ROW($B$5)+1),ROWS($B$2:B1287))))","v":""}]
[null,{"$f":"IF(ROWS($B$2:B1288)>'بينات التلاميد'!$Q$5,\"\",INDEX('بينات التلاميد'!$B$5:$B$56,SMALL(IF('بينات التلاميد'!$B$5:$B$56<>\"\",ROW('بينات التلاميد'!$B$5:$B$56)-ROW($B$5)+1),ROWS($B$2:B1288))))","v":""}]
[null,{"$f":"IF(ROWS($B$2:B1289)>'بينات التلاميد'!$Q$5,\"\",INDEX('بينات التلاميد'!$B$5:$B$56,SMALL(IF('بينات التلاميد'!$B$5:$B$56<>\"\",ROW('بينات التلاميد'!$B$5:$B$56)-ROW($B$5)+1),ROWS($B$2:B1289))))","v":""}]
[null,{"$f":"IF(ROWS($B$2:B1290)>'بينات التلاميد'!$Q$5,\"\",INDEX('بينات التلاميد'!$B$5:$B$56,SMALL(IF('بينات التلاميد'!$B$5:$B$56<>\"\",ROW('بينات التلاميد'!$B$5:$B$56)-ROW($B$5)+1),ROWS($B$2:B1290))))","v":""}]
[null,{"$f":"IF(ROWS($B$2:B1291)>'بينات التلاميد'!$Q$5,\"\",INDEX('بينات التلاميد'!$B$5:$B$56,SMALL(IF('بينات التلاميد'!$B$5:$B$56<>\"\",ROW('بينات التلاميد'!$B$5:$B$56)-ROW($B$5)+1),ROWS($B$2:B1291))))","v":""}]
[null,{"$f":"IF(ROWS($B$2:B1292)>'بينات التلاميد'!$Q$5,\"\",INDEX('بينات التلاميد'!$B$5:$B$56,SMALL(IF('بينات التلاميد'!$B$5:$B$56<>\"\",ROW('بينات التلاميد'!$B$5:$B$56)-ROW($B$5)+1),ROWS($B$2:B1292))))","v":""}]
[null,{"$f":"IF(ROWS($B$2:B1293)>'بينات التلاميد'!$Q$5,\"\",INDEX('بينات التلاميد'!$B$5:$B$56,SMALL(IF('بينات التلاميد'!$B$5:$B$56<>\"\",ROW('بينات التلاميد'!$B$5:$B$56)-ROW($B$5)+1),ROWS($B$2:B1293))))","v":""}]
[null,{"$f":"IF(ROWS($B$2:B1294)>'بينات التلاميد'!$Q$5,\"\",INDEX('بينات التلاميد'!$B$5:$B$56,SMALL(IF('بينات التلاميد'!$B$5:$B$56<>\"\",ROW('بينات التلاميد'!$B$5:$B$56)-ROW($B$5)+1),ROWS($B$2:B1294))))","v":""}]
[null,{"$f":"IF(ROWS($B$2:B1295)>'بينات التلاميد'!$Q$5,\"\",INDEX('بينات التلاميد'!$B$5:$B$56,SMALL(IF('بينات التلاميد'!$B$5:$B$56<>\"\",ROW('بينات التلاميد'!$B$5:$B$56)-ROW($B$5)+1),ROWS($B$2:B1295))))","v":""}]
[null,{"$f":"IF(ROWS($B$2:B1296)>'بينات التلاميد'!$Q$5,\"\",INDEX('بينات التلاميد'!$B$5:$B$56,SMALL(IF('بينات التلاميد'!$B$5:$B$56<>\"\",ROW('بينات التلاميد'!$B$5:$B$56)-ROW($B$5)+1),ROWS($B$2:B1296))))","v":""}]
[null,{"$f":"IF(ROWS($B$2:B1297)>'بينات التلاميد'!$Q$5,\"\",INDEX('بينات التلاميد'!$B$5:$B$56,SMALL(IF('بينات التلاميد'!$B$5:$B$56<>\"\",ROW('بينات التلاميد'!$B$5:$B$56)-ROW($B$5)+1),ROWS($B$2:B1297))))","v":""}]
[null,{"$f":"IF(ROWS($B$2:B1298)>'بينات التلاميد'!$Q$5,\"\",INDEX('بينات التلاميد'!$B$5:$B$56,SMALL(IF('بينات التلاميد'!$B$5:$B$56<>\"\",ROW('بينات التلاميد'!$B$5:$B$56)-ROW($B$5)+1),ROWS($B$2:B1298))))","v":""}]
[null,{"$f":"IF(ROWS($B$2:B1299)>'بينات التلاميد'!$Q$5,\"\",INDEX('بينات التلاميد'!$B$5:$B$56,SMALL(IF('بينات التلاميد'!$B$5:$B$56<>\"\",ROW('بينات التلاميد'!$B$5:$B$56)-ROW($B$5)+1),ROWS($B$2:B1299))))","v":""}]
[null,{"$f":"IF(ROWS($B$2:B1300)>'بينات التلاميد'!$Q$5,\"\",INDEX('بينات التلاميد'!$B$5:$B$56,SMALL(IF('بينات التلاميد'!$B$5:$B$56<>\"\",ROW('بينات التلاميد'!$B$5:$B$56)-ROW($B$5)+1),ROWS($B$2:B1300))))","v":""}]
[null,{"$f":"IF(ROWS($B$2:B1301)>'بينات التلاميد'!$Q$5,\"\",INDEX('بينات التلاميد'!$B$5:$B$56,SMALL(IF('بينات التلاميد'!$B$5:$B$56<>\"\",ROW('بينات التلاميد'!$B$5:$B$56)-ROW($B$5)+1),ROWS($B$2:B1301))))","v":""}]
[null,{"$f":"IF(ROWS($B$2:B1302)>'بينات التلاميد'!$Q$5,\"\",INDEX('بينات التلاميد'!$B$5:$B$56,SMALL(IF('بينات التلاميد'!$B$5:$B$56<>\"\",ROW('بينات التلاميد'!$B$5:$B$56)-ROW($B$5)+1),ROWS($B$2:B1302))))","v":""}]
[null,{"$f":"IF(ROWS($B$2:B1303)>'بينات التلاميد'!$Q$5,\"\",INDEX('بينات التلاميد'!$B$5:$B$56,SMALL(IF('بينات التلاميد'!$B$5:$B$56<>\"\",ROW('بينات التلاميد'!$B$5:$B$56)-ROW($B$5)+1),ROWS($B$2:B1303))))","v":""}]
[null,{"$f":"IF(ROWS($B$2:B1304)>'بينات التلاميد'!$Q$5,\"\",INDEX('بينات التلاميد'!$B$5:$B$56,SMALL(IF('بينات التلاميد'!$B$5:$B$56<>\"\",ROW('بينات التلاميد'!$B$5:$B$56)-ROW($B$5)+1),ROWS($B$2:B1304))))","v":""}]
[null,{"$f":"IF(ROWS($B$2:B1305)>'بينات التلاميد'!$Q$5,\"\",INDEX('بينات التلاميد'!$B$5:$B$56,SMALL(IF('بينات التلاميد'!$B$5:$B$56<>\"\",ROW('بينات التلاميد'!$B$5:$B$56)-ROW($B$5)+1),ROWS($B$2:B1305))))","v":""}]
[null,{"$f":"IF(ROWS($B$2:B1306)>'بينات التلاميد'!$Q$5,\"\",INDEX('بينات التلاميد'!$B$5:$B$56,SMALL(IF('بينات التلاميد'!$B$5:$B$56<>\"\",ROW('بينات التلاميد'!$B$5:$B$56)-ROW($B$5)+1),ROWS($B$2:B1306))))","v":""}]
[null,{"$f":"IF(ROWS($B$2:B1307)>'بينات التلاميد'!$Q$5,\"\",INDEX('بينات التلاميد'!$B$5:$B$56,SMALL(IF('بينات التلاميد'!$B$5:$B$56<>\"\",ROW('بينات التلاميد'!$B$5:$B$56)-ROW($B$5)+1),ROWS($B$2:B1307))))","v":""}]
[null,{"$f":"IF(ROWS($B$2:B1308)>'بينات التلاميد'!$Q$5,\"\",INDEX('بينات التلاميد'!$B$5:$B$56,SMALL(IF('بينات التلاميد'!$B$5:$B$56<>\"\",ROW('بينات التلاميد'!$B$5:$B$56)-ROW($B$5)+1),ROWS($B$2:B1308))))","v":""}]
[null,{"$f":"IF(ROWS($B$2:B1309)>'بينات التلاميد'!$Q$5,\"\",INDEX('بينات التلاميد'!$B$5:$B$56,SMALL(IF('بينات التلاميد'!$B$5:$B$56<>\"\",ROW('بينات التلاميد'!$B$5:$B$56)-ROW($B$5)+1),ROWS($B$2:B1309))))","v":""}]
[null,{"$f":"IF(ROWS($B$2:B1310)>'بينات التلاميد'!$Q$5,\"\",INDEX('بينات التلاميد'!$B$5:$B$56,SMALL(IF('بينات التلاميد'!$B$5:$B$56<>\"\",ROW('بينات التلاميد'!$B$5:$B$56)-ROW($B$5)+1),ROWS($B$2:B1310))))","v":""}]
[null,{"$f":"IF(ROWS($B$2:B1311)>'بينات التلاميد'!$Q$5,\"\",INDEX('بينات التلاميد'!$B$5:$B$56,SMALL(IF('بينات التلاميد'!$B$5:$B$56<>\"\",ROW('بينات التلاميد'!$B$5:$B$56)-ROW($B$5)+1),ROWS($B$2:B1311))))","v":""}]
[null,{"$f":"IF(ROWS($B$2:B1312)>'بينات التلاميد'!$Q$5,\"\",INDEX('بينات التلاميد'!$B$5:$B$56,SMALL(IF('بينات التلاميد'!$B$5:$B$56<>\"\",ROW('بينات التلاميد'!$B$5:$B$56)-ROW($B$5)+1),ROWS($B$2:B1312))))","v":""}]
[null,{"$f":"IF(ROWS($B$2:B1313)>'بينات التلاميد'!$Q$5,\"\",INDEX('بينات التلاميد'!$B$5:$B$56,SMALL(IF('بينات التلاميد'!$B$5:$B$56<>\"\",ROW('بينات التلاميد'!$B$5:$B$56)-ROW($B$5)+1),ROWS($B$2:B1313))))","v":""}]
[null,{"$f":"IF(ROWS($B$2:B1314)>'بينات التلاميد'!$Q$5,\"\",INDEX('بينات التلاميد'!$B$5:$B$56,SMALL(IF('بينات التلاميد'!$B$5:$B$56<>\"\",ROW('بينات التلاميد'!$B$5:$B$56)-ROW($B$5)+1),ROWS($B$2:B1314))))","v":""}]
[null,{"$f":"IF(ROWS($B$2:B1315)>'بينات التلاميد'!$Q$5,\"\",INDEX('بينات التلاميد'!$B$5:$B$56,SMALL(IF('بينات التلاميد'!$B$5:$B$56<>\"\",ROW('بينات التلاميد'!$B$5:$B$56)-ROW($B$5)+1),ROWS($B$2:B1315))))","v":""}]
[null,{"$f":"IF(ROWS($B$2:B1316)>'بينات التلاميد'!$Q$5,\"\",INDEX('بينات التلاميد'!$B$5:$B$56,SMALL(IF('بينات التلاميد'!$B$5:$B$56<>\"\",ROW('بينات التلاميد'!$B$5:$B$56)-ROW($B$5)+1),ROWS($B$2:B1316))))","v":""}]
[null,{"$f":"IF(ROWS($B$2:B1317)>'بينات التلاميد'!$Q$5,\"\",INDEX('بينات التلاميد'!$B$5:$B$56,SMALL(IF('بينات التلاميد'!$B$5:$B$56<>\"\",ROW('بينات التلاميد'!$B$5:$B$56)-ROW($B$5)+1),ROWS($B$2:B1317))))","v":""}]
[null,{"$f":"IF(ROWS($B$2:B1318)>'بينات التلاميد'!$Q$5,\"\",INDEX('بينات التلاميد'!$B$5:$B$56,SMALL(IF('بينات التلاميد'!$B$5:$B$56<>\"\",ROW('بينات التلاميد'!$B$5:$B$56)-ROW($B$5)+1),ROWS($B$2:B1318))))","v":""}]
[null,{"$f":"IF(ROWS($B$2:B1319)>'بينات التلاميد'!$Q$5,\"\",INDEX('بينات التلاميد'!$B$5:$B$56,SMALL(IF('بينات التلاميد'!$B$5:$B$56<>\"\",ROW('بينات التلاميد'!$B$5:$B$56)-ROW($B$5)+1),ROWS($B$2:B1319))))","v":""}]
[null,{"$f":"IF(ROWS($B$2:B1320)>'بينات التلاميد'!$Q$5,\"\",INDEX('بينات التلاميد'!$B$5:$B$56,SMALL(IF('بينات التلاميد'!$B$5:$B$56<>\"\",ROW('بينات التلاميد'!$B$5:$B$56)-ROW($B$5)+1),ROWS($B$2:B1320))))","v":""}]
[null,{"$f":"IF(ROWS($B$2:B1321)>'بينات التلاميد'!$Q$5,\"\",INDEX('بينات التلاميد'!$B$5:$B$56,SMALL(IF('بينات التلاميد'!$B$5:$B$56<>\"\",ROW('بينات التلاميد'!$B$5:$B$56)-ROW($B$5)+1),ROWS($B$2:B1321))))","v":""}]
[null,{"$f":"IF(ROWS($B$2:B1322)>'بينات التلاميد'!$Q$5,\"\",INDEX('بينات التلاميد'!$B$5:$B$56,SMALL(IF('بينات التلاميد'!$B$5:$B$56<>\"\",ROW('بينات التلاميد'!$B$5:$B$56)-ROW($B$5)+1),ROWS($B$2:B1322))))","v":""}]
[null,{"$f":"IF(ROWS($B$2:B1323)>'بينات التلاميد'!$Q$5,\"\",INDEX('بينات التلاميد'!$B$5:$B$56,SMALL(IF('بينات التلاميد'!$B$5:$B$56<>\"\",ROW('بينات التلاميد'!$B$5:$B$56)-ROW($B$5)+1),ROWS($B$2:B1323))))","v":""}]
[null,{"$f":"IF(ROWS($B$2:B1324)>'بينات التلاميد'!$Q$5,\"\",INDEX('بينات التلاميد'!$B$5:$B$56,SMALL(IF('بينات التلاميد'!$B$5:$B$56<>\"\",ROW('بينات التلاميد'!$B$5:$B$56)-ROW($B$5)+1),ROWS($B$2:B1324))))","v":""}]
[null,{"$f":"IF(ROWS($B$2:B1325)>'بينات التلاميد'!$Q$5,\"\",INDEX('بينات التلاميد'!$B$5:$B$56,SMALL(IF('بينات التلاميد'!$B$5:$B$56<>\"\",ROW('بينات التلاميد'!$B$5:$B$56)-ROW($B$5)+1),ROWS($B$2:B1325))))","v":""}]
[null,{"$f":"IF(ROWS($B$2:B1326)>'بينات التلاميد'!$Q$5,\"\",INDEX('بينات التلاميد'!$B$5:$B$56,SMALL(IF('بينات التلاميد'!$B$5:$B$56<>\"\",ROW('بينات التلاميد'!$B$5:$B$56)-ROW($B$5)+1),ROWS($B$2:B1326))))","v":""}]
[null,{"$f":"IF(ROWS($B$2:B1327)>'بينات التلاميد'!$Q$5,\"\",INDEX('بينات التلاميد'!$B$5:$B$56,SMALL(IF('بينات التلاميد'!$B$5:$B$56<>\"\",ROW('بينات التلاميد'!$B$5:$B$56)-ROW($B$5)+1),ROWS($B$2:B1327))))","v":""}]
[null,{"$f":"IF(ROWS($B$2:B1328)>'بينات التلاميد'!$Q$5,\"\",INDEX('بينات التلاميد'!$B$5:$B$56,SMALL(IF('بينات التلاميد'!$B$5:$B$56<>\"\",ROW('بينات التلاميد'!$B$5:$B$56)-ROW($B$5)+1),ROWS($B$2:B1328))))","v":""}]
[null,{"$f":"IF(ROWS($B$2:B1329)>'بينات التلاميد'!$Q$5,\"\",INDEX('بينات التلاميد'!$B$5:$B$56,SMALL(IF('بينات التلاميد'!$B$5:$B$56<>\"\",ROW('بينات التلاميد'!$B$5:$B$56)-ROW($B$5)+1),ROWS($B$2:B1329))))","v":""}]
[null,{"$f":"IF(ROWS($B$2:B1330)>'بينات التلاميد'!$Q$5,\"\",INDEX('بينات التلاميد'!$B$5:$B$56,SMALL(IF('بينات التلاميد'!$B$5:$B$56<>\"\",ROW('بينات التلاميد'!$B$5:$B$56)-ROW($B$5)+1),ROWS($B$2:B1330))))","v":""}]
[null,{"$f":"IF(ROWS($B$2:B1331)>'بينات التلاميد'!$Q$5,\"\",INDEX('بينات التلاميد'!$B$5:$B$56,SMALL(IF('بينات التلاميد'!$B$5:$B$56<>\"\",ROW('بينات التلاميد'!$B$5:$B$56)-ROW($B$5)+1),ROWS($B$2:B1331))))","v":""}]
[null,{"$f":"IF(ROWS($B$2:B1332)>'بينات التلاميد'!$Q$5,\"\",INDEX('بينات التلاميد'!$B$5:$B$56,SMALL(IF('بينات التلاميد'!$B$5:$B$56<>\"\",ROW('بينات التلاميد'!$B$5:$B$56)-ROW($B$5)+1),ROWS($B$2:B1332))))","v":""}]
[null,{"$f":"IF(ROWS($B$2:B1333)>'بينات التلاميد'!$Q$5,\"\",INDEX('بينات التلاميد'!$B$5:$B$56,SMALL(IF('بينات التلاميد'!$B$5:$B$56<>\"\",ROW('بينات التلاميد'!$B$5:$B$56)-ROW($B$5)+1),ROWS($B$2:B1333))))","v":""}]
[null,{"$f":"IF(ROWS($B$2:B1334)>'بينات التلاميد'!$Q$5,\"\",INDEX('بينات التلاميد'!$B$5:$B$56,SMALL(IF('بينات التلاميد'!$B$5:$B$56<>\"\",ROW('بينات التلاميد'!$B$5:$B$56)-ROW($B$5)+1),ROWS($B$2:B1334))))","v":""}]
[null,{"$f":"IF(ROWS($B$2:B1335)>'بينات التلاميد'!$Q$5,\"\",INDEX('بينات التلاميد'!$B$5:$B$56,SMALL(IF('بينات التلاميد'!$B$5:$B$56<>\"\",ROW('بينات التلاميد'!$B$5:$B$56)-ROW($B$5)+1),ROWS($B$2:B1335))))","v":""}]
[null,{"$f":"IF(ROWS($B$2:B1336)>'بينات التلاميد'!$Q$5,\"\",INDEX('بينات التلاميد'!$B$5:$B$56,SMALL(IF('بينات التلاميد'!$B$5:$B$56<>\"\",ROW('بينات التلاميد'!$B$5:$B$56)-ROW($B$5)+1),ROWS($B$2:B1336))))","v":""}]
[null,{"$f":"IF(ROWS($B$2:B1337)>'بينات التلاميد'!$Q$5,\"\",INDEX('بينات التلاميد'!$B$5:$B$56,SMALL(IF('بينات التلاميد'!$B$5:$B$56<>\"\",ROW('بينات التلاميد'!$B$5:$B$56)-ROW($B$5)+1),ROWS($B$2:B1337))))","v":""}]
[null,{"$f":"IF(ROWS($B$2:B1338)>'بينات التلاميد'!$Q$5,\"\",INDEX('بينات التلاميد'!$B$5:$B$56,SMALL(IF('بينات التلاميد'!$B$5:$B$56<>\"\",ROW('بينات التلاميد'!$B$5:$B$56)-ROW($B$5)+1),ROWS($B$2:B1338))))","v":""}]
[null,{"$f":"IF(ROWS($B$2:B1339)>'بينات التلاميد'!$Q$5,\"\",INDEX('بينات التلاميد'!$B$5:$B$56,SMALL(IF('بينات التلاميد'!$B$5:$B$56<>\"\",ROW('بينات التلاميد'!$B$5:$B$56)-ROW($B$5)+1),ROWS($B$2:B1339))))","v":""}]
[null,{"$f":"IF(ROWS($B$2:B1340)>'بينات التلاميد'!$Q$5,\"\",INDEX('بينات التلاميد'!$B$5:$B$56,SMALL(IF('بينات التلاميد'!$B$5:$B$56<>\"\",ROW('بينات التلاميد'!$B$5:$B$56)-ROW($B$5)+1),ROWS($B$2:B1340))))","v":""}]
[null,{"$f":"IF(ROWS($B$2:B1341)>'بينات التلاميد'!$Q$5,\"\",INDEX('بينات التلاميد'!$B$5:$B$56,SMALL(IF('بينات التلاميد'!$B$5:$B$56<>\"\",ROW('بينات التلاميد'!$B$5:$B$56)-ROW($B$5)+1),ROWS($B$2:B1341))))","v":""}]
[null,{"$f":"IF(ROWS($B$2:B1342)>'بينات التلاميد'!$Q$5,\"\",INDEX('بينات التلاميد'!$B$5:$B$56,SMALL(IF('بينات التلاميد'!$B$5:$B$56<>\"\",ROW('بينات التلاميد'!$B$5:$B$56)-ROW($B$5)+1),ROWS($B$2:B1342))))","v":""}]
[null,{"$f":"IF(ROWS($B$2:B1343)>'بينات التلاميد'!$Q$5,\"\",INDEX('بينات التلاميد'!$B$5:$B$56,SMALL(IF('بينات التلاميد'!$B$5:$B$56<>\"\",ROW('بينات التلاميد'!$B$5:$B$56)-ROW($B$5)+1),ROWS($B$2:B1343))))","v":""}]
[null,{"$f":"IF(ROWS($B$2:B1344)>'بينات التلاميد'!$Q$5,\"\",INDEX('بينات التلاميد'!$B$5:$B$56,SMALL(IF('بينات التلاميد'!$B$5:$B$56<>\"\",ROW('بينات التلاميد'!$B$5:$B$56)-ROW($B$5)+1),ROWS($B$2:B1344))))","v":""}]
[null,{"$f":"IF(ROWS($B$2:B1345)>'بينات التلاميد'!$Q$5,\"\",INDEX('بينات التلاميد'!$B$5:$B$56,SMALL(IF('بينات التلاميد'!$B$5:$B$56<>\"\",ROW('بينات التلاميد'!$B$5:$B$56)-ROW($B$5)+1),ROWS($B$2:B1345))))","v":""}]
[null,{"$f":"IF(ROWS($B$2:B1346)>'بينات التلاميد'!$Q$5,\"\",INDEX('بينات التلاميد'!$B$5:$B$56,SMALL(IF('بينات التلاميد'!$B$5:$B$56<>\"\",ROW('بينات التلاميد'!$B$5:$B$56)-ROW($B$5)+1),ROWS($B$2:B1346))))","v":""}]
[null,{"$f":"IF(ROWS($B$2:B1347)>'بينات التلاميد'!$Q$5,\"\",INDEX('بينات التلاميد'!$B$5:$B$56,SMALL(IF('بينات التلاميد'!$B$5:$B$56<>\"\",ROW('بينات التلاميد'!$B$5:$B$56)-ROW($B$5)+1),ROWS($B$2:B1347))))","v":""}]
[null,{"$f":"IF(ROWS($B$2:B1348)>'بينات التلاميد'!$Q$5,\"\",INDEX('بينات التلاميد'!$B$5:$B$56,SMALL(IF('بينات التلاميد'!$B$5:$B$56<>\"\",ROW('بينات التلاميد'!$B$5:$B$56)-ROW($B$5)+1),ROWS($B$2:B1348))))","v":""}]
[null,{"$f":"IF(ROWS($B$2:B1349)>'بينات التلاميد'!$Q$5,\"\",INDEX('بينات التلاميد'!$B$5:$B$56,SMALL(IF('بينات التلاميد'!$B$5:$B$56<>\"\",ROW('بينات التلاميد'!$B$5:$B$56)-ROW($B$5)+1),ROWS($B$2:B1349))))","v":""}]
[null,{"$f":"IF(ROWS($B$2:B1350)>'بينات التلاميد'!$Q$5,\"\",INDEX('بينات التلاميد'!$B$5:$B$56,SMALL(IF('بينات التلاميد'!$B$5:$B$56<>\"\",ROW('بينات التلاميد'!$B$5:$B$56)-ROW($B$5)+1),ROWS($B$2:B1350))))","v":""}]
[null,{"$f":"IF(ROWS($B$2:B1351)>'بينات التلاميد'!$Q$5,\"\",INDEX('بينات التلاميد'!$B$5:$B$56,SMALL(IF('بينات التلاميد'!$B$5:$B$56<>\"\",ROW('بينات التلاميد'!$B$5:$B$56)-ROW($B$5)+1),ROWS($B$2:B1351))))","v":""}]
[null,{"$f":"IF(ROWS($B$2:B1352)>'بينات التلاميد'!$Q$5,\"\",INDEX('بينات التلاميد'!$B$5:$B$56,SMALL(IF('بينات التلاميد'!$B$5:$B$56<>\"\",ROW('بينات التلاميد'!$B$5:$B$56)-ROW($B$5)+1),ROWS($B$2:B1352))))","v":""}]
[null,{"$f":"IF(ROWS($B$2:B1353)>'بينات التلاميد'!$Q$5,\"\",INDEX('بينات التلاميد'!$B$5:$B$56,SMALL(IF('بينات التلاميد'!$B$5:$B$56<>\"\",ROW('بينات التلاميد'!$B$5:$B$56)-ROW($B$5)+1),ROWS($B$2:B1353))))","v":""}]
[null,{"$f":"IF(ROWS($B$2:B1354)>'بينات التلاميد'!$Q$5,\"\",INDEX('بينات التلاميد'!$B$5:$B$56,SMALL(IF('بينات التلاميد'!$B$5:$B$56<>\"\",ROW('بينات التلاميد'!$B$5:$B$56)-ROW($B$5)+1),ROWS($B$2:B1354))))","v":""}]
[null,{"$f":"IF(ROWS($B$2:B1355)>'بينات التلاميد'!$Q$5,\"\",INDEX('بينات التلاميد'!$B$5:$B$56,SMALL(IF('بينات التلاميد'!$B$5:$B$56<>\"\",ROW('بينات التلاميد'!$B$5:$B$56)-ROW($B$5)+1),ROWS($B$2:B1355))))","v":""}]
[null,{"$f":"IF(ROWS($B$2:B1356)>'بينات التلاميد'!$Q$5,\"\",INDEX('بينات التلاميد'!$B$5:$B$56,SMALL(IF('بينات التلاميد'!$B$5:$B$56<>\"\",ROW('بينات التلاميد'!$B$5:$B$56)-ROW($B$5)+1),ROWS($B$2:B1356))))","v":""}]
[null,{"$f":"IF(ROWS($B$2:B1357)>'بينات التلاميد'!$Q$5,\"\",INDEX('بينات التلاميد'!$B$5:$B$56,SMALL(IF('بينات التلاميد'!$B$5:$B$56<>\"\",ROW('بينات التلاميد'!$B$5:$B$56)-ROW($B$5)+1),ROWS($B$2:B1357))))","v":""}]
[null,{"$f":"IF(ROWS($B$2:B1358)>'بينات التلاميد'!$Q$5,\"\",INDEX('بينات التلاميد'!$B$5:$B$56,SMALL(IF('بينات التلاميد'!$B$5:$B$56<>\"\",ROW('بينات التلاميد'!$B$5:$B$56)-ROW($B$5)+1),ROWS($B$2:B1358))))","v":""}]
[null,{"$f":"IF(ROWS($B$2:B1359)>'بينات التلاميد'!$Q$5,\"\",INDEX('بينات التلاميد'!$B$5:$B$56,SMALL(IF('بينات التلاميد'!$B$5:$B$56<>\"\",ROW('بينات التلاميد'!$B$5:$B$56)-ROW($B$5)+1),ROWS($B$2:B1359))))","v":""}]
[null,{"$f":"IF(ROWS($B$2:B1360)>'بينات التلاميد'!$Q$5,\"\",INDEX('بينات التلاميد'!$B$5:$B$56,SMALL(IF('بينات التلاميد'!$B$5:$B$56<>\"\",ROW('بينات التلاميد'!$B$5:$B$56)-ROW($B$5)+1),ROWS($B$2:B1360))))","v":""}]
[null,{"$f":"IF(ROWS($B$2:B1361)>'بينات التلاميد'!$Q$5,\"\",INDEX('بينات التلاميد'!$B$5:$B$56,SMALL(IF('بينات التلاميد'!$B$5:$B$56<>\"\",ROW('بينات التلاميد'!$B$5:$B$56)-ROW($B$5)+1),ROWS($B$2:B1361))))","v":""}]
[null,{"$f":"IF(ROWS($B$2:B1362)>'بينات التلاميد'!$Q$5,\"\",INDEX('بينات التلاميد'!$B$5:$B$56,SMALL(IF('بينات التلاميد'!$B$5:$B$56<>\"\",ROW('بينات التلاميد'!$B$5:$B$56)-ROW($B$5)+1),ROWS($B$2:B1362))))","v":""}]
[null,{"$f":"IF(ROWS($B$2:B1363)>'بينات التلاميد'!$Q$5,\"\",INDEX('بينات التلاميد'!$B$5:$B$56,SMALL(IF('بينات التلاميد'!$B$5:$B$56<>\"\",ROW('بينات التلاميد'!$B$5:$B$56)-ROW($B$5)+1),ROWS($B$2:B1363))))","v":""}]
[null,{"$f":"IF(ROWS($B$2:B1364)>'بينات التلاميد'!$Q$5,\"\",INDEX('بينات التلاميد'!$B$5:$B$56,SMALL(IF('بينات التلاميد'!$B$5:$B$56<>\"\",ROW('بينات التلاميد'!$B$5:$B$56)-ROW($B$5)+1),ROWS($B$2:B1364))))","v":""}]
[null,{"$f":"IF(ROWS($B$2:B1365)>'بينات التلاميد'!$Q$5,\"\",INDEX('بينات التلاميد'!$B$5:$B$56,SMALL(IF('بينات التلاميد'!$B$5:$B$56<>\"\",ROW('بينات التلاميد'!$B$5:$B$56)-ROW($B$5)+1),ROWS($B$2:B1365))))","v":""}]
[null,{"$f":"IF(ROWS($B$2:B1366)>'بينات التلاميد'!$Q$5,\"\",INDEX('بينات التلاميد'!$B$5:$B$56,SMALL(IF('بينات التلاميد'!$B$5:$B$56<>\"\",ROW('بينات التلاميد'!$B$5:$B$56)-ROW($B$5)+1),ROWS($B$2:B1366))))","v":""}]
[null,{"$f":"IF(ROWS($B$2:B1367)>'بينات التلاميد'!$Q$5,\"\",INDEX('بينات التلاميد'!$B$5:$B$56,SMALL(IF('بينات التلاميد'!$B$5:$B$56<>\"\",ROW('بينات التلاميد'!$B$5:$B$56)-ROW($B$5)+1),ROWS($B$2:B1367))))","v":""}]
[null,{"$f":"IF(ROWS($B$2:B1368)>'بينات التلاميد'!$Q$5,\"\",INDEX('بينات التلاميد'!$B$5:$B$56,SMALL(IF('بينات التلاميد'!$B$5:$B$56<>\"\",ROW('بينات التلاميد'!$B$5:$B$56)-ROW($B$5)+1),ROWS($B$2:B1368))))","v":""}]
[null,{"$f":"IF(ROWS($B$2:B1369)>'بينات التلاميد'!$Q$5,\"\",INDEX('بينات التلاميد'!$B$5:$B$56,SMALL(IF('بينات التلاميد'!$B$5:$B$56<>\"\",ROW('بينات التلاميد'!$B$5:$B$56)-ROW($B$5)+1),ROWS($B$2:B1369))))","v":""}]
[null,{"$f":"IF(ROWS($B$2:B1370)>'بينات التلاميد'!$Q$5,\"\",INDEX('بينات التلاميد'!$B$5:$B$56,SMALL(IF('بينات التلاميد'!$B$5:$B$56<>\"\",ROW('بينات التلاميد'!$B$5:$B$56)-ROW($B$5)+1),ROWS($B$2:B1370))))","v":""}]
[null,{"$f":"IF(ROWS($B$2:B1371)>'بينات التلاميد'!$Q$5,\"\",INDEX('بينات التلاميد'!$B$5:$B$56,SMALL(IF('بينات التلاميد'!$B$5:$B$56<>\"\",ROW('بينات التلاميد'!$B$5:$B$56)-ROW($B$5)+1),ROWS($B$2:B1371))))","v":""}]
[null,{"$f":"IF(ROWS($B$2:B1372)>'بينات التلاميد'!$Q$5,\"\",INDEX('بينات التلاميد'!$B$5:$B$56,SMALL(IF('بينات التلاميد'!$B$5:$B$56<>\"\",ROW('بينات التلاميد'!$B$5:$B$56)-ROW($B$5)+1),ROWS($B$2:B1372))))","v":""}]
[null,{"$f":"IF(ROWS($B$2:B1373)>'بينات التلاميد'!$Q$5,\"\",INDEX('بينات التلاميد'!$B$5:$B$56,SMALL(IF('بينات التلاميد'!$B$5:$B$56<>\"\",ROW('بينات التلاميد'!$B$5:$B$56)-ROW($B$5)+1),ROWS($B$2:B1373))))","v":""}]
[null,{"$f":"IF(ROWS($B$2:B1374)>'بينات التلاميد'!$Q$5,\"\",INDEX('بينات التلاميد'!$B$5:$B$56,SMALL(IF('بينات التلاميد'!$B$5:$B$56<>\"\",ROW('بينات التلاميد'!$B$5:$B$56)-ROW($B$5)+1),ROWS($B$2:B1374))))","v":""}]
[null,{"$f":"IF(ROWS($B$2:B1375)>'بينات التلاميد'!$Q$5,\"\",INDEX('بينات التلاميد'!$B$5:$B$56,SMALL(IF('بينات التلاميد'!$B$5:$B$56<>\"\",ROW('بينات التلاميد'!$B$5:$B$56)-ROW($B$5)+1),ROWS($B$2:B1375))))","v":""}]
[null,{"$f":"IF(ROWS($B$2:B1376)>'بينات التلاميد'!$Q$5,\"\",INDEX('بينات التلاميد'!$B$5:$B$56,SMALL(IF('بينات التلاميد'!$B$5:$B$56<>\"\",ROW('بينات التلاميد'!$B$5:$B$56)-ROW($B$5)+1),ROWS($B$2:B1376))))","v":""}]

{"sheet":"التقرير اليومي","index":2,"n_rows":152,"n_cols":21,"rows_kept":152,"cut":false,"hidden":false,"merged":[[105,4,105,11],[102,2,102,3],[102,11,102,12],[90,10,90,13],[19,2,20,3],[19,5,20,7],[19,9,19,12],[1,12,2,12],[1,6,2,11],[2,1,2,5],[4,12,4,13],[4,4,4,9],[11,4,11,9],[5,12,6,13],[12,9,12,13],[3,6,3,8],[1,1,1,5],[7,1,7,2],[3,9,3,11],[3,12,3,13],[5,1,6,2],[5,3,5,5],[5,6,5,8],[5,11,6,11],[5,9,6,9],[5,10,6,10],[8,1,8,2],[9,1,9,2],[10,1,10,2],[20,9,20,10],[20,11,20,12],[14,1,14,2],[15,1,15,2],[12,1,13,2],[12,3,12,5],[12,6,12,8],[17,9,17,11],[16,1,16,2],[17,1,17,2],[19,1,20,1],[13,9,16,13],[52,10,52,11],[22,5,22,7],[51,12,51,13],[51,10,51,11],[51,2,51,3],[58,8,58,13],[52,2,52,3],[53,2,53,3],[54,2,54,3],[52,4,52,6],[53,4,53,6],[54,4,54,6],[52,7,52,9],[53,7,53,9],[54,7,54,9],[52,12,52,13],[53,12,53,13],[54,12,54,13],[53,10,53,11],[54,10,54,11],[56,4,56,5],[56,6,56,7],[56,8,56,13],[21,2,21,3],[21,5,21,7],[21,9,21,10],[21,11,21,12],[23,2,23,3],[23,5,23,7],[23,9,23,10],[23,11,23,12],[51,4,51,6],[51,7,51,9],[65,10,65,13],[66,10,66,13],[67,10,67,13],[62,10,62,13],[63,10,63,13],[64,10,64,13],[57,4,57,5],[57,6,57,7],[57,8,57,13],[58,4,58,5],[58,6,58,7],[60,10,60,11],[60,1,60,9],[69,4,69,5],[70,4,70,5],[68,7,68,8],[69,7,69,8],[70,7,70,8],[68,10,68,13],[69,10,69,13],[70,10,70,13],[67,7,67,8],[77,7,77,8],[78,7,78,8],[79,7,79,8],[80,7,80,8],[81,7,81,8],[71,4,71,5],[72,4,72,5],[71,7,71,8],[72,7,72,8],[73,7,73,8],[73,4,73,5],[74,4,74,5],[75,4,75,5],[76,4,76,5],[77,4,77,5],[78,4,78,5],[79,4,79,5],[80,4,80,5],[81,4,81,5],[72,10,72,13],[73,10,73,13],[74,10,74,13],[75,10,75,13],[76,10,76,13],[74,7,74,8],[75,7,75,8],[76,7,76,8],[61,4,61,5],[62,4,62,5],[63,4,63,5],[64,4,64,5],[65,4,65,5],[66,4,66,5],[67,4,67,5],[68,4,68,5],[61,7,61,8],[61,10,61,13],[62,7,62,8],[63,7,63,8],[64,7,64,8],[65,7,65,8],[66,7,66,8],[71,10,71,13],[90,4,90,5],[90,7,90,8],[91,4,91,5],[91,7,91,8],[82,4,82,5],[82,7,82,8],[83,4,83,5],[83,7,83,8],[84,4,84,5],[84,7,84,8],[85,4,85,5],[85,7,85,8],[86,4,86,5],[86,7,86,8],[89,4,89,5],[89,7,89,8],[99,10,101,13],[95,10,95,11],[101,4,101,5],[101,7,101,8],[93,4,93,5],[93,7,93,8],[97,4,97,5],[97,7,97,8],[98,4,98,5],[98,7,98,8],[99,4,99,5],[99,7,99,8],[94,4,94,5],[94,7,94,8],[95,4,95,5],[95,7,95,8],[96,4,96,5],[96,7,96,8],[100,4,100,5],[100,7,100,8],[98,10,98,13],[60,18,60,20],[92,4,92,5],[92,7,92,8],[87,10,87,13],[89,10,89,13],[91,10,91,13],[92,10,92,13],[93,10,93,13],[94,10,94,13],[87,4,87,5],[87,7,87,8],[88,4,88,5],[88,7,88,8],[88,10,88,13],[81,10,81,13],[77,10,77,13],[78,10,78,13],[79,10,79,13],[80,10,80,13],[82,10,82,13],[83,10,83,13],[84,10,84,13],[85,10,85,13],[86,10,86,13]]}
[null,"الجمهورية الجزائرية الديمقراطية الشعبية ",null,null,null,null,null,null,null,null,null,null,null,null,null,null,null,"مكان الحغظ","اسم الملف"]
[null,"وزارة التربية الوطنية ",null,null,null,null,"التقرير اليومي للاستشارة  ",null,null,null,null,null,124,null,null,null,null,"D:\\Sep","dim01"]
[null,"مديرية التربية لولاية تلمسان "]
[null,null,null,null,null,null,"الخميــس",null,null,"2017-10-05",null,null,"ثانوية الخوارزمي"]
[null,-1,"مواظبة التلاميذ : ",null,"الغيـــــــاب عن الدروس",null,null,null,null,null,null,null,"مغنية "]
[null,"التعـداد",null,"التسجيلات",null,null,"الغائبـون",null,null,"ح س اليومي","ح س الكلي","عدد س الغياب","نسبة غياب التلاميذ"]
[null,null,null,"ذكور","إناث","المجموع","ذكور","إناث","المجموع"]
[null,"السنة الأولى ثانوي",null,112,121,{"$f":"SUM(D8:E8)","v":233},{"$f":"COUNTIF(P63:P94,1)","v":0},{"$f":"COUNTIF(P63:P94,2)","v":0},{"$f":"SUM(G8:H8)","v":0},52,{"$f":"J8*F8","v":12116},26,{"$f":"(L8/K8)*100","v":0.21459227467811159},"%"]
[null,"السنة الثانية ثانوي",null,39,86,{"$f":"SUM(D9:E9)","v":125},{"$f":"COUNTIF(Q63:Q94,1)","v":0},{"$f":"COUNTIF(Q63:Q94,2)","v":0},{"$f":"SUM(G9:H9)","v":0},40,{"$f":"J9*F9","v":5000},38,{"$f":"(L9/K9)*100","v":0.76},"%"]
[null,"السنة الثالثة ثانوي",null,71,104,{"$f":"SUM(D10:E10)","v":175},{"$f":"COUNTIF(S63:S115,1)","v":0},{"$f":"COUNTIF(R63:R117,2)","v":0},{"$f":"SUM(G10:H10)","v":0},46,{"$f":"J10*F10","v":8050},107,{"$f":"(L10/K10)*100","v":1.329192546583851},"%"]
[null,"المجموع",null,{"$f":"SUM(D8:D10)","v":222},{"$f":"SUM(E8:E10)","v":311},{"$f":"SUM(D11:E11)","v":533},{"$f":"SUM(G8:G10)","v":0},{"$f":"SUM(H8:H10)","v":0},{"$f":"SUM(G11:H11)","v":0},{"$f":"SUM(J8:J10)","v":138},{"$f":"SUM(K8:K10)","v":25166},{"$f":"L8+L9+L10","v":171},{"$f":"(L11/K11)*100","v":0.67948819836287055},"%"]
[null,null,null,null,"الغيـــــــاب في النظـام  النصف داخلي "]
[null,"التعـداد",null,"المسجلون",null,null,"الغائبـون",null,null,"ملاحظـــــــــات "]
[null,null,null,"ذكور","إناث","المجموع","ذكور","إناث","المجموع"]
[null,"السنة الأولى ثانوي",null,85,95,{"$f":"SUM(D15:E15)","v":180},3,1,{"$f":"SUM(G15:H15)","v":4}]
[null,"السنة الثانية ثانوي",null,28,66,{"$f":"SUM(D16:E16)","v":94},3,1,{"$f":"SUM(G16:H16)","v":4}]
[null,"السنة الثالثة ثانوي",null,53,71,{"$f":"SUM(D17:E17)","v":124},2,4,{"$f":"SUM(G17:H17)","v":6}]
[null,"المجموع",null,{"$f":"SUM(D15:D17)","v":166},{"$f":"SUM(E15:E17)","v":232},{"$f":"SUM(D18:E18)","v":398},{"$f":"SUM(G15:G17)","v":8},{"$f":"SUM(H15:H17)","v":6},{"$f":"SUM(G18:H18)","v":14},"نسبة غياب التلاميذ",null,null,{"$f":"(I18/F18)*100","v":3.5175879396984926},"%"]
[null,-2,"حــــركة   التلاميـــــذ"]
[null,"الرقم","الدخـــــــــــول",null,"رقم ","الخـــــــــــــــــــــروج",null,null,"رقم","تغييـــــــــــــــــر الصـــــفة",null,null,null,"رقم ",null,null,null,56]
[null,null,null,null,"البطاقة",null,null,null,"البطاقة","ن د ــــــ  خ",null,"خ ـــــــ ن د",null,"البطاقة"]
[null,1,null,null,null,null,null,null,null,null,null,null,null,null,null,null,null,{"$f":"SUM(R6:R21)","v":56}]
[null,2]
[null,3]
[null,-3,"مواظبـــة الأساتذة :"]
[null,"الرقم","اللقب و الإسم ","المادة","08ـ09","09ـ10","10ـ11","11ـ12","14½-13½","15½-14½","16½-15½","17½-16½","سبب الغياب","ملاحظات "]
[1,1,{"$f":"VLOOKUP(A27,tem,2,0)","v":"أ.ناسي"},{"$f":"VLOOKUP(A27,tem,3,0)","v":"أ.الرياضيات"},{"$f":"VLOOKUP(A27,tem,4,0)","v":0},{"$f":"VLOOKUP(A27,tem,5,0)","v":0},{"$f":"VLOOKUP(A27,tem,6,0)","v":"3ت ر"},{"$f":"VLOOKUP(A27,tem,7,0)","v":0},{"$f":"VLOOKUP(A27,tem,8,0)","v":0},{"$f":"VLOOKUP(A27,tem,9,0)","v":0},{"$f":"VLOOKUP(A27,tem,10,0)","v":0},{"$f":"VLOOKUP(A27,tem,11,0)","v":"1ع1"}]
[3,1,"أ.بوعريشة ","أ.الرياضيات",0,0,0,0,0,0,0,0]
[null,1,{"$error":"#N/A"},{"$error":"#N/A"},{"$error":"#N/A"},{"$error":"#N/A"},{"$error":"#N/A"},{"$error":"#N/A"},{"$error":"#N/A"},{"$error":"#N/A"},{"$error":"#N/A"},{"$error":"#N/A"}]
[44,1,"أ.تربش","أ.الرياضة",0,0,0,0,0,0,0,0]
[null,1,{"$error":"#N/A"},{"$error":"#N/A"},{"$error":"#N/A"},{"$error":"#N/A"},{"$error":"#N/A"},{"$error":"#N/A"},{"$error":"#N/A"},{"$error":"#N/A"},{"$error":"#N/A"},{"$error":"#N/A"}]
[5,1,"أ.ديب","أ.الرياضيات",0,0,0,0,0,0,0,0]
[null,1,{"$error":"#N/A"},{"$error":"#N/A"},{"$error":"#N/A"},{"$error":"#N/A"},{"$error":"#N/A"},{"$error":"#N/A"},{"$error":"#N/A"},{"$error":"#N/A"},{"$error":"#N/A"},{"$error":"#N/A"}]
[null,1,{"$error":"#N/A"},{"$error":"#N/A"},{"$error":"#N/A"},{"$error":"#N/A"},{"$error":"#N/A"},{"$error":"#N/A"},{"$error":"#N/A"},{"$error":"#N/A"},{"$error":"#N/A"},{"$error":"#N/A"}]
[null,1,{"$error":"#N/A"},{"$error":"#N/A"},{"$error":"#N/A"},{"$error":"#N/A"},{"$error":"#N/A"},{"$error":"#N/A"},{"$error":"#N/A"},{"$error":"#N/A"},{"$error":"#N/A"},{"$error":"#N/A"}]
[null,1,{"$error":"#N/A"},{"$error":"#N/A"},{"$error":"#N/A"},{"$error":"#N/A"},{"$error":"#N/A"},{"$error":"#N/A"},{"$error":"#N/A"},{"$error":"#N/A"},{"$error":"#N/A"},{"$error":"#N/A"}]
[null,1,{"$error":"#N/A"},{"$error":"#N/A"},{"$error":"#N/A"},{"$error":"#N/A"},{"$error":"#N/A"},{"$error":"#N/A"},{"$error":"#N/A"},{"$error":"#N/A"},{"$error":"#N/A"},{"$error":"#N/A"}]
[null,1,{"$error":"#N/A"},{"$error":"#N/A"},{"$error":"#N/A"},{"$error":"#N/A"},{"$error":"#N/A"},{"$error":"#N/A"},{"$error":"#N/A"},{"$error":"#N/A"},{"$error":"#N/A"},{"$error":"#N/A"}]
[null,1,{"$error":"#N/A"},{"$error":"#N/A"},{"$error":"#N/A"},{"$error":"#N/A"},{"$error":"#N/A"},{"$error":"#N/A"},{"$error":"#N/A"},{"$error":"#N/A"},{"$error":"#N/A"},{"$error":"#N/A"}]
[null,1,{"$error":"#N/A"},{"$error":"#N/A"},{"$error":"#N/A"},{"$error":"#N/A"},{"$error":"#N/A"},{"$error":"#N/A"},{"$error":"#N/A"},{"$error":"#N/A"},{"$error":"#N/A"},{"$error":"#N/A"}]
[null,1,{"$error":"#N/A"},{"$error":"#N/A"},{"$error":"#N/A"},{"$error":"#N/A"},{"$error":"#N/A"},{"$error":"#N/A"},{"$error":"#N/A"},{"$error":"#N/A"},{"$error":"#N/A"},{"$error":"#N/A"}]
[null,1,{"$error":"#N/A"},{"$error":"#N/A"},{"$error":"#N/A"},{"$error":"#N/A"},{"$error":"#N/A"},{"$error":"#N/A"},{"$error":"#N/A"},{"$error":"#N/A"},{"$error":"#N/A"},{"$error":"#N/A"}]
[null,1,{"$error":"#N/A"},{"$error":"#N/A"},{"$error":"#N/A"},{"$error":"#N/A"},{"$error":"#N/A"},{"$error":"#N/A"},{"$error":"#N/A"},{"$error":"#N/A"},{"$error":"#N/A"},{"$error":"#N/A"}]
[null,1,{"$error":"#N/A"},{"$error":"#N/A"},{"$error":"#N/A"},{"$error":"#N/A"},{"$error":"#N/A"},{"$error":"#N/A"},{"$error":"#N/A"},{"$error":"#N/A"},{"$error":"#N/A"},{"$error":"#N/A"}]
[null,1,{"$error":"#N/A"},{"$error":"#N/A"},{"$error":"#N/A"},{"$error":"#N/A"},{"$error":"#N/A"},{"$error":"#N/A"},{"$error":"#N/A"},{"$error":"#N/A"},{"$error":"#N/A"},{"$error":"#N/A"}]
[null,1,{"$error":"#N/A"},{"$error":"#N/A"},{"$error":"#N/A"},{"$error":"#N/A"},{"$error":"#N/A"},{"$error":"#N/A"},{"$error":"#N/A"},{"$error":"#N/A"},{"$error":"#N/A"},{"$error":"#N/A"}]
[null,1,{"$error":"#N/A"},{"$error":"#N/A"},{"$error":"#N/A"},{"$error":"#N/A"},{"$error":"#N/A"},{"$error":"#N/A"},{"$error":"#N/A"},{"$error":"#N/A"},{"$error":"#N/A"},{"$error":"#N/A"}]
[null,1,{"$error":"#N/A"},{"$error":"#N/A"},{"$error":"#N/A"},{"$error":"#N/A"},{"$error":"#N/A"},{"$error":"#N/A"},{"$error":"#N/A"},{"$error":"#N/A"},{"$error":"#N/A"},{"$error":"#N/A"}]
[null,1,{"$error":"#N/A"},{"$error":"#N/A"},{"$error":"#N/A"},{"$error":"#N/A"},{"$error":"#N/A"},{"$error":"#N/A"},{"$error":"#N/A"},{"$error":"#N/A"},{"$error":"#N/A"},{"$error":"#N/A"}]
[null,1,{"$error":"#N/A"},{"$error":"#N/A"},{"$error":"#N/A"},{"$error":"#N/A"},{"$error":"#N/A"},{"$error":"#N/A"},{"$error":"#N/A"},{"$error":"#N/A"},{"$error":"#N/A"},{"$error":"#N/A"}]
[null,-4,"غيابات و تأخرات مساعدي التربية  و موطفي عقود  ما قبل التشغيل "]
[null,"الرقم","اللقب و الإسم ",null,"الفترة الصباحية ",null,null,"الفترة المسائية ",null,null,"ملاحظات ",null,"سبب الغياب"]
[null,1]
[null,2]
[null,3]
[null,-5,"تعويــض الدروس الضـــــائعــة "]
[null,"الرقم","اللقب و الإسم ","المادة","القسم",null,"التوقيت",null,"ملاحظـــــــــــــــــات"]
[null,1]
[null,2]
[]
[null,"الغيــــــــابات اليومية",null,null,null,null,null,null,null,null,null,null,{"$f":"G4","v":"الخميــس"},{"$f":"J4","v":"2017-10-05"},null,null,null,null,"الجنس"]
[null,"الرقم","السنة الأول","القسم","السنة الثانية ",null,"القسم","السنة الثالثة ",null,"القسم","قضايا سلــوكية ",null,null,null,null,null,null,null,"س1","س2","س3"]
[null,1,null,null,null,null,null,"سعاد2",null,"3ع ت01",null,null,null,null,{"$f":"IFERROR(VLOOKUP(D63,'أسماء التلاميذ'!$D$2:$E$20,2,0),\"\")","v":""},{"$f":"IFERROR(VLOOKUP(G63,'أسماء التلاميذ'!$D$2:$E$20,2,0),\"\")","v":""},{"$f":"IFERROR(VLOOKUP(J63,'أسماء التلاميذ'!$D$2:$E$20,2,0),\"\")","v":"Classe2"},null,null,null,"أ"]
[null,2,null,null,null,null,null,"أحمد3",null,"3ت ر",null,null,null,null,{"$f":"IFERROR(VLOOKUP(D64,'أسماء التلاميذ'!$D$2:$E$20,2,0),\"\")","v":""},{"$f":"IFERROR(VLOOKUP(G64,'أسماء التلاميذ'!$D$2:$E$20,2,0),\"\")","v":""},{"$f":"IFERROR(VLOOKUP(J64,'أسماء التلاميذ'!$D$2:$E$20,2,0),\"\")","v":"Classe1"},null,null,null,"أ"]
[null,3,null,null,null,null,null,"أحمد7",null,"3ت ر",null,null,null,null,{"$f":"IFERROR(VLOOKUP(D65,'أسماء التلاميذ'!$D$2:$E$20,2,0),\"\")","v":""},{"$f":"IFERROR(VLOOKUP(G65,'أسماء التلاميذ'!$D$2:$E$20,2,0),\"\")","v":""},{"$f":"IFERROR(VLOOKUP(J65,'أسماء التلاميذ'!$D$2:$E$20,2,0),\"\")","v":"Classe1"},null,null,null,"أ"]
[null,4,null,null,null,null,null,"أحمد3",null,"3ت ر",null,null,null,null,{"$f":"IFERROR(VLOOKUP(D66,'أسماء التلاميذ'!$D$2:$E$20,2,0),\"\")","v":""},{"$f":"IFERROR(VLOOKUP(G66,'أسماء التلاميذ'!$D$2:$E$20,2,0),\"\")","v":""},{"$f":"IFERROR(VLOOKUP(J66,'أسماء التلاميذ'!$D$2:$E$20,2,0),\"\")","v":"Classe1"}]
[null,5,null,null,null,null,null,null,null,null,null,null,null,null,{"$f":"IFERROR(VLOOKUP(D67,'أسماء التلاميذ'!$D$2:$E$20,2,0),\"\")","v":""},{"$f":"IFERROR(VLOOKUP(G67,'أسماء التلاميذ'!$D$2:$E$20,2,0),\"\")","v":""},{"$f":"IFERROR(VLOOKUP(J67,'أسماء التلاميذ'!$D$2:$E$20,2,0),\"\")","v":""}]
[null,6,null,null,null,null,null,null,null,null,null,null,null,null,{"$f":"IFERROR(VLOOKUP(D68,'أسماء التلاميذ'!$D$2:$E$20,2,0),\"\")","v":""},{"$f":"IFERROR(VLOOKUP(G68,'أسماء التلاميذ'!$D$2:$E$20,2,0),\"\")","v":""},{"$f":"IFERROR(VLOOKUP(J68,'أسماء التلاميذ'!$D$2:$E$20,2,0),\"\")","v":""}]
[null,7,null,null,null,null,null,null,null,null,null,null,null,null,{"$f":"IFERROR(VLOOKUP(D69,'أسماء التلاميذ'!$D$2:$E$20,2,0),\"\")","v":""},{"$f":"IFERROR(VLOOKUP(G69,'أسماء التلاميذ'!$D$2:$E$20,2,0),\"\")","v":""},{"$f":"IFERROR(VLOOKUP(J69,'أسماء التلاميذ'!$D$2:$E$20,2,0),\"\")","v":""}]
[null,8,null,null,null,null,null,null,null,null,"الحوادث المدرسية :",null,null,null,{"$f":"IFERROR(VLOOKUP(D70,'أسماء التلاميذ'!$D$2:$E$20,2,0),\"\")","v":""},{"$f":"IFERROR(VLOOKUP(G70,'أسماء التلاميذ'!$D$2:$E$20,2,0),\"\")","v":""},{"$f":"IFERROR(VLOOKUP(J70,'أسماء التلاميذ'!$D$2:$E$20,2,0),\"\")","v":""}]
[null,9,null,null,null,null,null,null,null,null,null,null,null,null,{"$f":"IFERROR(VLOOKUP(D71,'أسماء التلاميذ'!$D$2:$E$20,2,0),\"\")","v":""},{"$f":"IFERROR(VLOOKUP(G71,'أسماء التلاميذ'!$D$2:$E$20,2,0),\"\")","v":""},{"$f":"IFERROR(VLOOKUP(J71,'أسماء التلاميذ'!$D$2:$E$20,2,0),\"\")","v":""}]
[null,10,null,null,null,null,null,null,null,null,null,null,null,null,{"$f":"IFERROR(VLOOKUP(D72,'أسماء التلاميذ'!$D$2:$E$20,2,0),\"\")","v":""},{"$f":"IFERROR(VLOOKUP(G72,'أسماء التلاميذ'!$D$2:$E$20,2,0),\"\")","v":""},{"$f":"IFERROR(VLOOKUP(J72,'أسماء التلاميذ'!$D$2:$E$20,2,0),\"\")","v":""}]
[null,11,null,null,null,null,null,null,null,null,null,null,null,null,{"$f":"IFERROR(VLOOKUP(D73,'أسماء التلاميذ'!$D$2:$E$20,2,0),\"\")","v":""},{"$f":"IFERROR(VLOOKUP(G73,'أسماء التلاميذ'!$D$2:$E$20,2,0),\"\")","v":""},{"$f":"IFERROR(VLOOKUP(J73,'أسماء التلاميذ'!$D$2:$E$20,2,0),\"\")","v":""}]
[null,12,null,null,null,null,null,null,null,null,"الصحة المدرسية :",null,null,null,{"$f":"IFERROR(VLOOKUP(D74,'أسماء التلاميذ'!$D$2:$E$20,2,0),\"\")","v":""},{"$f":"IFERROR(VLOOKUP(G74,'أسماء التلاميذ'!$D$2:$E$20,2,0),\"\")","v":""},{"$f":"IFERROR(VLOOKUP(J74,'أسماء التلاميذ'!$D$2:$E$20,2,0),\"\")","v":""}]
[null,13,null,null,null,null,null,null,null,null,null,null,null,null,{"$f":"IFERROR(VLOOKUP(D75,'أسماء التلاميذ'!$D$2:$E$20,2,0),\"\")","v":""},{"$f":"IFERROR(VLOOKUP(G75,'أسماء التلاميذ'!$D$2:$E$20,2,0),\"\")","v":""},{"$f":"IFERROR(VLOOKUP(J75,'أسماء التلاميذ'!$D$2:$E$20,2,0),\"\")","v":""}]
[null,14,null,null,null,null,null,null,null,null,null,null,null,null,{"$f":"IFERROR(VLOOKUP(D76,'أسماء التلاميذ'!$D$2:$E$20,2,0),\"\")","v":""},{"$f":"IFERROR(VLOOKUP(G76,'أسماء التلاميذ'!$D$2:$E$20,2,0),\"\")","v":""},{"$f":"IFERROR(VLOOKUP(J76,'أسماء التلاميذ'!$D$2:$E$20,2,0),\"\")","v":""}]
[null,15,null,null,null,null,null,null,null,null,null,null,null,null,{"$f":"IFERROR(VLOOKUP(D77,'أسماء التلاميذ'!$D$2:$E$20,2,0),\"\")","v":""},{"$f":"IFERROR(VLOOKUP(G77,'أسماء التلاميذ'!$D$2:$E$20,2,0),\"\")","v":""},{"$f":"IFERROR(VLOOKUP(J77,'أسماء التلاميذ'!$D$2:$E$20,2,0),\"\")","v":""}]
[null,16,null,null,null,null,null,null,null,null,null,null,null,null,{"$f":"IFERROR(VLOOKUP(D78,'أسماء التلاميذ'!$D$2:$E$20,2,0),\"\")","v":""},{"$f":"IFERROR(VLOOKUP(G78,'أسماء التلاميذ'!$D$2:$E$20,2,0),\"\")","v":""},{"$f":"IFERROR(VLOOKUP(J78,'أسماء التلاميذ'!$D$2:$E$20,2,0),\"\")","v":""}]
[null,17,null,null,null,null,null,null,null,null,null,null,null,null,{"$f":"IFERROR(VLOOKUP(D79,'أسماء التلاميذ'!$D$2:$E$20,2,0),\"\")","v":""},{"$f":"IFERROR(VLOOKUP(G79,'أسماء التلاميذ'!$D$2:$E$20,2,0),\"\")","v":""},{"$f":"IFERROR(VLOOKUP(J79,'أسماء التلاميذ'!$D$2:$E$20,2,0),\"\")","v":""}]
[null,18,null,null,null,null,null,null,null,null,null,null,null,null,{"$f":"IFERROR(VLOOKUP(D80,'أسماء التلاميذ'!$D$2:$E$20,2,0),\"\")","v":""},{"$f":"IFERROR(VLOOKUP(G80,'أسماء التلاميذ'!$D$2:$E$20,2,0),\"\")","v":""},{"$f":"IFERROR(VLOOKUP(J80,'أسماء التلاميذ'!$D$2:$E$20,2,0),\"\")","v":""}]
[null,19,null,null,null,null,null,null,null,null,null,null,null,null,{"$f":"IFERROR(VLOOKUP(D81,'أسماء التلاميذ'!$D$2:$E$20,2,0),\"\")","v":""},{"$f":"IFERROR(VLOOKUP(G81,'أسماء التلاميذ'!$D$2:$E$20,2,0),\"\")","v":""},{"$f":"IFERROR(VLOOKUP(J81,'أسماء التلاميذ'!$D$2:$E$20,2,0),\"\")","v":""}]
[null,20,null,null,null,null,null,null,null,null,"ملاحظات مختلفة : ",null,null,null,{"$f":"IFERROR(VLOOKUP(D82,'أسماء التلاميذ'!$D$2:$E$20,2,0),\"\")","v":""},{"$f":"IFERROR(VLOOKUP(G82,'أسماء التلاميذ'!$D$2:$E$20,2,0),\"\")","v":""},{"$f":"IFERROR(VLOOKUP(J82,'أسماء التلاميذ'!$D$2:$E$20,2,0),\"\")","v":""}]
[null,21,null,null,null,null,null,null,null,null,null,null,null,null,{"$f":"IFERROR(VLOOKUP(D83,'أسماء التلاميذ'!$D$2:$E$20,2,0),\"\")","v":""},{"$f":"IFERROR(VLOOKUP(G83,'أسماء التلاميذ'!$D$2:$E$20,2,0),\"\")","v":""},{"$f":"IFERROR(VLOOKUP(J83,'أسماء التلاميذ'!$D$2:$E$20,2,0),\"\")","v":""}]
[null,22,null,null,null,null,null,null,null,null,null,null,null,null,{"$f":"IFERROR(VLOOKUP(D84,'أسماء التلاميذ'!$D$2:$E$20,2,0),\"\")","v":""},{"$f":"IFERROR(VLOOKUP(G84,'أسماء التلاميذ'!$D$2:$E$20,2,0),\"\")","v":""},{"$f":"IFERROR(VLOOKUP(J84,'أسماء التلاميذ'!$D$2:$E$20,2,0),\"\")","v":""}]
[null,23,null,null,null,null,null,null,null,null,null,null,null,null,{"$f":"IFERROR(VLOOKUP(D85,'أسماء التلاميذ'!$D$2:$E$20,2,0),\"\")","v":""},{"$f":"IFERROR(VLOOKUP(G85,'أسماء التلاميذ'!$D$2:$E$20,2,0),\"\")","v":""},{"$f":"IFERROR(VLOOKUP(J85,'أسماء التلاميذ'!$D$2:$E$20,2,0),\"\")","v":""}]
[null,24,null,null,null,null,null,null,null,null,null,null,null,null,{"$f":"IFERROR(VLOOKUP(D86,'أسماء التلاميذ'!$D$2:$E$20,2,0),\"\")","v":""},{"$f":"IFERROR(VLOOKUP(G86,'أسماء التلاميذ'!$D$2:$E$20,2,0),\"\")","v":""},{"$f":"IFERROR(VLOOKUP(J86,'أسماء التلاميذ'!$D$2:$E$20,2,0),\"\")","v":""}]
[null,25,null,null,null,null,null,null,null,null,null,null,null,null,{"$f":"IFERROR(VLOOKUP(D87,'أسماء التلاميذ'!$D$2:$E$20,2,0),\"\")","v":""},{"$f":"IFERROR(VLOOKUP(G87,'أسماء التلاميذ'!$D$2:$E$20,2,0),\"\")","v":""},{"$f":"IFERROR(VLOOKUP(J87,'أسماء التلاميذ'!$D$2:$E$20,2,0),\"\")","v":""}]
[null,26,null,null,null,null,null,null,null,null,null,null,null,null,{"$f":"IFERROR(VLOOKUP(D88,'أسماء التلاميذ'!$D$2:$E$20,2,0),\"\")","v":""},{"$f":"IFERROR(VLOOKUP(G88,'أسماء التلاميذ'!$D$2:$E$20,2,0),\"\")","v":""},{"$f":"IFERROR(VLOOKUP(J88,'أسماء التلاميذ'!$D$2:$E$20,2,0),\"\")","v":""}]
[null,27,null,null,null,null,null,null,null,null,"ندوات - مجالس - زيارات",null,null,null,{"$f":"IFERROR(VLOOKUP(D89,'أسماء التلاميذ'!$D$2:$E$20,2,0),\"\")","v":""},{"$f":"IFERROR(VLOOKUP(G89,'أسماء التلاميذ'!$D$2:$E$20,2,0),\"\")","v":""},{"$f":"IFERROR(VLOOKUP(J89,'أسماء التلاميذ'!$D$2:$E$20,2,0),\"\")","v":""}]
[null,28,null,null,null,null,null,null,null,null,null,null,null,null,{"$f":"IFERROR(VLOOKUP(D90,'أسماء التلاميذ'!$D$2:$E$20,2,0),\"\")","v":""},{"$f":"IFERROR(VLOOKUP(G90,'أسماء التلاميذ'!$D$2:$E$20,2,0),\"\")","v":""},{"$f":"IFERROR(VLOOKUP(J90,'أسماء التلاميذ'!$D$2:$E$20,2,0),\"\")","v":""}]
[null,29,null,null,null,null,null,null,null,null,null,null,null,null,{"$f":"IFERROR(VLOOKUP(D91,'أسماء التلاميذ'!$D$2:$E$20,2,0),\"\")","v":""},{"$f":"IFERROR(VLOOKUP(G91,'أسماء التلاميذ'!$D$2:$E$20,2,0),\"\")","v":""},{"$f":"IFERROR(VLOOKUP(J91,'أسماء التلاميذ'!$D$2:$E$20,2,0),\"\")","v":""}]
[null,30,null,null,null,null,null,null,null,null,null,null,null,null,{"$f":"IFERROR(VLOOKUP(D92,'أسماء التلاميذ'!$D$2:$E$20,2,0),\"\")","v":""},{"$f":"IFERROR(VLOOKUP(G92,'أسماء التلاميذ'!$D$2:$E$20,2,0),\"\")","v":""},{"$f":"IFERROR(VLOOKUP(J92,'أسماء التلاميذ'!$D$2:$E$20,2,0),\"\")","v":""}]
[null,31,null,null,null,null,null,null,null,null,null,null,null,null,{"$f":"IFERROR(VLOOKUP(D93,'أسماء التلاميذ'!$D$2:$E$20,2,0),\"\")","v":""},{"$f":"IFERROR(VLOOKUP(G93,'أسماء التلاميذ'!$D$2:$E$20,2,0),\"\")","v":""},{"$f":"IFERROR(VLOOKUP(J93,'أسماء التلاميذ'!$D$2:$E$20,2,0),\"\")","v":""}]
[null,32,null,null,null,null,null,null,null,null,null,null,null,null,{"$f":"IFERROR(VLOOKUP(D94,'أسماء التلاميذ'!$D$2:$E$20,2,0),\"\")","v":""},{"$f":"IFERROR(VLOOKUP(G94,'أسماء التلاميذ'!$D$2:$E$20,2,0),\"\")","v":""},{"$f":"IFERROR(VLOOKUP(J94,'أسماء التلاميذ'!$D$2:$E$20,2,0),\"\")","v":""}]
[null,33,null,null,null,null,null,null,null,null,null,null,null,null,{"$f":"IFERROR(VLOOKUP(D95,'أسماء التلاميذ'!$D$2:$E$20,2,0),\"\")","v":""},{"$f":"IFERROR(VLOOKUP(G95,'أسماء التلاميذ'!$D$2:$E$20,2,0),\"\")","v":""},{"$f":"IFERROR(VLOOKUP(J95,'أسماء التلاميذ'!$D$2:$E$20,2,0),\"\")","v":""}]
[null,34,null,null,null,null,null,null,null,null,"شهادة مدرسية",null,"العدد :",null,{"$f":"IFERROR(VLOOKUP(D96,'أسماء التلاميذ'!$D$2:$E$20,2,0),\"\")","v":""},{"$f":"IFERROR(VLOOKUP(G96,'أسماء التلاميذ'!$D$2:$E$20,2,0),\"\")","v":""},{"$f":"IFERROR(VLOOKUP(J96,'أسماء التلاميذ'!$D$2:$E$20,2,0),\"\")","v":""}]
[null,35,null,null,null,null,null,null,null,null,"من",null,"الــى ",null,{"$f":"IFERROR(VLOOKUP(D97,'أسماء التلاميذ'!$D$2:$E$20,2,0),\"\")","v":""},{"$f":"IFERROR(VLOOKUP(G97,'أسماء التلاميذ'!$D$2:$E$20,2,0),\"\")","v":""},{"$f":"IFERROR(VLOOKUP(J97,'أسماء التلاميذ'!$D$2:$E$20,2,0),\"\")","v":""}]
[null,36,null,null,null,null,null,null,null,null,null,null,null,null,{"$f":"IFERROR(VLOOKUP(D98,'أسماء التلاميذ'!$D$2:$E$20,2,0),\"\")","v":""},{"$f":"IFERROR(VLOOKUP(G98,'أسماء التلاميذ'!$D$2:$E$20,2,0),\"\")","v":""},{"$f":"IFERROR(VLOOKUP(J98,'أسماء التلاميذ'!$D$2:$E$20,2,0),\"\")","v":""}]
[null,37,null,null,null,null,null,null,null,null,"ملاحظات السيد الناظــر",null,null,null,{"$f":"IFERROR(VLOOKUP(D99,'أسماء التلاميذ'!$D$2:$E$20,2,0),\"\")","v":""},{"$f":"IFERROR(VLOOKUP(G99,'أسماء التلاميذ'!$D$2:$E$20,2,0),\"\")","v":""},{"$f":"IFERROR(VLOOKUP(J99,'أسماء التلاميذ'!$D$2:$E$20,2,0),\"\")","v":""}]
[null,38,null,null,null,null,null,null,null,null,null,null,null,null,{"$f":"IFERROR(VLOOKUP(D100,'أسماء التلاميذ'!$D$2:$E$20,2,0),\"\")","v":""},{"$f":"IFERROR(VLOOKUP(G100,'أسماء التلاميذ'!$D$2:$E$20,2,0),\"\")","v":""},{"$f":"IFERROR(VLOOKUP(J100,'أسماء التلاميذ'!$D$2:$E$20,2,0),\"\")","v":""}]
[null,39,null,null,null,null,null,null,null,null,null,null,null,null,{"$f":"IFERROR(VLOOKUP(D101,'أسماء التلاميذ'!$D$2:$E$20,2,0),\"\")","v":""},{"$f":"IFERROR(VLOOKUP(G101,'أسماء التلاميذ'!$D$2:$E$20,2,0),\"\")","v":""},{"$f":"IFERROR(VLOOKUP(J101,'أسماء التلاميذ'!$D$2:$E$20,2,0),\"\")","v":""}]
[null,40,null,null,null,null,null,null,null,null,null,null,null,null,{"$f":"IFERROR(VLOOKUP(D102,'أسماء التلاميذ'!$D$2:$E$20,2,0),\"\")","v":""},{"$f":"IFERROR(VLOOKUP(G102,'أسماء التلاميذ'!$D$2:$E$20,2,0),\"\")","v":""},{"$f":"IFERROR(VLOOKUP(J102,'أسماء التلاميذ'!$D$2:$E$20,2,0),\"\")","v":""}]
[null,null,"مستشار التربية",null,null,null,null,null,null,null,null,"الناظر"]
[]
[]
[null,null,null,null,"الثلاثاء"]
[null,null,null,null,"08ـ09","09ـ10","10ـ11","11ـ12","14½-13½","15½-14½","16½-15½","17½-16½"]
[null,1,"أ.ناسي","أ.الرياضيات",null,null,"3ت ر",null,null,null,null,"1ع1"]
[null,2,"أ.بوطوبة ","أ.الرياضيات"]
[null,3,"أ.بوعريشة ","أ.الرياضيات"]
[null,4,"أ.قبلي","أ.الرياضيات"]
[null,5,"أ.ديب","أ.الرياضيات"]
[null,6,"أ.عشماوي","أ.الفيزياء"]
[null,7,"أ.حاجب","أ.الفيزياء"]
[null,8,"قوراري","أ.الفيزياء"]
[null,9,"أ.ناضور","أ.الفيزياء"]
[null,10,"أ.زرار","أ.الفيزياء"]
[null,11,"أ.براهمي","أ.ع الطبيعية"]
[null,12,"أ.لعشب","أ.ع الطبيعية"]
[null,13,"أ.درني","أ.ع الطبيعية"]
[null,14,"أ.فراج","أ.ع الطبيعية"]
[null,15,"أ.كريب ","أ,الأدب العربي"]
[null,16,"أ.صبيان","أ,الأدب العربي"]
[null,17,"أ.قادري","أ,الأدب العربي"]
[null,18,"أ.أعطا الله","أ,الأدب العربي"]
[null,19,"أ.قعاد","أ,الأدب العربي"]
[null,20,"أ.قان ","أ.الاجتماعيات"]
[null,21,"أ.سواريت ","أ.الاجتماعيات"]
[null,22,"أ.صفراوي","أ.الاجتماعيات"]
[null,23,"أ.أجد","أ.الاجتماعيات"]
[null,24,"أ.بوحاجب/و","أ.ع الإسلامية"]
[null,25,"أ.بوزياني","أ.ع الإسلامية"]
[null,26,"أ.عزيز","أ.الفلسفة"]
[null,27,"أ.زقاي","أ.الفلسفة"]
[null,28,"أ.رابحي","أ.الفرنسية "]
[null,29,"أ.كوليلي","أ.الفرنسية "]
[null,30,"أ.بومانة ","أ.الفرنسية "]
[null,31,"أ.عباد","أ.الفرنسية "]
[null,32,"أ.العرباوي","أ.الانجليزية"]
[null,33,"أ.معزوز","أ.الانجليزية"]
[null,34,"أ.مزاري","أ.الانجليزية"]
[null,35,"أ.شنتوف","أ.الانجليزية"]
[null,36,"أ.سيفاني","أ.الاسبانية"]
[null,37,"أ.زغودي","أ.التكنولوجيا"]
[null,38,"أ.موس","أ.التكنولوجيا"]
[null,39,"أ.بوهنة","أ.التكنولوجيا"]
[null,40,"أ.نوار","أ.المعلوماتية"]
[null,41,"أ.بوشيخي","أ.الاقتصاد"]
[null,42,"أ.فارس","أ.الاقتصاد"]
[null,43,"أ.لقبوري","أ.الرياضة"]
[null,44,"أ.تربش","أ.الرياضة"]
[null,45,"أ.كحلون","أ.الرياضة"]