{"text_format":"1","workbook":"xlsx","n_sheets":9,"sheets":["Sheet1","Sheet2","Sheet3","Sheet4","Sheet5","Sheet6","sheet8","Index","تقرير موازنة"],"not_rendered":{"charts":0,"images":0,"macros":1,"external_links":1,"defined_names":34,"comments":1,"pivot_tables":0},"unopened":[],"bounds":{"document_bytes":16777216,"sheet_cells":100000,"rows_first":2000,"rows_last":500,"rows_between":2000,"halvings":0,"cell_chars":16384,"cell_head_chars":4096},"cells_cut":0,"cells_raw":0,"read":"whole","date_system":"1900"}

{"sheet":"Sheet1","index":0,"n_rows":174,"n_cols":58,"rows_kept":174,"cut":false,"hidden":true,"merged":[[0,39,0,43],[1,52,3,52]]}
[1,null,null,{"$f":"COUNTA(F4:F997)","v":0},null,null,null,null,null,null,null,null,null,null,null,null,null,null,null,null,null,null,null,null,null,null,null,null,null,null,null,null,null,null,null,null,null,null,null,"تقرير حركة المندوب اليومية"]
["Date","Folio Num","Supl code","Creditor Name","Item code","Item name","الصنف","الوارد","المنصرف","bouns","Purchase Price",null,null,null,null,null,"Rep Code","Representive Name","Cust. Code","Customer Name",null,null,null,null,null,null,null,null,null,null,null,null,null,null,null,null,null,null,null,null,null,null,null,null,null,null,"حركة المخزن للمندوب","اليوم",null,null,"نتيجة مبيعات المندوب",null,"أسم المحاسب",null,null,null,14,20]
["تاريخ","رقم الفاتورة","كود المورد","أسم المورد","كود الصنف","أسم الصنف","الفئة","كمية الوارد","كمية المنصرف","عرض مجاني","سعرالشراء","قيمة الفاتورة","قيمة الصنف","تغير السعر","متوسط المخزن","متوسط الوحدة علي الفاتورة","كود المندوب","اسم المندوب","كود العميل","أسم العميل","إجمالي القيمة الأصلية","جملة خصم الصنف","نسبة الخصم الممنوح","أسم المحاسب","المستلم","نوع الفاتورة","مخزن مخصص","مخزن محول",null,null,null,null,null,null,null,null,null,null,null,"التاريخ","كود المندوب","إسم المندوب","كود الصنف ","اسم الصنف ","وحدة ألصنف","رصيد المندوب أول  اليوم","سحب","مرتجع","رصيد المندوب",null,"مباع","رصيده المقدر"]
[]
[]
[]
[]
[]
[]
[]
{"$rows_left_out":165}
{"sheet":"Sheet2","index":1,"n_rows":429,"n_cols":112,"rows_kept":429,"cut":false,"hidden":true,"merged":[[1,68,2,68],[1,39,1,40],[1,41,1,42],[1,56,1,57],[1,58,1,59],[1,60,1,61],[1,63,2,63],[1,65,2,65],[1,64,2,64],[1,0,1,5],[1,7,1,9],[1,66,2,66],[1,67,2,67],[1,37,1,38],[1,27,1,28],[1,16,2,16],[1,35,1,36],[1,23,3,23]]}
[null,{"$f":"COUNTA(B4:B1000)","v":0},null,null,null,null,null,{"$f":"SUM(H4:H429)","v":0},{"$f":"SUM(I4:I429)","v":0},0,null,null,null,{"$f":"SUMPRODUCT(O4:O1000)","v":0},null,null,null,null,null,null,null,null,null,null,null,{"$f":"COUNTA(AA4:AA7000)","v":0},null,null,"تقرير مورد",null,null,null,{"$f":"SUM(AG4:AG15)-SUM(AF4:AF15)","v":0},null,null,"سداد عميل",{"$f":"COUNTA(AK4:AK900)","v":0},null,null,"تقرير العميل",null,{"$f":"SUM(AP4:AP16)","v":0},null,null,null,null,null,null,null,"سدد العميل ",null,null,{"$f":"SUM(BA3:BA24)","v":0},null,"تكويد مندوب","تكويدأسم  مندوب",null,"منا=يب",null,null,null,null,null,null,null,null,"سداد مورد",null,{"$f":"SUM(BQ2:BQ100)","v":0},null,null,null,null,null,null,null,null,null,null," المندوب","مبيعات","مشتريات","مرتجعات","سندات قبض","سداد مورد",null,null,null,null,null,null,null,null,null,"البحث",null,null,null,null,null,null,null,null,null,null,null,null,null,null,null,null,"جنية مصري"]
[null,null,null,null,null,null,"مخصص","حركة",null,null,null,null,null,null,null,null,"سعر الصنف الفعلي",null,"كود المورد","اسم المورد","عنوان المورد","الهاتف  المورد","أسم الشركة",null,null,null,null,"رصيد أول المدة   Start Balance",null,"حركة الفترة   Turnover of Period",null,"رصيد أخر المدة Balance  ",null,null,null,null,null,"رصيد أول المدة ",null,"حركة الفترة  ",null,"رصيد أخر المدة Balance  ",null,null,null,"تاريخ","رقم الحركة","بيان","كود المندوب","اسم المندوب","كود العميل","أسم العميل","المبلغ",null,null,null,"رصيد أول المدة   ",null,"الحركة النقدية للمندوب",null,"رصيد أخر المدة   ",null,null,"تاريخ","رقم الاذن ","بيان","كود المورد","أسم المورد","المبلغ",null,null,null,null,null,null,null,null,null,null,"000201",20001,1500,10001,15002,20001,"نوع حركة"," المخزن- المخصص",null,null,"اختار","أسم الشركة ",null,null,null,"كود الصنف ",null,null,null,null,null,null,null,null,null,null,null,null,null,null,null,null,"قروش"]
["كود الصنف ","اسم الصنف ","الفئة الصنف ","كمية أول المدة","سعر اول","قيمة أول المدة"," المخزن- المخصص","مشتريات","عروض","مباع","رصيد أخرالمدة","حد الطلب","المطلوب","متوسط سعرالوحدة ","قيمة المخزون","سعر بيع",null,null,"ItemCode","Suplier Name","Suplier adrss","Suplier phone","Suplier phone",null,null,"كود المورد ","أسم المــورد ","مدين  ","دائن ","مدين  ","دائن ","مدين  ","دائن ",null,null,"كود العميل ","أسم العميل     ","مدين   ","دائن ","مبيعات","سدادات","باقي","سداد",null,null,null,null,null,null,null,null,null,null,null,"كود المندوب","اسم المندوب","مديونية بره","تحصيلات","مبيعات المندوب","سدادات المندوب","مديونية بره","تحصيلات",null,null,null,null,null,null,null,"سداد مورد",null,null,null,null,null,null,null,null,null,"حركة سداد",null,null,null,"shet",null,"مبيعات","مخزن الدلتا",null,null,"تاريخ","شركة  أبوفارس رمضان ",null,null,null,"اسم الصنف ",null,null,null,null,null,null,null,null,null,null,null,null,null,null,null,null,"مليم"]
[null,null,null,null,null,null,null,{"$f":"SUMIFS(Sheet1!$H$4:$H$1497,Sheet1!$F$4:$F$1497,B5,Sheet1!$Z$4:$Z$1497,$H$3)","v":0},{"$f":"SUMIFS(Sheet1!$J$4:$J$1497,Sheet1!$F$4:$F$1497,B5,Sheet1!$Z$4:$Z$1497,$H$3)","v":0},{"$f":"SUMIFS(Sheet1!$H$4:$H$1497,Sheet1!$F$4:$F$1497,B5,Sheet1!$Z$4:$Z$1497,$J$3)","v":0},{"$f":"D4+H4+I4-J4","v":0},1020,{"$f":"IF(L4<>\"\",IF(L4>=K4,\"مطلوب\",\"\"),\"\")","v":"مطلوب"},{"$f":"IFERROR(IF(B4<>0,SUMIFS(Sheet1!$L$4:$L$997,Sheet1!$F$4:$F$997,B4,Sheet1!$Z$4:$Z$997,$H$3)+F4/SUMIFS(Sheet1!$H$4:$H$997,Sheet1!$F$4:$F$997,B4,Sheet1!$Z$4:$Z$997,$H$3)+D4,0),\"\")","v":0},{"$f":"IFERROR(SUMPRODUCT(K4*N4),\"\")","v":0},0.5,null,null,null,null,null,null,null,null,null,null,null,null,null,{"$f":"SUMIF($BP$4:$BP$100,AA4,$BQ$4:$BQ$100)","v":0},{"$f":"SUMIF(Sheet1!$D$3:$D$97,AA4,Sheet1!$M$3:$M$97)","v":0},{"$f":"IF(AB4+AD4>AC4+AE4,(AB4+AD4)-(AC4+AE4),\"\")","v":""},{"$f":"IF(AC4+AE4>AB4+AD4,(AC4+AE4)-(AB4+AD4),\"\")","v":""},null,null,null,null,null,null,{"$f":"SUMIF(Sheet1!$T$4:$T$300,AK4,Sheet1!$L$4:$L$300)","v":0},{"$f":"SUMIF($AZ$3:$AZ$200,AK4,$BA$3:$BA$200)","v":0},{"$f":"IF(AL4+AN4>AM4+AO4,(AL4+AN4)-(AM4+AO4),\"\")","v":""},{"$f":"IF(AM4+AO4>AL4+AN4,(AM4+AO4)-(AL4+AN4),\"\")","v":""},null,null,null,null,null,null,null,null,null,null,null,null,null,null,null,null,null,null,null,null,null,null,null,null,null,null,"سداد مورد",null,null,null,null,null,null,null,null,null,{"$f":"CF1","v":"سندات قبض"},20001,null,"سندات قبض","Sheet1",null,"مشتريات","مخزن الحوامدية",null,null,"رقم الفاتورة",null,null,null,null," المخزن- المخصص"]
[null,null,null,null,null,null,null,{"$f":"SUMIFS(Sheet1!$H$4:$H$1497,Sheet1!$F$4:$F$1497,B6,Sheet1!$Z$4:$Z$1497,$H$3)","v":0},{"$f":"SUMIFS(Sheet1!$J$4:$J$15,Sheet1!$F$4:$F$15,B6,Sheet1!$Z$4:$Z$15,$H$3)","v":0},{"$f":"SUMIFS(Sheet1!$H$4:$H$1497,Sheet1!$F$4:$F$1497,B6,Sheet1!$Z$4:$Z$1497,$J$3)","v":0},0,21,{"$f":"IF(L5<>\"\",IF(L5>=K5,\"مطلوب\",\"\"),\"\")","v":"مطلوب"},{"$f":"IFERROR(IF(B5<>0,SUMIFS(Sheet1!$L$4:$L$997,Sheet1!$F$4:$F$997,B5,Sheet1!$Z$4:$Z$997,$H$3)+F5/SUMIFS(Sheet1!$H$4:$H$997,Sheet1!$F$4:$F$997,B5,Sheet1!$Z$4:$Z$997,$H$3)+D5,0),\"\")","v":0},{"$f":"IFERROR(SUMPRODUCT(K5*N5),\"\")","v":0},1.5,null,null,null,null,null,null,null,null,null,null,null,null,null,{"$f":"SUMIF($BP$4:$BP$100,AA5,$BQ$4:$BQ$100)","v":0},{"$f":"SUMIF(Sheet1!$D$3:$D$97,AA5,Sheet1!$M$3:$M$97)","v":0},{"$f":"IF(AB5+AD5>AC5+AE5,(AB5+AD5)-(AC5+AE5),\"\")","v":""},{"$f":"IF(AC5+AE5>AB5+AD5,(AC5+AE5)-(AB5+AD5),\"\")","v":""},null,null,null,null,null,null,{"$f":"SUMIF(Sheet1!$T$4:$T$300,AK5,Sheet1!$L$4:$L$300)","v":0},{"$f":"SUMIF($AZ$3:$AZ$200,AK5,$BA$3:$BA$200)","v":0},{"$f":"IF(AL5+AN5>AM5+AO5,(AL5+AN5)-(AM5+AO5),\"\")","v":""},{"$f":"IF(AM5+AO5>AL5+AN5,(AM5+AO5)-(AL5+AN5),\"\")","v":""},null,null,null,null,null,null,null,null,null,null,null,null,null,null,null,null,null,null,null,null,null,null,null,null,null,null,null,null,null,null,null,null,null,null,null,null,{"$f":"CG1","v":"سداد مورد"},1500,null,"سندات صرف","Sheet2",null,"مرتجعات","مخزن تجزئة",null,null,"كود المورد",null,null,null,null,"مشتريات"]
[null,null,null,null,null,null,null,{"$f":"SUMIFS(Sheet1!$H$4:$H$1497,Sheet1!$F$4:$F$1497,B7,Sheet1!$Z$4:$Z$1497,$H$3)","v":0},{"$f":"SUMIFS(Sheet1!$J$4:$J$15,Sheet1!$F$4:$F$15,B7,Sheet1!$Z$4:$Z$15,$H$3)","v":0},{"$f":"SUMIFS(Sheet1!$H$4:$H$1497,Sheet1!$F$4:$F$1497,B7,Sheet1!$Z$4:$Z$1497,$J$3)","v":0},0,22,"مطلوب",{"$f":"IFERROR(IF(B6<\"\",SUMIFS(Sheet1!$L$4:$L$997,Sheet1!$F$4:$F$997,B6,Sheet1!$Z$4:$Z$997,$H$3)+F6/SUMIFS(Sheet1!$H$4:$H$997,Sheet1!$F$4:$F$997,B6,Sheet1!$Z$4:$Z$997,$H$3),F6/D6),\"\")","v":""},"",2.5,null,null,null,null,null,null,null,null,null,null,null,null,null,{"$f":"SUMIF($BP$4:$BP$100,AA6,$BQ$4:$BQ$100)","v":0},{"$f":"SUMIF(Sheet1!$D$3:$D$97,AA6,Sheet1!$M$3:$M$97)","v":0},"","",null,null,null,null,null,null,{"$f":"SUMIF(Sheet1!$T$4:$T$300,AK6,Sheet1!$L$4:$L$300)","v":0},0,"","",null,null,null,null,null,null,null,null,null,null,null,null,null,null,null,null,null,null,null,null,null,null,null,null,null,null,null,null,null,null,null,null,null,null,null,null,null,null,null,null,"Sheet3",null,null,"مخزن  جملة",null,null,"أسم المورد",null,null,null,null,"عروض"]
[null,null,null,null,null,null,null,{"$f":"SUMIFS(Sheet1!$H$4:$H$1497,Sheet1!$F$4:$F$1497,B8,Sheet1!$Z$4:$Z$1497,$H$3)","v":0},{"$f":"SUMIFS(Sheet1!$J$4:$J$15,Sheet1!$F$4:$F$15,B8,Sheet1!$Z$4:$Z$15,$H$3)","v":0},{"$f":"SUMIFS(Sheet1!$H$4:$H$1497,Sheet1!$F$4:$F$1497,B8,Sheet1!$Z$4:$Z$1497,$J$3)","v":0},0,null,"",{"$f":"IFERROR(IF(B7<\"\",SUMIFS(Sheet1!$L$4:$L$997,Sheet1!$F$4:$F$997,B7,Sheet1!$Z$4:$Z$997,$H$3)+F7/SUMIFS(Sheet1!$H$4:$H$997,Sheet1!$F$4:$F$997,B7,Sheet1!$Z$4:$Z$997,$H$3),F7/D7),\"\")","v":""},"",3.5,null,null,null,null,null,null,null,null,null,null,null,null,null,0,{"$f":"SUMIF(Sheet1!$D$3:$D$97,AA7,Sheet1!$M$3:$M$97)","v":0},"","",null,null,null,null,null,null,{"$f":"SUMIF(Sheet1!$T$4:$T$300,AK7,Sheet1!$L$4:$L$300)","v":0},0,"","",null,null,null,null,null,null,null,null,null,null,null,null,null,null,null,null,null,null,null,null,null,null,null,null,null,null,null,null,null,null,null,null,null,null,null,null,null,null,null,null,"Sheet4",null,null,"مخزن جملة العروض",null,null,"كود الصنف",null,null,null,null,"مباع"]
[null,null,null,null,null,null,null,{"$f":"SUMIFS(Sheet1!$H$4:$H$1497,Sheet1!$F$4:$F$1497,B9,Sheet1!$Z$4:$Z$1497,$H$3)","v":0},{"$f":"SUMIFS(Sheet1!$J$4:$J$15,Sheet1!$F$4:$F$15,B9,Sheet1!$Z$4:$Z$15,$H$3)","v":0},{"$f":"SUMIFS(Sheet1!$H$4:$H$1497,Sheet1!$F$4:$F$1497,B9,Sheet1!$Z$4:$Z$1497,$J$3)","v":0},0,20,"مطلوب",{"$f":"IFERROR(IF(B8<\"\",SUMIFS(Sheet1!$L$4:$L$997,Sheet1!$F$4:$F$997,B8,Sheet1!$Z$4:$Z$997,$H$3)+F8/SUMIFS(Sheet1!$H$4:$H$997,Sheet1!$F$4:$F$997,B8,Sheet1!$Z$4:$Z$997,$H$3),F8/D8),\"\")","v":""},"",4.5,null,null,null,null,null,null,null,null,null,null,null,null,null,0,{"$f":"SUMIF(Sheet1!$D$3:$D$97,AA8,Sheet1!$M$3:$M$97)","v":0},"","",null,null,null,null,null,null,{"$f":"SUMIF(Sheet1!$T$4:$T$300,AK8,Sheet1!$L$4:$L$300)","v":0},0,"","",null,null,null,null,null,null,null,null,null,null,null,null,null,null,null,null,null,null,null,null,null,null,null,null,null,null,null,null,null,null,null,null,null,null,null,null,null,null,null,null,"Sheet5",null,null,"مخزن تجزئة العروض وهدايا",null,null,"أسم الصنف"]
[null,null,null,null,null,null,null,{"$f":"SUMIFS(Sheet1!$H$4:$H$1497,Sheet1!$F$4:$F$1497,B10,Sheet1!$Z$4:$Z$1497,$H$3)","v":0},{"$f":"SUMIFS(Sheet1!$J$4:$J$15,Sheet1!$F$4:$F$15,B10,Sheet1!$Z$4:$Z$15,$H$3)","v":0},{"$f":"SUMIFS(Sheet1!$H$4:$H$1497,Sheet1!$F$4:$F$1497,B10,Sheet1!$Z$4:$Z$1497,$J$3)","v":0},0,10,"مطلوب",{"$f":"IFERROR(IF(B9<\"\",SUMIFS(Sheet1!$L$4:$L$997,Sheet1!$F$4:$F$997,B9,Sheet1!$Z$4:$Z$997,$H$3)+F9/SUMIFS(Sheet1!$H$4:$H$997,Sheet1!$F$4:$F$997,B9,Sheet1!$Z$4:$Z$997,$H$3),F9/D9),\"\")","v":""},"",5.5,null,null,null,null,null,null,null,null,null,null,null,null,null,0,{"$f":"SUMIF(Sheet1!$D$3:$D$97,AA9,Sheet1!$M$3:$M$97)","v":0},"","",null,null,null,null,null,null,{"$f":"SUMIF(Sheet1!$T$4:$T$300,AK9,Sheet1!$L$4:$L$300)","v":0},0,"","",null,null,null,null,null,null,null,null,null,null,null,null,null,null,null,null,null,null,null,null,null,null,null,null,null,null,null,null,null,null,null,null,null,null,null,null,null,null,null,null,null,null,null,"مخزن الهالك",null,null,"كود المندوب"]
[null,null,null,null,null,null,null,{"$f":"SUMIFS(Sheet1!$H$4:$H$1497,Sheet1!$F$4:$F$1497,B11,Sheet1!$Z$4:$Z$1497,$H$3)","v":0},{"$f":"SUMIFS(Sheet1!$J$4:$J$15,Sheet1!$F$4:$F$15,B11,Sheet1!$Z$4:$Z$15,$H$3)","v":0},{"$f":"SUMIFS(Sheet1!$H$4:$H$1497,Sheet1!$F$4:$F$1497,B11,Sheet1!$Z$4:$Z$1497,$J$3)","v":0},0,40,"مطلوب",{"$f":"IFERROR(IF(B10<\"\",SUMIFS(Sheet1!$L$4:$L$997,Sheet1!$F$4:$F$997,B10,Sheet1!$Z$4:$Z$997,$H$3)+F10/SUMIFS(Sheet1!$H$4:$H$997,Sheet1!$F$4:$F$997,B10,Sheet1!$Z$4:$Z$997,$H$3),F10/D10),\"\")","v":""},"",6.5,17,null,null,null,null,null,null,null,25,null,null,null,null,0,{"$f":"SUMIF(Sheet1!$D$3:$D$97,AA10,Sheet1!$M$3:$M$97)","v":0},"","",34,35,null,null,null,null,{"$f":"SUMIF(Sheet1!$T$4:$T$300,AK10,Sheet1!$L$4:$L$300)","v":0},0,"","",null,45,null,null,null,null,null,null,null,null,54,null,null,null,null,null,null,null,null,63,null,null,null,null,null,null,null,null,null,null,null,null,null,null,null,null,null,null,null,null,null,null,null,null,null,null,"اسم المندوب"]
{"$rows_left_out":420}
{"sheet":"Sheet3","index":2,"n_rows":306,"n_cols":41,"rows_kept":306,"cut":false,"hidden":true,"merged":[]}
[null,null,null,null,null,null,null,null,null,null,null,null,null,null,null,null,null,">=","<=",null,null,null,null,null,null,null,null,null,null,null,null,null,null,null,null,null,null,null,null,">=","<="]
[]
["تاريخ","2018-03-01",null,null,"اسم الصنف",null,null,"المخزن المخصص",null,null,"رصيد اول",{"$f":"INDEX(Sheet2!$D$4:$D$1000,MATCH(E4,Sheet2!$B$4:$B$600,0))","v":{"$error":"#N/A"}},{"$f":"INDEX(Sheet2!D4:D10000,MATCH(E4,Sheet2!$B$4:$B$600,0))","v":{"$error":"#N/A"}}]
["تاريخ","2018-03-29",null,null,"زيت فتيس باور ",null,null,"مخزن الدلتا",null,null,"رصيد الحالي",{"$f":"LOOKUP(9999999,$K$11:$K$1500)","v":{"$error":"#N/A"}},{"$f":"LOOKUP(9999999,K11:K1500)","v":{"$error":"#N/A"}}]
["تاريخ","تاريخ","رقم الفاتورة","كود المورد","أسم المورد","كود الصنف","أسم الصنف","الفئة","كمية الوارد","كمية المنصرف","عرض مجاني","سعرالشراء","قيمة الفاتورة","قيمة الصنف","تغير السعر","متوسط المخزن","متوسط الوحدة علي الفاتورة","كود المندوب","اسم المندوب","كود العميل","أسم العميل","إجمالي القيمة الأصلية","جملة خصم الصنف","نسبة الخصم الممنوح","أسم المحاسب","المستلم","نوع الفاتورة","مخزن مخصص","مخزن محول"]
[{"$f":"$R$1&$B$3","v":">=43160"},{"$f":"$S$1&$B$4","v":"<=43188"},null,null,null,null,{"$f":"$E$4","v":"زيت فتيس باور "},null,null,null,null,null,null,null,null,null,null,null,null,null,null,null,null,null,null,null,null,null,{"$f":"$H$4","v":"مخزن الدلتا"}]
[]
[]
[]
["تاريخ","رقم الفاتورة","نوع الفاتورة","كود الصنف","أسم الصنف","الفئة","كمية الوارد","كمية المنصرف","مخزن محول","مخزن مخصص","الرصيد"]
{"$rows_left_out":297}
{"sheet":"Sheet4","index":3,"n_rows":48,"n_cols":108,"rows_kept":48,"cut":false,"hidden":true,"merged":[[14,52,14,53],[14,23,14,24],[14,25,14,26],[14,27,14,28],[9,23,9,24],[9,25,9,26],[9,27,9,28],[14,8,14,9],[14,2,14,3],[9,3,9,4],[14,4,14,5],[13,2,13,4],[9,5,9,6],[9,2,10,2],[9,7,9,8],[9,9,9,10],[9,0,10,0],[9,1,10,1],[14,0,15,0],[14,1,15,1],[14,6,14,7],[14,14,14,15],[14,16,14,17],[14,18,14,19],[14,12,14,13],[9,12,9,13],[9,14,9,15],[9,16,9,17],[9,18,9,19]]}
[null,null,null,null,null,null,null,null,null,{"$f":"NOW()","v":"2018-09-23T16:52:10.770"},{"$f":"ADDRESS(COUNTA(A17:A2000)+17,29)","v":"$AC$17"},null,null,null,null,null,null,null,null,{"$f":"ADDRESS(COUNTA(A17:A2000)+17,29)","v":"$AC$17"},null,null,null,null,null,"سندات قبض","سندات صرف",null,null,null,null,null,null,null,null,null,null,null,null,null,null,null,null,null,null,null,null,null,null,null,null,null,null,null,null,"سند قبض"]
[null,null,null,null,null,null,null,null,null,null,null,null,null,null,null,null,null,null,null,null,null,null,null,null,null,15005,20011,null,null,null,null,null,null,null,null,null,null,null,null,null,null,null,null,null,null,null,null,null,null,null,null,null,null,null,null,"سند صرف"]
[]
[]
[]
[]
[]
[]
["من","الى"]
["التاريخ","التاريخ","رقم الاذن",null,null,"رصيد أول المدة   Start Balance",null,"حركة الفترة   Turnover of Period",null,"رصيد أخر المدة Balance  ",null,null,null,null,"رصيد أول المدة ",null,"سيد",null,"رصيد أخر المدة Balance  ",null,null,null,null,"رصيد أول المدة   ",null,"الحركة النقدية للمندوب",null,"رصيد أخر المدة   ",null,null,null,null,null,null,null,null,null,null,null,null,"حركة المخزن للمندوب","اليوم"]
{"$rows_left_out":39}
{"sheet":"Sheet5","index":4,"n_rows":544,"n_cols":29,"rows_kept":544,"cut":false,"hidden":true,"merged":[]}
[null,null,null,null,null,null,null,null,null,null,null,null,null,null,null,null,null,null,">=","<="]
["تاريخ",null,null,null,"اسم الصنف",null,null,"المخزن المخصص",null,null,null,null,"رصيد اول",{"$f":"SUMIF(Sheet2!$B$3:$B$1000,E3,Sheet2!$D$4:$D$1000)","v":0}]
["تاريخ",null,null,null,"شاي أخضر",null,null,"مخزن الدلتا",null,null,null,null,"رصيد الحالي",{"$f":"LOOKUP(99999999,$M$13:$M$2500)","v":-52}]
[]
[]
[]
["تاريخ","تاريخ","رقم الفاتورة","كود المورد","أسم المورد","كود الصنف","أسم الصنف","الفئة","كمية الوارد","كمية المنصرف","عرض مجاني","سعرالشراء","قيمة الفاتورة","قيمة الصنف","تغير السعر","متوسط المخزن","متوسط الوحدة علي الفاتورة","كود المندوب","اسم المندوب","كود العميل","أسم العميل","إجمالي القيمة الأصلية","جملة خصم الصنف","نسبة الخصم الممنوح","أسم المحاسب","المستلم","نوع الفاتورة","مخزن مخصص","مخزن محول"]
[]
[]
[]
{"$rows_left_out":535}
{"sheet":"Sheet6","index":5,"n_rows":1,"n_cols":1,"rows_kept":1,"cut":false,"hidden":false,"merged":[]}
[3]

{"sheet":"sheet8","index":6,"n_rows":4,"n_cols":26,"rows_kept":4,"cut":false,"hidden":true,"merged":[]}
["اسم المستخدم","رقم السري","ادخال ","النكويد","كارت الصنف","تقرير موازنة","مراقبة المخزون","طلب الشراء","تقرير استعلام مخزن","تقرير العهدة","طباعة","مستخدمين",null,"اسم المستخدم","تكويد الاصناف","اذن اصافة","اذن صرف","تقرير متابعة صيانة","مراقبة المخزون","طلب الشراء","تقرير استعلام مخزن","تقرير العهدة","طباعة","مستخدمين",null,"yes"]
["رمضان",123,"yes","no","no","no","no","no","no","no","no","no",null,"رمضان",{"$f":"IF(N2=\"\",\"\",VLOOKUP(N2,A2:K9,3,FALSE))","v":"yes"},{"$f":"IF(N2=\"\",\"\",VLOOKUP(N2,A2:K9,4,FALSE))","v":"no"},{"$f":"IF(N2=\"\",\"\",VLOOKUP(N2,$A$2:$K$9,5,FALSE))","v":"no"},{"$f":"IF(N2=\"\",\"\",VLOOKUP(N2,$A$2:$K$9,6,FALSE))","v":"no"},{"$f":"IF(N2=\"\",\"\",VLOOKUP(N2,$A$2:$K$9,7,FALSE))","v":"no"},{"$f":"IF($N$2=\"\",\"\",VLOOKUP($N$2,$A$2:$K$9,8,FALSE))","v":"no"},{"$f":"IF($N$2=\"\",\"\",VLOOKUP($N$2,$A$2:$K$9,9,FALSE))","v":"no"},{"$f":"IF($N$2=\"\",\"\",VLOOKUP($N$2,$A$2:$K$9,10,FALSE))","v":"no"},{"$f":"IF($N$2=\"\",\"\",VLOOKUP($N$2,$A$2:$K$9,11,FALSE))","v":"no"},{"$f":"IF($N$2=\"\",\"\",VLOOKUP($N$2,$A$2:$L$9,12,FALSE))","v":"no"},null,"no"]
["فارس",111,"no","no","no","no","no","no","no","no","no","no"]
["حنين",222]

{"sheet":"Index","index":7,"n_rows":0,"n_cols":0,"rows_kept":0,"cut":false,"hidden":true,"merged":[]}

{"sheet":"تقرير موازنة","index":8,"n_rows":17,"n_cols":6,"rows_kept":17,"cut":false,"hidden":true,"merged":[[16,3,16,4]]}
[]
[]
[]
[]
[null,null,null,null,null,"2018-04-02T20:42:52"]
[null,{"$f":"Sheet2!CM3","v":"شركة  أبوفارس رمضان "}]
[null,null," تقارير المخزن والموازنة"]
[null,null,null,null,{"$f":"NOW()","v":"2018-09-23T16:52:10.770"}]
[null," رصيد العملاء",{"$f":"Sheet2!AP1","v":0}," سعر منتج المخازن بيع"]
[null," رصيد الموردين",{"$f":"Sheet2!AG1","v":0}," سعر منتج المخازن شراء"]
{"$rows_left_out":7}