{"text_format":"1","workbook":"xlsx","n_sheets":9,"sheets":["Sheet1","Sheet2","Sheet3","Sheet4","Sheet5","Sheet6","sheet8","Index","تقرير موازنة"],"not_rendered":{"charts":0,"images":0,"macros":1,"external_links":1,"defined_names":34,"comments":1,"pivot_tables":0},"unopened":[],"bounds":{"document_bytes":16777216,"sheet_cells":100000,"rows_first":2000,"rows_last":500,"rows_between":2000,"halvings":0,"cell_chars":16384,"cell_head_chars":4096},"cells_cut":0,"cells_raw":0,"read":"whole","date_system":"1900"}

{"sheet":"Sheet1","index":0,"n_rows":174,"n_cols":58,"rows_kept":174,"cut":false,"hidden":true,"merged":[[0,39,0,43],[1,52,3,52]]}
[1,null,null,{"$f":"COUNTA(F4:F997)","v":0},null,null,null,null,null,null,null,null,null,null,null,null,null,null,null,null,null,null,null,null,null,null,null,null,null,null,null,null,null,null,null,null,null,null,null,"تقرير حركة المندوب اليومية"]
["Date","Folio Num","Supl code","Creditor Name","Item code","Item name","الصنف","الوارد","المنصرف","bouns","Purchase Price",null,null,null,null,null,"Rep Code","Representive Name","Cust. Code","Customer Name",null,null,null,null,null,null,null,null,null,null,null,null,null,null,null,null,null,null,null,null,null,null,null,null,null,null,"حركة المخزن للمندوب","اليوم",null,null,"نتيجة مبيعات المندوب",null,"أسم المحاسب",null,null,null,14,20]
["تاريخ","رقم الفاتورة","كود المورد","أسم المورد","كود الصنف","أسم الصنف","الفئة","كمية الوارد","كمية المنصرف","عرض مجاني","سعرالشراء","قيمة الفاتورة","قيمة الصنف","تغير السعر","متوسط المخزن","متوسط الوحدة علي الفاتورة","كود المندوب","اسم المندوب","كود العميل","أسم العميل","إجمالي القيمة الأصلية","جملة خصم الصنف","نسبة الخصم الممنوح","أسم المحاسب","المستلم","نوع الفاتورة","مخزن مخصص","مخزن محول",null,null,null,null,null,null,null,null,null,null,null,"التاريخ","كود المندوب","إسم المندوب","كود الصنف ","اسم الصنف ","وحدة ألصنف","رصيد المندوب أول  اليوم","سحب","مرتجع","رصيد المندوب",null,"مباع","رصيده المقدر"]
[]
[]
[]
[]
[]
[]
[]
[null,null,null,null,null,null,null,null,null,null,null,null,null,null,null,null,null,null,null,null,null,null,null,null,null,null,null,null,null,null,null,null,null,33,34,35,36,37,38]
[]
[]
[]
[]
[]
[]
[]
[]
[]
[]
[]
[]
[]
[]
[]
[]
[]
[]
[]
[]
[]
[]
[]
[]
[]
[]
[null,null,null,null,null,null,null,null,null,null,null,null,{"$f":"H38*K38","v":0}]
[null,null,null,null,null,null,null,null,null,null,null,null,0]
[null,null,null,null,null,null,null,null,null,null,null,null,0]
[null,null,null,null,null,null,null,null,null,null,null,null,0]
[null,null,null,null,null,null,null,null,null,null,null,null,0]
[null,null,null,null,null,null,null,null,null,null,null,null,0]
[null,null,null,null,null,null,null,null,null,null,null,null,0]
[null,null,null,null,null,null,null,null,null,null,null,null,0]
[null,null,null,null,null,null,null,null,null,null,null,null,0]
[null,null,null,null,null,null,null,null,null,null,null,null,0]
[null,null,null,null,null,null,null,null,null,null,null,null,0]
[null,null,null,null,null,null,null,null,null,null,null,null,0]
[null,null,null,null,null,null,null,null,null,null,null,null,0]
[null,null,null,null,null,null,null,null,null,null,null,null,0]
[null,null,null,null,null,null,null,null,null,null,null,null,0]
[null,null,null,null,null,null,null,null,null,null,null,null,0]
[null,null,null,null,null,null,null,null,null,null,null,null,0]
[null,null,null,null,null,null,null,null,null,null,null,null,0]
[null,null,null,null,null,null,null,null,null,null,null,null,0]
[null,null,null,null,null,null,null,null,null,null,null,null,0]
[null,null,null,null,null,null,null,null,null,null,null,null,0]
[null,null,null,null,null,null,null,null,null,null,null,null,0]
[null,null,null,null,null,null,null,null,null,null,null,null,0]
[null,null,null,null,null,null,null,null,null,null,null,null,0]
[null,null,null,null,null,null,null,null,null,null,null,null,0]
[null,null,null,null,null,null,null,null,null,null,null,null,0]
[null,null,null,null,null,null,null,null,null,null,null,null,0]
[null,null,null,null,null,null,null,null,null,null,null,null,0]
[null,null,null,null,null,null,null,null,null,null,null,null,0]
[null,null,null,null,null,null,null,null,null,null,null,null,{"$f":"H67*K67","v":0}]
[null,null,null,null,null,null,null,null,null,null,null,null,0]
[null,null,null,null,null,null,null,null,null,null,null,null,0]
[null,null,null,null,null,null,null,null,null,null,null,null,0]
[null,null,null,null,null,null,null,null,null,null,null,null,0]
[null,null,null,null,null,null,null,null,null,null,null,null,0]
[null,null,null,null,null,null,null,null,null,null,null,null,0]
[null,null,null,null,null,null,null,null,null,null,null,null,0]
[null,null,null,null,null,null,null,null,null,null,null,null,0]
[null,null,null,null,null,null,null,null,null,null,null,null,0]
[null,null,null,null,null,null,null,null,null,null,null,null,0]
[null,null,null,null,null,null,null,null,null,null,null,null,0]
[null,null,null,null,null,null,null,null,null,null,null,null,0]
[null,null,null,null,null,null,null,null,null,null,null,null,0]
[null,null,null,null,null,null,null,null,null,null,null,null,0]
[null,null,null,null,null,null,null,null,null,null,null,null,0]
[null,null,null,null,null,null,null,null,null,null,null,null,0]
[null,null,null,null,null,null,null,null,null,null,null,null,0]
[null,null,null,null,null,null,null,null,null,null,null,null,0]
[null,null,null,null,null,null,null,null,null,null,null,null,0]
[null,null,null,null,null,null,null,null,null,null,null,null,0]
[null,null,null,null,null,null,null,null,null,null,null,null,0]
[null,null,null,null,null,null,null,null,null,null,null,null,0]
[null,null,null,null,null,null,null,null,null,null,null,null,0]
[null,null,null,null,null,null,null,null,null,null,null,null,0]
[null,null,null,null,null,null,null,null,null,null,null,null,0]
[null,null,null,null,null,null,null,null,null,null,null,null,0]
[null,null,null,null,null,null,null,null,null,null,null,null,0]
[null,null,null,null,null,null,null,null,null,null,null,null,0]
[null,null,null,null,null,null,null,null,null,null,null,null,0]
[null,null,null,null,null,null,null,null,null,null,null,null,0]
[null,null,null,null,null,null,null,null,null,null,null,null,0]
[null,null,null,null,null,null,null,null,null,null,null,null,0]
[null,null,null,null,null,null,null,null,null,null,null,null,0]
[null,null,null,null,null,null,null,null,null,null,null,null,0]
[null,null,null,null,null,null,null,null,null,null,null,null,0]
[null,null,null,null,null,null,null,null,null,null,null,null,0]
[null,null,null,null,null,null,null,null,null,null,null,null,0]
[null,null,null,null,null,null,null,null,null,null,null,null,0]
[null,null,null,null,null,null,null,null,null,null,null,null,0]
[null,null,null,null,null,null,null,null,null,null,null,null,0]
[null,null,null,null,null,null,null,null,null,null,null,null,0]
[null,null,null,null,null,null,null,null,null,null,null,null,0]
[null,null,null,null,null,null,null,null,null,null,null,null,0]
[null,null,null,null,null,null,null,null,null,null,null,null,0]
[null,null,null,null,null,null,null,null,null,null,null,null,0]
[null,null,null,null,null,null,null,null,null,null,null,null,0]
[null,null,null,null,null,null,null,null,null,null,null,null,0]
[null,null,null,null,null,null,null,null,null,null,null,null,0]
[null,null,null,null,null,null,null,null,null,null,null,null,0]
[null,null,null,null,null,null,null,null,null,null,null,null,0]
[null,null,null,null,null,null,null,null,null,null,null,null,0]
[null,null,null,null,null,null,null,null,null,null,null,null,0]
[null,null,null,null,null,null,null,null,null,null,null,null,0]
[null,null,null,null,null,null,null,null,null,null,null,null,0]
[null,null,null,null,null,null,null,null,null,null,null,null,0]
[null,null,null,null,null,null,null,null,null,null,null,null,0]
[null,null,null,null,null,null,null,null,null,null,null,null,0]
[null,null,null,null,null,null,null,null,null,null,null,null,0]
[null,null,null,null,null,null,null,null,null,null,null,null,0]
[null,null,null,null,null,null,null,null,null,null,null,null,0]
[null,null,null,null,null,null,null,null,null,null,null,null,0]
[null,null,null,null,null,null,null,null,null,null,null,null,0]
[null,null,null,null,null,null,null,null,null,null,null,null,0]
[null,null,null,null,null,null,null,null,null,null,null,null,{"$f":"H131*K131","v":0}]
[null,null,null,null,null,null,null,null,null,null,null,null,0]
[null,null,null,null,null,null,null,null,null,null,null,null,0]
[null,null,null,null,null,null,null,null,null,null,null,null,0]
[null,null,null,null,null,null,null,null,null,null,null,null,0]
[null,null,null,null,null,null,null,null,null,null,null,null,0]
[null,null,null,null,null,null,null,null,null,null,null,null,0]
[null,null,null,null,null,null,null,null,null,null,null,null,0]
[null,null,null,null,null,null,null,null,null,null,null,null,0]
[null,null,null,null,null,null,null,null,null,null,null,null,0]
[null,null,null,null,null,null,null,null,null,null,null,null,0]
[null,null,null,null,null,null,null,null,null,null,null,null,0]
[null,null,null,null,null,null,null,null,null,null,null,null,0]
[null,null,null,null,null,null,null,null,null,null,null,null,0]
[null,null,null,null,null,null,null,null,null,null,null,null,0]
[null,null,null,null,null,null,null,null,null,null,null,null,0]
[null,null,null,null,null,null,null,null,null,null,null,null,0]
[null,null,null,null,null,null,null,null,null,null,null,null,0]
[null,null,null,null,null,null,null,null,null,null,null,null,0]
[null,null,null,null,null,null,null,null,null,null,null,null,0]
[null,null,null,null,null,null,null,null,null,null,null,null,0]
[null,null,null,null,null,null,null,null,null,null,null,null,0]
[null,null,null,null,null,null,null,null,null,null,null,null,0]
[null,null,null,null,null,null,null,null,null,null,null,null,0]
[null,null,null,null,null,null,null,null,null,null,null,null,0]
[null,null,null,null,null,null,null,null,null,null,null,null,0]
[null,null,null,null,null,null,null,null,null,null,null,null,0]
[null,null,null,null,null,null,null,null,null,null,null,null,0]
[null,null,null,null,null,null,null,null,null,null,null,null,0]
[null,null,null,null,null,null,null,null,null,null,null,null,0]
[null,null,null,null,null,null,null,null,null,null,null,null,0]
[null,null,null,null,null,null,null,null,null,null,null,null,0]
[null,null,null,null,null,null,null,null,null,null,null,null,0]
[null,null,null,null,null,null,null,null,null,null,null,null,0]
[null,null,null,null,null,null,null,null,null,null,null,null,0]
[null,null,null,null,null,null,null,null,null,null,null,null,0]
[null,null,null,null,null,null,null,null,null,null,null,null,0]
[null,null,null,null,null,null,null,null,null,null,null,null,0]
[null,null,null,null,null,null,null,null,null,null,null,null,0]
[null,null,null,null,null,null,null,null,null,null,null,null,0]
[null,null,null,null,null,null,null,null,null,null,null,null,0]
[null,null,null,null,null,null,null,null,null,null,null,null,0]
[null,null,null,null,null,null,null,null,null,null,null,null,0]
[null,null,null,null,null,null,null,null,null,null,null,null,0]

{"sheet":"Sheet2","index":1,"n_rows":429,"n_cols":112,"rows_kept":429,"cut":false,"hidden":true,"merged":[[1,68,2,68],[1,39,1,40],[1,41,1,42],[1,56,1,57],[1,58,1,59],[1,60,1,61],[1,63,2,63],[1,65,2,65],[1,64,2,64],[1,0,1,5],[1,7,1,9],[1,66,2,66],[1,67,2,67],[1,37,1,38],[1,27,1,28],[1,16,2,16],[1,35,1,36],[1,23,3,23]]}
[null,{"$f":"COUNTA(B4:B1000)","v":0},null,null,null,null,null,{"$f":"SUM(H4:H429)","v":0},{"$f":"SUM(I4:I429)","v":0},0,null,null,null,{"$f":"SUMPRODUCT(O4:O1000)","v":0},null,null,null,null,null,null,null,null,null,null,null,{"$f":"COUNTA(AA4:AA7000)","v":0},null,null,"تقرير مورد",null,null,null,{"$f":"SUM(AG4:AG15)-SUM(AF4:AF15)","v":0},null,null,"سداد عميل",{"$f":"COUNTA(AK4:AK900)","v":0},null,null,"تقرير العميل",null,{"$f":"SUM(AP4:AP16)","v":0},null,null,null,null,null,null,null,"سدد العميل ",null,null,{"$f":"SUM(BA3:BA24)","v":0},null,"تكويد مندوب","تكويدأسم  مندوب",null,"منا=يب",null,null,null,null,null,null,null,null,"سداد مورد",null,{"$f":"SUM(BQ2:BQ100)","v":0},null,null,null,null,null,null,null,null,null,null," المندوب","مبيعات","مشتريات","مرتجعات","سندات قبض","سداد مورد",null,null,null,null,null,null,null,null,null,"البحث",null,null,null,null,null,null,null,null,null,null,null,null,null,null,null,null,"جنية مصري"]
[null,null,null,null,null,null,"مخصص","حركة",null,null,null,null,null,null,null,null,"سعر الصنف الفعلي",null,"كود المورد","اسم المورد","عنوان المورد","الهاتف  المورد","أسم الشركة",null,null,null,null,"رصيد أول المدة   Start Balance",null,"حركة الفترة   Turnover of Period",null,"رصيد أخر المدة Balance  ",null,null,null,null,null,"رصيد أول المدة ",null,"حركة الفترة  ",null,"رصيد أخر المدة Balance  ",null,null,null,"تاريخ","رقم الحركة","بيان","كود المندوب","اسم المندوب","كود العميل","أسم العميل","المبلغ",null,null,null,"رصيد أول المدة   ",null,"الحركة النقدية للمندوب",null,"رصيد أخر المدة   ",null,null,"تاريخ","رقم الاذن ","بيان","كود المورد","أسم المورد","المبلغ",null,null,null,null,null,null,null,null,null,null,"000201",20001,1500,10001,15002,20001,"نوع حركة"," المخزن- المخصص",null,null,"اختار","أسم الشركة ",null,null,null,"كود الصنف ",null,null,null,null,null,null,null,null,null,null,null,null,null,null,null,null,"قروش"]
["كود الصنف ","اسم الصنف ","الفئة الصنف ","كمية أول المدة","سعر اول","قيمة أول المدة"," المخزن- المخصص","مشتريات","عروض","مباع","رصيد أخرالمدة","حد الطلب","المطلوب","متوسط سعرالوحدة ","قيمة المخزون","سعر بيع",null,null,"ItemCode","Suplier Name","Suplier adrss","Suplier phone","Suplier phone",null,null,"كود المورد ","أسم المــورد ","مدين  ","دائن ","مدين  ","دائن ","مدين  ","دائن ",null,null,"كود العميل ","أسم العميل     ","مدين   ","دائن ","مبيعات","سدادات","باقي","سداد",null,null,null,null,null,null,null,null,null,null,null,"كود المندوب","اسم المندوب","مديونية بره","تحصيلات","مبيعات المندوب","سدادات المندوب","مديونية بره","تحصيلات",null,null,null,null,null,null,null,"سداد مورد",null,null,null,null,null,null,null,null,null,"حركة سداد",null,null,null,"shet",null,"مبيعات","مخزن الدلتا",null,null,"تاريخ","شركة  أبوفارس رمضان ",null,null,null,"اسم الصنف ",null,null,null,null,null,null,null,null,null,null,null,null,null,null,null,null,"مليم"]
[null,null,null,null,null,null,null,{"$f":"SUMIFS(Sheet1!$H$4:$H$1497,Sheet1!$F$4:$F$1497,B5,Sheet1!$Z$4:$Z$1497,$H$3)","v":0},{"$f":"SUMIFS(Sheet1!$J$4:$J$1497,Sheet1!$F$4:$F$1497,B5,Sheet1!$Z$4:$Z$1497,$H$3)","v":0},{"$f":"SUMIFS(Sheet1!$H$4:$H$1497,Sheet1!$F$4:$F$1497,B5,Sheet1!$Z$4:$Z$1497,$J$3)","v":0},{"$f":"D4+H4+I4-J4","v":0},1020,{"$f":"IF(L4<>\"\",IF(L4>=K4,\"مطلوب\",\"\"),\"\")","v":"مطلوب"},{"$f":"IFERROR(IF(B4<>0,SUMIFS(Sheet1!$L$4:$L$997,Sheet1!$F$4:$F$997,B4,Sheet1!$Z$4:$Z$997,$H$3)+F4/SUMIFS(Sheet1!$H$4:$H$997,Sheet1!$F$4:$F$997,B4,Sheet1!$Z$4:$Z$997,$H$3)+D4,0),\"\")","v":0},{"$f":"IFERROR(SUMPRODUCT(K4*N4),\"\")","v":0},0.5,null,null,null,null,null,null,null,null,null,null,null,null,null,{"$f":"SUMIF($BP$4:$BP$100,AA4,$BQ$4:$BQ$100)","v":0},{"$f":"SUMIF(Sheet1!$D$3:$D$97,AA4,Sheet1!$M$3:$M$97)","v":0},{"$f":"IF(AB4+AD4>AC4+AE4,(AB4+AD4)-(AC4+AE4),\"\")","v":""},{"$f":"IF(AC4+AE4>AB4+AD4,(AC4+AE4)-(AB4+AD4),\"\")","v":""},null,null,null,null,null,null,{"$f":"SUMIF(Sheet1!$T$4:$T$300,AK4,Sheet1!$L$4:$L$300)","v":0},{"$f":"SUMIF($AZ$3:$AZ$200,AK4,$BA$3:$BA$200)","v":0},{"$f":"IF(AL4+AN4>AM4+AO4,(AL4+AN4)-(AM4+AO4),\"\")","v":""},{"$f":"IF(AM4+AO4>AL4+AN4,(AM4+AO4)-(AL4+AN4),\"\")","v":""},null,null,null,null,null,null,null,null,null,null,null,null,null,null,null,null,null,null,null,null,null,null,null,null,null,null,"سداد مورد",null,null,null,null,null,null,null,null,null,{"$f":"CF1","v":"سندات قبض"},20001,null,"سندات قبض","Sheet1",null,"مشتريات","مخزن الحوامدية",null,null,"رقم الفاتورة",null,null,null,null," المخزن- المخصص"]
[null,null,null,null,null,null,null,{"$f":"SUMIFS(Sheet1!$H$4:$H$1497,Sheet1!$F$4:$F$1497,B6,Sheet1!$Z$4:$Z$1497,$H$3)","v":0},{"$f":"SUMIFS(Sheet1!$J$4:$J$15,Sheet1!$F$4:$F$15,B6,Sheet1!$Z$4:$Z$15,$H$3)","v":0},{"$f":"SUMIFS(Sheet1!$H$4:$H$1497,Sheet1!$F$4:$F$1497,B6,Sheet1!$Z$4:$Z$1497,$J$3)","v":0},0,21,{"$f":"IF(L5<>\"\",IF(L5>=K5,\"مطلوب\",\"\"),\"\")","v":"مطلوب"},{"$f":"IFERROR(IF(B5<>0,SUMIFS(Sheet1!$L$4:$L$997,Sheet1!$F$4:$F$997,B5,Sheet1!$Z$4:$Z$997,$H$3)+F5/SUMIFS(Sheet1!$H$4:$H$997,Sheet1!$F$4:$F$997,B5,Sheet1!$Z$4:$Z$997,$H$3)+D5,0),\"\")","v":0},{"$f":"IFERROR(SUMPRODUCT(K5*N5),\"\")","v":0},1.5,null,null,null,null,null,null,null,null,null,null,null,null,null,{"$f":"SUMIF($BP$4:$BP$100,AA5,$BQ$4:$BQ$100)","v":0},{"$f":"SUMIF(Sheet1!$D$3:$D$97,AA5,Sheet1!$M$3:$M$97)","v":0},{"$f":"IF(AB5+AD5>AC5+AE5,(AB5+AD5)-(AC5+AE5),\"\")","v":""},{"$f":"IF(AC5+AE5>AB5+AD5,(AC5+AE5)-(AB5+AD5),\"\")","v":""},null,null,null,null,null,null,{"$f":"SUMIF(Sheet1!$T$4:$T$300,AK5,Sheet1!$L$4:$L$300)","v":0},{"$f":"SUMIF($AZ$3:$AZ$200,AK5,$BA$3:$BA$200)","v":0},{"$f":"IF(AL5+AN5>AM5+AO5,(AL5+AN5)-(AM5+AO5),\"\")","v":""},{"$f":"IF(AM5+AO5>AL5+AN5,(AM5+AO5)-(AL5+AN5),\"\")","v":""},null,null,null,null,null,null,null,null,null,null,null,null,null,null,null,null,null,null,null,null,null,null,null,null,null,null,null,null,null,null,null,null,null,null,null,null,{"$f":"CG1","v":"سداد مورد"},1500,null,"سندات صرف","Sheet2",null,"مرتجعات","مخزن تجزئة",null,null,"كود المورد",null,null,null,null,"مشتريات"]
[null,null,null,null,null,null,null,{"$f":"SUMIFS(Sheet1!$H$4:$H$1497,Sheet1!$F$4:$F$1497,B7,Sheet1!$Z$4:$Z$1497,$H$3)","v":0},{"$f":"SUMIFS(Sheet1!$J$4:$J$15,Sheet1!$F$4:$F$15,B7,Sheet1!$Z$4:$Z$15,$H$3)","v":0},{"$f":"SUMIFS(Sheet1!$H$4:$H$1497,Sheet1!$F$4:$F$1497,B7,Sheet1!$Z$4:$Z$1497,$J$3)","v":0},0,22,"مطلوب",{"$f":"IFERROR(IF(B6<\"\",SUMIFS(Sheet1!$L$4:$L$997,Sheet1!$F$4:$F$997,B6,Sheet1!$Z$4:$Z$997,$H$3)+F6/SUMIFS(Sheet1!$H$4:$H$997,Sheet1!$F$4:$F$997,B6,Sheet1!$Z$4:$Z$997,$H$3),F6/D6),\"\")","v":""},"",2.5,null,null,null,null,null,null,null,null,null,null,null,null,null,{"$f":"SUMIF($BP$4:$BP$100,AA6,$BQ$4:$BQ$100)","v":0},{"$f":"SUMIF(Sheet1!$D$3:$D$97,AA6,Sheet1!$M$3:$M$97)","v":0},"","",null,null,null,null,null,null,{"$f":"SUMIF(Sheet1!$T$4:$T$300,AK6,Sheet1!$L$4:$L$300)","v":0},0,"","",null,null,null,null,null,null,null,null,null,null,null,null,null,null,null,null,null,null,null,null,null,null,null,null,null,null,null,null,null,null,null,null,null,null,null,null,null,null,null,null,"Sheet3",null,null,"مخزن  جملة",null,null,"أسم المورد",null,null,null,null,"عروض"]
[null,null,null,null,null,null,null,{"$f":"SUMIFS(Sheet1!$H$4:$H$1497,Sheet1!$F$4:$F$1497,B8,Sheet1!$Z$4:$Z$1497,$H$3)","v":0},{"$f":"SUMIFS(Sheet1!$J$4:$J$15,Sheet1!$F$4:$F$15,B8,Sheet1!$Z$4:$Z$15,$H$3)","v":0},{"$f":"SUMIFS(Sheet1!$H$4:$H$1497,Sheet1!$F$4:$F$1497,B8,Sheet1!$Z$4:$Z$1497,$J$3)","v":0},0,null,"",{"$f":"IFERROR(IF(B7<\"\",SUMIFS(Sheet1!$L$4:$L$997,Sheet1!$F$4:$F$997,B7,Sheet1!$Z$4:$Z$997,$H$3)+F7/SUMIFS(Sheet1!$H$4:$H$997,Sheet1!$F$4:$F$997,B7,Sheet1!$Z$4:$Z$997,$H$3),F7/D7),\"\")","v":""},"",3.5,null,null,null,null,null,null,null,null,null,null,null,null,null,0,{"$f":"SUMIF(Sheet1!$D$3:$D$97,AA7,Sheet1!$M$3:$M$97)","v":0},"","",null,null,null,null,null,null,{"$f":"SUMIF(Sheet1!$T$4:$T$300,AK7,Sheet1!$L$4:$L$300)","v":0},0,"","",null,null,null,null,null,null,null,null,null,null,null,null,null,null,null,null,null,null,null,null,null,null,null,null,null,null,null,null,null,null,null,null,null,null,null,null,null,null,null,null,"Sheet4",null,null,"مخزن جملة العروض",null,null,"كود الصنف",null,null,null,null,"مباع"]
[null,null,null,null,null,null,null,{"$f":"SUMIFS(Sheet1!$H$4:$H$1497,Sheet1!$F$4:$F$1497,B9,Sheet1!$Z$4:$Z$1497,$H$3)","v":0},{"$f":"SUMIFS(Sheet1!$J$4:$J$15,Sheet1!$F$4:$F$15,B9,Sheet1!$Z$4:$Z$15,$H$3)","v":0},{"$f":"SUMIFS(Sheet1!$H$4:$H$1497,Sheet1!$F$4:$F$1497,B9,Sheet1!$Z$4:$Z$1497,$J$3)","v":0},0,20,"مطلوب",{"$f":"IFERROR(IF(B8<\"\",SUMIFS(Sheet1!$L$4:$L$997,Sheet1!$F$4:$F$997,B8,Sheet1!$Z$4:$Z$997,$H$3)+F8/SUMIFS(Sheet1!$H$4:$H$997,Sheet1!$F$4:$F$997,B8,Sheet1!$Z$4:$Z$997,$H$3),F8/D8),\"\")","v":""},"",4.5,null,null,null,null,null,null,null,null,null,null,null,null,null,0,{"$f":"SUMIF(Sheet1!$D$3:$D$97,AA8,Sheet1!$M$3:$M$97)","v":0},"","",null,null,null,null,null,null,{"$f":"SUMIF(Sheet1!$T$4:$T$300,AK8,Sheet1!$L$4:$L$300)","v":0},0,"","",null,null,null,null,null,null,null,null,null,null,null,null,null,null,null,null,null,null,null,null,null,null,null,null,null,null,null,null,null,null,null,null,null,null,null,null,null,null,null,null,"Sheet5",null,null,"مخزن تجزئة العروض وهدايا",null,null,"أسم الصنف"]
[null,null,null,null,null,null,null,{"$f":"SUMIFS(Sheet1!$H$4:$H$1497,Sheet1!$F$4:$F$1497,B10,Sheet1!$Z$4:$Z$1497,$H$3)","v":0},{"$f":"SUMIFS(Sheet1!$J$4:$J$15,Sheet1!$F$4:$F$15,B10,Sheet1!$Z$4:$Z$15,$H$3)","v":0},{"$f":"SUMIFS(Sheet1!$H$4:$H$1497,Sheet1!$F$4:$F$1497,B10,Sheet1!$Z$4:$Z$1497,$J$3)","v":0},0,10,"مطلوب",{"$f":"IFERROR(IF(B9<\"\",SUMIFS(Sheet1!$L$4:$L$997,Sheet1!$F$4:$F$997,B9,Sheet1!$Z$4:$Z$997,$H$3)+F9/SUMIFS(Sheet1!$H$4:$H$997,Sheet1!$F$4:$F$997,B9,Sheet1!$Z$4:$Z$997,$H$3),F9/D9),\"\")","v":""},"",5.5,null,null,null,null,null,null,null,null,null,null,null,null,null,0,{"$f":"SUMIF(Sheet1!$D$3:$D$97,AA9,Sheet1!$M$3:$M$97)","v":0},"","",null,null,null,null,null,null,{"$f":"SUMIF(Sheet1!$T$4:$T$300,AK9,Sheet1!$L$4:$L$300)","v":0},0,"","",null,null,null,null,null,null,null,null,null,null,null,null,null,null,null,null,null,null,null,null,null,null,null,null,null,null,null,null,null,null,null,null,null,null,null,null,null,null,null,null,null,null,null,"مخزن الهالك",null,null,"كود المندوب"]
[null,null,null,null,null,null,null,{"$f":"SUMIFS(Sheet1!$H$4:$H$1497,Sheet1!$F$4:$F$1497,B11,Sheet1!$Z$4:$Z$1497,$H$3)","v":0},{"$f":"SUMIFS(Sheet1!$J$4:$J$15,Sheet1!$F$4:$F$15,B11,Sheet1!$Z$4:$Z$15,$H$3)","v":0},{"$f":"SUMIFS(Sheet1!$H$4:$H$1497,Sheet1!$F$4:$F$1497,B11,Sheet1!$Z$4:$Z$1497,$J$3)","v":0},0,40,"مطلوب",{"$f":"IFERROR(IF(B10<\"\",SUMIFS(Sheet1!$L$4:$L$997,Sheet1!$F$4:$F$997,B10,Sheet1!$Z$4:$Z$997,$H$3)+F10/SUMIFS(Sheet1!$H$4:$H$997,Sheet1!$F$4:$F$997,B10,Sheet1!$Z$4:$Z$997,$H$3),F10/D10),\"\")","v":""},"",6.5,17,null,null,null,null,null,null,null,25,null,null,null,null,0,{"$f":"SUMIF(Sheet1!$D$3:$D$97,AA10,Sheet1!$M$3:$M$97)","v":0},"","",34,35,null,null,null,null,{"$f":"SUMIF(Sheet1!$T$4:$T$300,AK10,Sheet1!$L$4:$L$300)","v":0},0,"","",null,45,null,null,null,null,null,null,null,null,54,null,null,null,null,null,null,null,null,63,null,null,null,null,null,null,null,null,null,null,null,null,null,null,null,null,null,null,null,null,null,null,null,null,null,null,"اسم المندوب"]
[null,null,null,null,null,null,null,{"$f":"SUMIFS(Sheet1!$H$4:$H$1497,Sheet1!$F$4:$F$1497,B12,Sheet1!$Z$4:$Z$1497,$H$3)","v":0},{"$f":"SUMIFS(Sheet1!$J$4:$J$15,Sheet1!$F$4:$F$15,B12,Sheet1!$Z$4:$Z$15,$H$3)","v":0},{"$f":"SUMIFS(Sheet1!$H$4:$H$1497,Sheet1!$F$4:$F$1497,B12,Sheet1!$Z$4:$Z$1497,$J$3)","v":0},0,50,"مطلوب",{"$f":"IFERROR(IF(B11<\"\",SUMIFS(Sheet1!$L$4:$L$997,Sheet1!$F$4:$F$997,B11,Sheet1!$Z$4:$Z$997,$H$3)+F11/SUMIFS(Sheet1!$H$4:$H$997,Sheet1!$F$4:$F$997,B11,Sheet1!$Z$4:$Z$997,$H$3),F11/D11),\"\")","v":""},"",7.5,null,null,null,null,null,null,null,null,null,null,null,null,null,0,{"$f":"SUMIF(Sheet1!$D$3:$D$97,AA11,Sheet1!$M$3:$M$97)","v":0},"","",null,null,null,null,null,null,{"$f":"SUMIF(Sheet1!$T$4:$T$300,AK11,Sheet1!$L$4:$L$300)","v":0},0,"","",null,null,null,null,null,null,null,null,null,null,null,null,null,null,null,null,null,null,null,null,null,null,null,null,null,null,null,null,null,null,null,null,null,null,null,null,null,null,null,null,null,null,null,null,null,null,"كود العميل"]
[null,null,null,null,null,null,null,null,null,{"$f":"SUMIFS(Sheet1!$H$4:$H$1497,Sheet1!$F$4:$F$1497,B13,Sheet1!$Z$4:$Z$1497,$J$3)","v":0},null,null,"",{"$f":"IFERROR(IF(B12<\"\",SUMIFS(Sheet1!$L$4:$L$997,Sheet1!$F$4:$F$997,B12,Sheet1!$Z$4:$Z$997,$H$3)+F12/SUMIFS(Sheet1!$H$4:$H$997,Sheet1!$F$4:$F$997,B12,Sheet1!$Z$4:$Z$997,$H$3),F12/D12),\"\")","v":""},"",null,null,null,null,null,null,null,null,null,null,null,null,null,null,null,{"$f":"SUMIF(Sheet1!$D$3:$D$97,AA12,Sheet1!$M$3:$M$97)","v":0},null,null,null,null,null,null,null,null,{"$f":"SUMIF(Sheet1!$T$4:$T$300,AK12,Sheet1!$L$4:$L$300)","v":0},0,"",""]
[null,null,null,null,null,null,null,{"$f":"SUMIFS(Sheet1!$H$4:$H$1497,Sheet1!$F$4:$F$1497,B14,Sheet1!$Z$4:$Z$1497,$H$3)","v":0},{"$f":"SUMIFS(Sheet1!$J$4:$J$15,Sheet1!$F$4:$F$15,B14,Sheet1!$Z$4:$Z$15,$H$3)","v":0},{"$f":"SUMIFS(Sheet1!$H$4:$H$1497,Sheet1!$F$4:$F$1497,B14,Sheet1!$Z$4:$Z$1497,$J$3)","v":0},0,null,"",{"$f":"IFERROR(IF(B13<\"\",SUMIFS(Sheet1!$L$4:$L$997,Sheet1!$F$4:$F$997,B13,Sheet1!$Z$4:$Z$997,$H$3)+F13/SUMIFS(Sheet1!$H$4:$H$997,Sheet1!$F$4:$F$997,B13,Sheet1!$Z$4:$Z$997,$H$3),F13/D13),\"\")","v":""},"",null,null,null,null,null,null,null,null,null,null,null,null,null,null,0,{"$f":"SUMIF(Sheet1!$D$3:$D$97,AA13,Sheet1!$M$3:$M$97)","v":0},"","",null,null,null,null,null,null,{"$f":"SUMIF(Sheet1!$T$4:$T$300,AK13,Sheet1!$L$4:$L$300)","v":0},0,"","",null,null,null,null,null,null,null,null,null,null,null,null,null,null,null,null,null,null,null,null,null,null,null,null,null,null,null,null,null,null,null,null,null,null,null,null,null,null,null,null,null,null,null,null,null,null,"نوع الفاتورة"]
[null,null,null,null,null,null,null,{"$f":"SUMIFS(Sheet1!$H$4:$H$1497,Sheet1!$F$4:$F$1497,B15,Sheet1!$Z$4:$Z$1497,$H$3)","v":0},{"$f":"SUMIFS(Sheet1!$J$4:$J$15,Sheet1!$F$4:$F$15,B15,Sheet1!$Z$4:$Z$15,$H$3)","v":0},{"$f":"SUMIFS(Sheet1!$H$4:$H$1497,Sheet1!$F$4:$F$1497,B15,Sheet1!$Z$4:$Z$1497,$J$3)","v":0},0,null,"",{"$f":"IFERROR(IF(B14<\"\",SUMIFS(Sheet1!$L$4:$L$997,Sheet1!$F$4:$F$997,B14,Sheet1!$Z$4:$Z$997,$H$3)+F14/SUMIFS(Sheet1!$H$4:$H$997,Sheet1!$F$4:$F$997,B14,Sheet1!$Z$4:$Z$997,$H$3),F14/D14),\"\")","v":""},"",null,null,null,null,null,null,null,null,null,null,null,null,null,null,0,{"$f":"SUMIF(Sheet1!$D$3:$D$97,AA14,Sheet1!$M$3:$M$97)","v":0},"","",null,null,null,null,null,null,{"$f":"SUMIF(Sheet1!$T$4:$T$300,AK14,Sheet1!$L$4:$L$300)","v":0},0,"","",null,null,null,null,null,null,null,null,null,null,null,null,null,null,null,null,null,null,null,null,null,null,null,null,null,null,null,null,null,null,null,null,null,null,null,null,null,null,null,null,null,null,null,null,null,null,"مخزن مخصص"]
[null,null,null,null,null,null,null,{"$f":"SUMIFS(Sheet1!$H$4:$H$1497,Sheet1!$F$4:$F$1497,B16,Sheet1!$Z$4:$Z$1497,$H$3)","v":0},{"$f":"SUMIFS(Sheet1!$J$4:$J$15,Sheet1!$F$4:$F$15,B16,Sheet1!$Z$4:$Z$15,$H$3)","v":0},{"$f":"SUMIFS(Sheet1!$H$4:$H$1497,Sheet1!$F$4:$F$1497,B16,Sheet1!$Z$4:$Z$1497,$J$3)","v":0},0,null,"",{"$f":"IFERROR(IF(B15<\"\",SUMIFS(Sheet1!$L$4:$L$997,Sheet1!$F$4:$F$997,B15,Sheet1!$Z$4:$Z$997,$H$3)+F15/SUMIFS(Sheet1!$H$4:$H$997,Sheet1!$F$4:$F$997,B15,Sheet1!$Z$4:$Z$997,$H$3),F15/D15),\"\")","v":""},"",null,null,null,null,null,null,null,null,null,null,null,null,null,null,0,{"$f":"SUMIF(Sheet1!$D$3:$D$97,AA15,Sheet1!$M$3:$M$97)","v":0},"","",null,null,null,null,null,null,{"$f":"SUMIF(Sheet1!$T$4:$T$300,AK15,Sheet1!$L$4:$L$300)","v":0},0,"","",null,null,null,null,null,null,null,null,null,null,null,null,null,null,null,{"$f":"SUMIF(Sheet1!$R$3:$R$97,BD15,Sheet1!$M$5:$M$97)","v":0},{"$f":"SUMIF($BD$2:$BD$100,AX15,$BA$2:$BA$100)","v":0},{"$f":"IF(BE15+BG15>BF15+BH15,(BE15+BG15)-(BF15+BH15),\"\")","v":""},{"$f":"IF(BF15+BH15>BE15+BG15,(BF15+BH15)-(BE15+BG15),\"\")","v":""}]
[null,null,null,null,null,null,null,{"$f":"SUMIFS(Sheet1!$H$4:$H$1497,Sheet1!$F$4:$F$1497,B17,Sheet1!$Z$4:$Z$1497,$H$3)","v":0},{"$f":"SUMIFS(Sheet1!$J$4:$J$15,Sheet1!$F$4:$F$15,B17,Sheet1!$Z$4:$Z$15,$H$3)","v":0},{"$f":"SUMIFS(Sheet1!$H$4:$H$1497,Sheet1!$F$4:$F$1497,B17,Sheet1!$Z$4:$Z$1497,$J$3)","v":0},0,null,"",{"$f":"IFERROR(IF(B16<\"\",SUMIFS(Sheet1!$L$4:$L$997,Sheet1!$F$4:$F$997,B16,Sheet1!$Z$4:$Z$997,$H$3)+F16/SUMIFS(Sheet1!$H$4:$H$997,Sheet1!$F$4:$F$997,B16,Sheet1!$Z$4:$Z$997,$H$3),F16/D16),\"\")","v":""},"",null,null,null,null,null,null,null,null,null,null,null,null,null,null,null,null,null,null,null,null,null,null,null,null,{"$f":"SUMIF(Sheet1!$T$4:$T$300,AK16,Sheet1!$L$4:$L$300)","v":0},{"$f":"SUMIF($AZ$3:$AZ$200,AK16,$BA$3:$BA$200)","v":0},{"$f":"IF(AL16+AN16>AM16+AO16,(AL16+AN16)-(AM16+AO16),\"\")","v":""},{"$f":"IF(AM16+AO16>AL16+AN16,(AM16+AO16)-(AL16+AN16),\"\")","v":""},null,null,null,null,null,null,null,null,null,null,null,null,null,null,null,{"$f":"SUMIF(Sheet1!$R$3:$R$97,BD16,Sheet1!$M$5:$M$97)","v":0},0,"","",null,null,null,null,null,null,null,null,null,null,null,null,null,null,null,null,null,null,null,null,null,"سندات قبض"]
[null,null,null,null,null,null,null,{"$f":"SUMIFS(Sheet1!$H$4:$H$1497,Sheet1!$F$4:$F$1497,B18,Sheet1!$Z$4:$Z$1497,$H$3)","v":0},{"$f":"SUMIFS(Sheet1!$J$4:$J$15,Sheet1!$F$4:$F$15,B18,Sheet1!$Z$4:$Z$15,$H$3)","v":0},{"$f":"SUMIFS(Sheet1!$H$4:$H$1497,Sheet1!$F$4:$F$1497,B18,Sheet1!$Z$4:$Z$1497,$J$3)","v":0},0,null,"",{"$f":"IFERROR(IF(B17<\"\",SUMIFS(Sheet1!$L$4:$L$997,Sheet1!$F$4:$F$997,B17,Sheet1!$Z$4:$Z$997,$H$3)+F17/SUMIFS(Sheet1!$H$4:$H$997,Sheet1!$F$4:$F$997,B17,Sheet1!$Z$4:$Z$997,$H$3),F17/D17),\"\")","v":""},"",null,null,null,null,null,null,null,null,null,null,null,null,null,null,null,null,null,null,null,null,null,null,null,null,null,null,null,null,null,null,null,null,null,null,null,null,null,null,null,null,null,null,null,{"$f":"SUMIF(Sheet1!$R$3:$R$97,BD17,Sheet1!$M$5:$M$97)","v":0},0,"",""]
[null,null,null,null,null,null,null,{"$f":"SUMIFS(Sheet1!$H$4:$H$1497,Sheet1!$F$4:$F$1497,B19,Sheet1!$Z$4:$Z$1497,$H$3)","v":0},{"$f":"SUMIFS(Sheet1!$J$4:$J$15,Sheet1!$F$4:$F$15,B19,Sheet1!$Z$4:$Z$15,$H$3)","v":0},{"$f":"SUMIFS(Sheet1!$H$4:$H$1497,Sheet1!$F$4:$F$1497,B19,Sheet1!$Z$4:$Z$1497,$J$3)","v":0},0,null,"",{"$f":"IFERROR(IF(B18<\"\",SUMIFS(Sheet1!$L$4:$L$997,Sheet1!$F$4:$F$997,B18,Sheet1!$Z$4:$Z$997,$H$3)+F18/SUMIFS(Sheet1!$H$4:$H$997,Sheet1!$F$4:$F$997,B18,Sheet1!$Z$4:$Z$997,$H$3),F18/D18),\"\")","v":""},"",null,null,null,null,null,null,null,null,null,null,null,null,null,null,null,null,null,null,null,null,null,null,null,null,null,null,null,null,null,null,null,null,null,null,null,null,null,null,null,null,null,null,null,{"$f":"SUMIF(Sheet1!$R$3:$R$97,BD18,Sheet1!$M$5:$M$97)","v":0},0,"",""]
[null,null,null,null,null,null,null,{"$f":"SUMIFS(Sheet1!$H$4:$H$1497,Sheet1!$F$4:$F$1497,B20,Sheet1!$Z$4:$Z$1497,$H$3)","v":0},{"$f":"SUMIFS(Sheet1!$J$4:$J$15,Sheet1!$F$4:$F$15,B20,Sheet1!$Z$4:$Z$15,$H$3)","v":0},{"$f":"SUMIFS(Sheet1!$H$4:$H$1497,Sheet1!$F$4:$F$1497,B20,Sheet1!$Z$4:$Z$1497,$J$3)","v":0},0,null,"",{"$f":"IFERROR(IF(B19<\"\",SUMIFS(Sheet1!$L$4:$L$997,Sheet1!$F$4:$F$997,B19,Sheet1!$Z$4:$Z$997,$H$3)+F19/SUMIFS(Sheet1!$H$4:$H$997,Sheet1!$F$4:$F$997,B19,Sheet1!$Z$4:$Z$997,$H$3),F19/D19),\"\")","v":""},"",null,null,null,null,null,null,null,null,null,null,null,null,null,null,null,null,null,null,null,null,null,null,null,null,null,null,null,null,null,null,null,null,null,null,null,null,null,null,null,null,null,null,null,{"$f":"SUMIF(Sheet1!$R$3:$R$97,BD19,Sheet1!$M$5:$M$97)","v":0},0,"",""]
[null,null,null,null,null,null,null,{"$f":"SUMIFS(Sheet1!$H$4:$H$1497,Sheet1!$F$4:$F$1497,B21,Sheet1!$Z$4:$Z$1497,$H$3)","v":0},{"$f":"SUMIFS(Sheet1!$J$4:$J$15,Sheet1!$F$4:$F$15,B21,Sheet1!$Z$4:$Z$15,$H$3)","v":0},{"$f":"SUMIFS(Sheet1!$H$4:$H$1497,Sheet1!$F$4:$F$1497,B21,Sheet1!$Z$4:$Z$1497,$J$3)","v":0},0,null,"",{"$f":"IFERROR(IF(B20<\"\",SUMIFS(Sheet1!$L$4:$L$997,Sheet1!$F$4:$F$997,B20,Sheet1!$Z$4:$Z$997,$H$3)+F20/SUMIFS(Sheet1!$H$4:$H$997,Sheet1!$F$4:$F$997,B20,Sheet1!$Z$4:$Z$997,$H$3),F20/D20),\"\")","v":""},"",null,null,null,null,null,null,null,null,null,null,null,null,null,null,null,null,null,null,null,null,null,null,null,null,null,null,null,null,null,null,null,null,null,null,null,null,null,null,null,null,null,null,null,{"$f":"SUMIF(Sheet1!$R$3:$R$97,BD20,Sheet1!$M$5:$M$97)","v":0},0,"",""]
[null,null,null,null,null,null,null,{"$f":"SUMIFS(Sheet1!$H$4:$H$1497,Sheet1!$F$4:$F$1497,B22,Sheet1!$Z$4:$Z$1497,$H$3)","v":0},{"$f":"SUMIFS(Sheet1!$J$4:$J$15,Sheet1!$F$4:$F$15,B22,Sheet1!$Z$4:$Z$15,$H$3)","v":0},{"$f":"SUMIFS(Sheet1!$H$4:$H$1497,Sheet1!$F$4:$F$1497,B22,Sheet1!$Z$4:$Z$1497,$J$3)","v":0},0,null,"",{"$f":"IFERROR(IF(B21<\"\",SUMIFS(Sheet1!$L$4:$L$997,Sheet1!$F$4:$F$997,B21,Sheet1!$Z$4:$Z$997,$H$3)+F21/SUMIFS(Sheet1!$H$4:$H$997,Sheet1!$F$4:$F$997,B21,Sheet1!$Z$4:$Z$997,$H$3),F21/D21),\"\")","v":""},"",null,null,null,null,null,null,null,null,null,null,null,null,null,null,null,null,null,null,null,null,null,null,null,null,null,null,null,null,null,null,null,null,null,null,null,null,null,null,null,null,null,null,null,{"$f":"SUMIF(Sheet1!$R$3:$R$97,BD21,Sheet1!$M$5:$M$97)","v":0},0,"",""]
[null,null,null,null,null,null,null,{"$f":"SUMIFS(Sheet1!$H$4:$H$1497,Sheet1!$F$4:$F$1497,B23,Sheet1!$Z$4:$Z$1497,$H$3)","v":0},{"$f":"SUMIFS(Sheet1!$J$4:$J$15,Sheet1!$F$4:$F$15,B23,Sheet1!$Z$4:$Z$15,$H$3)","v":0},{"$f":"SUMIFS(Sheet1!$H$4:$H$1497,Sheet1!$F$4:$F$1497,B23,Sheet1!$Z$4:$Z$1497,$J$3)","v":0},null,null,"",{"$f":"IFERROR(IF(B22<\"\",SUMIFS(Sheet1!$L$4:$L$997,Sheet1!$F$4:$F$997,B22,Sheet1!$Z$4:$Z$997,$H$3)+F22/SUMIFS(Sheet1!$H$4:$H$997,Sheet1!$F$4:$F$997,B22,Sheet1!$Z$4:$Z$997,$H$3),F22/D22),\"\")","v":""},"",null,null,null,null,null,null,null,null,null,null,null,null,null,null,null,null,null,null,null,null,null,null,null,null,null,null,null,null,null,null,null,null,null,null,null,null,null,null,null,null,null,null,null,{"$f":"SUMIF(Sheet1!$R$3:$R$97,BD22,Sheet1!$M$5:$M$97)","v":0},0,"",""]
[null,null,null,null,null,null,null,{"$f":"SUMIFS(Sheet1!$H$4:$H$1497,Sheet1!$F$4:$F$1497,B24,Sheet1!$Z$4:$Z$1497,$H$3)","v":0},{"$f":"SUMIFS(Sheet1!$J$4:$J$15,Sheet1!$F$4:$F$15,B24,Sheet1!$Z$4:$Z$15,$H$3)","v":0},{"$f":"SUMIFS(Sheet1!$H$4:$H$1497,Sheet1!$F$4:$F$1497,B24,Sheet1!$Z$4:$Z$1497,$J$3)","v":0},null,null,"",{"$f":"IFERROR(IF(B23<\"\",SUMIFS(Sheet1!$L$4:$L$997,Sheet1!$F$4:$F$997,B23,Sheet1!$Z$4:$Z$997,$H$3)+F23/SUMIFS(Sheet1!$H$4:$H$997,Sheet1!$F$4:$F$997,B23,Sheet1!$Z$4:$Z$997,$H$3),F23/D23),\"\")","v":""},"",null,null,null,null,null,null,null,null,null,null,null,null,null,null,null,null,null,null,null,null,null,null,null,null,null,null,null,null,null,null,null,null,null,null,null,null,null,null,null,null,null,null,null,{"$f":"SUMIF(Sheet1!$R$3:$R$97,BD23,Sheet1!$M$5:$M$97)","v":0},0,"",""]
[null,null,null,null,null,null,null,{"$f":"SUMIFS(Sheet1!$H$4:$H$1497,Sheet1!$F$4:$F$1497,B25,Sheet1!$Z$4:$Z$1497,$H$3)","v":0},{"$f":"SUMIFS(Sheet1!$J$4:$J$15,Sheet1!$F$4:$F$15,B25,Sheet1!$Z$4:$Z$15,$H$3)","v":0},{"$f":"SUMIFS(Sheet1!$H$4:$H$1497,Sheet1!$F$4:$F$1497,B25,Sheet1!$Z$4:$Z$1497,$J$3)","v":0},null,null,"",{"$f":"IFERROR(IF(B24<\"\",SUMIFS(Sheet1!$L$4:$L$997,Sheet1!$F$4:$F$997,B24,Sheet1!$Z$4:$Z$997,$H$3)+F24/SUMIFS(Sheet1!$H$4:$H$997,Sheet1!$F$4:$F$997,B24,Sheet1!$Z$4:$Z$997,$H$3),F24/D24),\"\")","v":""},"",null,null,null,null,null,null,null,null,null,null,null,null,null,null,null,null,null,null,null,null,null,null,null,null,null,null,null,null,null,null,null,null,null,null,null,null,null,null,null,null,null,null,null,{"$f":"SUMIF(Sheet1!$R$3:$R$97,BD24,Sheet1!$M$5:$M$97)","v":0},0,"",""]
[null,null,null,null,null,null,null,{"$f":"SUMIFS(Sheet1!$H$4:$H$1497,Sheet1!$F$4:$F$1497,B26,Sheet1!$Z$4:$Z$1497,$H$3)","v":0},{"$f":"SUMIFS(Sheet1!$J$4:$J$15,Sheet1!$F$4:$F$15,B26,Sheet1!$Z$4:$Z$15,$H$3)","v":0},{"$f":"SUMIFS(Sheet1!$H$4:$H$1497,Sheet1!$F$4:$F$1497,B26,Sheet1!$Z$4:$Z$1497,$J$3)","v":0},null,null,"",{"$f":"IFERROR(IF(B25<\"\",SUMIFS(Sheet1!$L$4:$L$997,Sheet1!$F$4:$F$997,B25,Sheet1!$Z$4:$Z$997,$H$3)+F25/SUMIFS(Sheet1!$H$4:$H$997,Sheet1!$F$4:$F$997,B25,Sheet1!$Z$4:$Z$997,$H$3),F25/D25),\"\")","v":""},"",null,null,null,null,null,null,null,null,null,null,null,null,null,null,null,null,null,null,null,null,null,null,null,null,null,null,null,null,null,null,null,null,null,null,null,null,null,null,null,null,null,null,null,{"$f":"SUMIF(Sheet1!$R$3:$R$97,BD25,Sheet1!$M$5:$M$97)","v":0},0,"",""]
[null,null,null,null,null,null,null,{"$f":"SUMIFS(Sheet1!$H$4:$H$1497,Sheet1!$F$4:$F$1497,B27,Sheet1!$Z$4:$Z$1497,$H$3)","v":0},{"$f":"SUMIFS(Sheet1!$J$4:$J$15,Sheet1!$F$4:$F$15,B27,Sheet1!$Z$4:$Z$15,$H$3)","v":0},{"$f":"SUMIFS(Sheet1!$H$4:$H$1497,Sheet1!$F$4:$F$1497,B27,Sheet1!$Z$4:$Z$1497,$J$3)","v":0},null,null,"",{"$f":"IFERROR(IF(B26<\"\",SUMIFS(Sheet1!$L$4:$L$997,Sheet1!$F$4:$F$997,B26,Sheet1!$Z$4:$Z$997,$H$3)+F26/SUMIFS(Sheet1!$H$4:$H$997,Sheet1!$F$4:$F$997,B26,Sheet1!$Z$4:$Z$997,$H$3),F26/D26),\"\")","v":""},""]
[null,null,null,null,null,null,null,{"$f":"SUMIFS(Sheet1!$H$4:$H$1497,Sheet1!$F$4:$F$1497,B28,Sheet1!$Z$4:$Z$1497,$H$3)","v":0},{"$f":"SUMIFS(Sheet1!$J$4:$J$15,Sheet1!$F$4:$F$15,B28,Sheet1!$Z$4:$Z$15,$H$3)","v":0},{"$f":"SUMIFS(Sheet1!$H$4:$H$1497,Sheet1!$F$4:$F$1497,B28,Sheet1!$Z$4:$Z$1497,$J$3)","v":0},null,null,"",{"$f":"IFERROR(IF(B27<\"\",SUMIFS(Sheet1!$L$4:$L$997,Sheet1!$F$4:$F$997,B27,Sheet1!$Z$4:$Z$997,$H$3)+F27/SUMIFS(Sheet1!$H$4:$H$997,Sheet1!$F$4:$F$997,B27,Sheet1!$Z$4:$Z$997,$H$3),F27/D27),\"\")","v":""},""]
[null,null,null,null,null,null,null,{"$f":"SUMIFS(Sheet1!$H$4:$H$1497,Sheet1!$F$4:$F$1497,B29,Sheet1!$Z$4:$Z$1497,$H$3)","v":0},{"$f":"SUMIFS(Sheet1!$J$4:$J$15,Sheet1!$F$4:$F$15,B29,Sheet1!$Z$4:$Z$15,$H$3)","v":0},{"$f":"SUMIFS(Sheet1!$H$4:$H$1497,Sheet1!$F$4:$F$1497,B29,Sheet1!$Z$4:$Z$1497,$J$3)","v":0},null,null,"",{"$f":"IFERROR(IF(B28<\"\",SUMIFS(Sheet1!$L$4:$L$997,Sheet1!$F$4:$F$997,B28,Sheet1!$Z$4:$Z$997,$H$3)+F28/SUMIFS(Sheet1!$H$4:$H$997,Sheet1!$F$4:$F$997,B28,Sheet1!$Z$4:$Z$997,$H$3),F28/D28),\"\")","v":""},""]
[null,null,null,null,null,null,null,{"$f":"SUMIFS(Sheet1!$H$4:$H$1497,Sheet1!$F$4:$F$1497,B30,Sheet1!$Z$4:$Z$1497,$H$3)","v":0},{"$f":"SUMIFS(Sheet1!$J$4:$J$15,Sheet1!$F$4:$F$15,B30,Sheet1!$Z$4:$Z$15,$H$3)","v":0},{"$f":"SUMIFS(Sheet1!$H$4:$H$1497,Sheet1!$F$4:$F$1497,B30,Sheet1!$Z$4:$Z$1497,$J$3)","v":0},null,null,"",{"$f":"IFERROR(IF(B29<\"\",SUMIFS(Sheet1!$L$4:$L$997,Sheet1!$F$4:$F$997,B29,Sheet1!$Z$4:$Z$997,$H$3)+F29/SUMIFS(Sheet1!$H$4:$H$997,Sheet1!$F$4:$F$997,B29,Sheet1!$Z$4:$Z$997,$H$3),F29/D29),\"\")","v":""},""]
[null,null,null,null,null,null,null,{"$f":"SUMIFS(Sheet1!$H$4:$H$1497,Sheet1!$F$4:$F$1497,B31,Sheet1!$Z$4:$Z$1497,$H$3)","v":0},{"$f":"SUMIFS(Sheet1!$J$4:$J$15,Sheet1!$F$4:$F$15,B31,Sheet1!$Z$4:$Z$15,$H$3)","v":0},{"$f":"SUMIFS(Sheet1!$H$4:$H$1497,Sheet1!$F$4:$F$1497,B31,Sheet1!$Z$4:$Z$1497,$J$3)","v":0},null,null,"",{"$f":"IFERROR(IF(B30<\"\",SUMIFS(Sheet1!$L$4:$L$997,Sheet1!$F$4:$F$997,B30,Sheet1!$Z$4:$Z$997,$H$3)+F30/SUMIFS(Sheet1!$H$4:$H$997,Sheet1!$F$4:$F$997,B30,Sheet1!$Z$4:$Z$997,$H$3),F30/D30),\"\")","v":""},""]
[null,null,null,null,null,null,null,{"$f":"SUMIFS(Sheet1!$H$4:$H$1497,Sheet1!$F$4:$F$1497,B32,Sheet1!$Z$4:$Z$1497,$H$3)","v":0},{"$f":"SUMIFS(Sheet1!$J$4:$J$15,Sheet1!$F$4:$F$15,B32,Sheet1!$Z$4:$Z$15,$H$3)","v":0},{"$f":"SUMIFS(Sheet1!$H$4:$H$1497,Sheet1!$F$4:$F$1497,B32,Sheet1!$Z$4:$Z$1497,$J$3)","v":0},null,null,"",{"$f":"IFERROR(IF(B31<\"\",SUMIFS(Sheet1!$L$4:$L$997,Sheet1!$F$4:$F$997,B31,Sheet1!$Z$4:$Z$997,$H$3)+F31/SUMIFS(Sheet1!$H$4:$H$997,Sheet1!$F$4:$F$997,B31,Sheet1!$Z$4:$Z$997,$H$3),F31/D31),\"\")","v":""},""]
[null,null,null,null,null,null,null,{"$f":"SUMIFS(Sheet1!$H$4:$H$1497,Sheet1!$F$4:$F$1497,B33,Sheet1!$Z$4:$Z$1497,$H$3)","v":0},{"$f":"SUMIFS(Sheet1!$J$4:$J$15,Sheet1!$F$4:$F$15,B33,Sheet1!$Z$4:$Z$15,$H$3)","v":0},{"$f":"SUMIFS(Sheet1!$H$4:$H$1497,Sheet1!$F$4:$F$1497,B33,Sheet1!$Z$4:$Z$1497,$J$3)","v":0},null,null,"",{"$f":"IFERROR(IF(B32<\"\",SUMIFS(Sheet1!$L$4:$L$997,Sheet1!$F$4:$F$997,B32,Sheet1!$Z$4:$Z$997,$H$3)+F32/SUMIFS(Sheet1!$H$4:$H$997,Sheet1!$F$4:$F$997,B32,Sheet1!$Z$4:$Z$997,$H$3),F32/D32),\"\")","v":""},""]
[null,null,null,null,null,null,null,{"$f":"SUMIFS(Sheet1!$H$4:$H$1497,Sheet1!$F$4:$F$1497,B34,Sheet1!$Z$4:$Z$1497,$H$3)","v":0},{"$f":"SUMIFS(Sheet1!$J$4:$J$15,Sheet1!$F$4:$F$15,B34,Sheet1!$Z$4:$Z$15,$H$3)","v":0},{"$f":"SUMIFS(Sheet1!$H$4:$H$1497,Sheet1!$F$4:$F$1497,B34,Sheet1!$Z$4:$Z$1497,$J$3)","v":0},null,null,"",{"$f":"IFERROR(IF(B33<\"\",SUMIFS(Sheet1!$L$4:$L$997,Sheet1!$F$4:$F$997,B33,Sheet1!$Z$4:$Z$997,$H$3)+F33/SUMIFS(Sheet1!$H$4:$H$997,Sheet1!$F$4:$F$997,B33,Sheet1!$Z$4:$Z$997,$H$3),F33/D33),\"\")","v":""},""]
[null,null,null,null,null,null,null,{"$f":"SUMIFS(Sheet1!$H$4:$H$1497,Sheet1!$F$4:$F$1497,B35,Sheet1!$Z$4:$Z$1497,$H$3)","v":0},{"$f":"SUMIFS(Sheet1!$J$4:$J$15,Sheet1!$F$4:$F$15,B35,Sheet1!$Z$4:$Z$15,$H$3)","v":0},{"$f":"SUMIFS(Sheet1!$H$4:$H$1497,Sheet1!$F$4:$F$1497,B35,Sheet1!$Z$4:$Z$1497,$J$3)","v":0},null,null,"",{"$f":"IFERROR(IF(B34<\"\",SUMIFS(Sheet1!$L$4:$L$997,Sheet1!$F$4:$F$997,B34,Sheet1!$Z$4:$Z$997,$H$3)+F34/SUMIFS(Sheet1!$H$4:$H$997,Sheet1!$F$4:$F$997,B34,Sheet1!$Z$4:$Z$997,$H$3),F34/D34),\"\")","v":""},""]
[null,null,null,null,null,null,null,{"$f":"SUMIFS(Sheet1!$H$4:$H$1497,Sheet1!$F$4:$F$1497,B36,Sheet1!$Z$4:$Z$1497,$H$3)","v":0},{"$f":"SUMIFS(Sheet1!$J$4:$J$15,Sheet1!$F$4:$F$15,B36,Sheet1!$Z$4:$Z$15,$H$3)","v":0},{"$f":"SUMIFS(Sheet1!$H$4:$H$1497,Sheet1!$F$4:$F$1497,B36,Sheet1!$Z$4:$Z$1497,$J$3)","v":0},null,null,"",{"$f":"IFERROR(IF(B35<\"\",SUMIFS(Sheet1!$L$4:$L$997,Sheet1!$F$4:$F$997,B35,Sheet1!$Z$4:$Z$997,$H$3)+F35/SUMIFS(Sheet1!$H$4:$H$997,Sheet1!$F$4:$F$997,B35,Sheet1!$Z$4:$Z$997,$H$3),F35/D35),\"\")","v":""},""]
[null,null,null,null,null,null,null,{"$f":"SUMIFS(Sheet1!$H$4:$H$1497,Sheet1!$F$4:$F$1497,B37,Sheet1!$Z$4:$Z$1497,$H$3)","v":0},{"$f":"SUMIFS(Sheet1!$J$4:$J$15,Sheet1!$F$4:$F$15,B37,Sheet1!$Z$4:$Z$15,$H$3)","v":0},{"$f":"SUMIFS(Sheet1!$H$4:$H$1497,Sheet1!$F$4:$F$1497,B37,Sheet1!$Z$4:$Z$1497,$J$3)","v":0},null,null,"",{"$f":"IFERROR(IF(B36<\"\",SUMIFS(Sheet1!$L$4:$L$997,Sheet1!$F$4:$F$997,B36,Sheet1!$Z$4:$Z$997,$H$3)+F36/SUMIFS(Sheet1!$H$4:$H$997,Sheet1!$F$4:$F$997,B36,Sheet1!$Z$4:$Z$997,$H$3),F36/D36),\"\")","v":""},""]
[null,null,null,null,null,null,null,{"$f":"SUMIFS(Sheet1!$H$4:$H$1497,Sheet1!$F$4:$F$1497,B38,Sheet1!$Z$4:$Z$1497,$H$3)","v":0},{"$f":"SUMIFS(Sheet1!$J$4:$J$15,Sheet1!$F$4:$F$15,B38,Sheet1!$Z$4:$Z$15,$H$3)","v":0},{"$f":"SUMIFS(Sheet1!$H$4:$H$1497,Sheet1!$F$4:$F$1497,B38,Sheet1!$Z$4:$Z$1497,$J$3)","v":0},null,null,"",{"$f":"IFERROR(IF(B37<\"\",SUMIFS(Sheet1!$L$4:$L$997,Sheet1!$F$4:$F$997,B37,Sheet1!$Z$4:$Z$997,$H$3)+F37/SUMIFS(Sheet1!$H$4:$H$997,Sheet1!$F$4:$F$997,B37,Sheet1!$Z$4:$Z$997,$H$3),F37/D37),\"\")","v":""},""]
[null,null,null,null,null,null,null,{"$f":"SUMIFS(Sheet1!$H$4:$H$1497,Sheet1!$F$4:$F$1497,B39,Sheet1!$Z$4:$Z$1497,$H$3)","v":0},{"$f":"SUMIFS(Sheet1!$J$4:$J$15,Sheet1!$F$4:$F$15,B39,Sheet1!$Z$4:$Z$15,$H$3)","v":0},{"$f":"SUMIFS(Sheet1!$H$4:$H$1497,Sheet1!$F$4:$F$1497,B39,Sheet1!$Z$4:$Z$1497,$J$3)","v":0},null,null,"",{"$f":"IFERROR(IF(B38<\"\",SUMIFS(Sheet1!$L$4:$L$997,Sheet1!$F$4:$F$997,B38,Sheet1!$Z$4:$Z$997,$H$3)+F38/SUMIFS(Sheet1!$H$4:$H$997,Sheet1!$F$4:$F$997,B38,Sheet1!$Z$4:$Z$997,$H$3),F38/D38),\"\")","v":""},""]
[null,null,null,null,null,null,null,{"$f":"SUMIFS(Sheet1!$H$4:$H$1497,Sheet1!$F$4:$F$1497,B40,Sheet1!$Z$4:$Z$1497,$H$3)","v":0},{"$f":"SUMIFS(Sheet1!$J$4:$J$15,Sheet1!$F$4:$F$15,B40,Sheet1!$Z$4:$Z$15,$H$3)","v":0},{"$f":"SUMIFS(Sheet1!$H$4:$H$1497,Sheet1!$F$4:$F$1497,B40,Sheet1!$Z$4:$Z$1497,$J$3)","v":0},null,null,"",{"$f":"IFERROR(IF(B39<\"\",SUMIFS(Sheet1!$L$4:$L$997,Sheet1!$F$4:$F$997,B39,Sheet1!$Z$4:$Z$997,$H$3)+F39/SUMIFS(Sheet1!$H$4:$H$997,Sheet1!$F$4:$F$997,B39,Sheet1!$Z$4:$Z$997,$H$3),F39/D39),\"\")","v":""},""]
[null,null,null,null,null,null,null,{"$f":"SUMIFS(Sheet1!$H$4:$H$1497,Sheet1!$F$4:$F$1497,B41,Sheet1!$Z$4:$Z$1497,$H$3)","v":0},{"$f":"SUMIFS(Sheet1!$J$4:$J$15,Sheet1!$F$4:$F$15,B41,Sheet1!$Z$4:$Z$15,$H$3)","v":0},{"$f":"SUMIFS(Sheet1!$H$4:$H$1497,Sheet1!$F$4:$F$1497,B41,Sheet1!$Z$4:$Z$1497,$J$3)","v":0},null,null,"",{"$f":"IFERROR(IF(B40<\"\",SUMIFS(Sheet1!$L$4:$L$997,Sheet1!$F$4:$F$997,B40,Sheet1!$Z$4:$Z$997,$H$3)+F40/SUMIFS(Sheet1!$H$4:$H$997,Sheet1!$F$4:$F$997,B40,Sheet1!$Z$4:$Z$997,$H$3),F40/D40),\"\")","v":""},""]
[null,null,null,null,null,null,null,{"$f":"SUMIFS(Sheet1!$H$4:$H$1497,Sheet1!$F$4:$F$1497,B42,Sheet1!$Z$4:$Z$1497,$H$3)","v":0},{"$f":"SUMIFS(Sheet1!$J$4:$J$15,Sheet1!$F$4:$F$15,B42,Sheet1!$Z$4:$Z$15,$H$3)","v":0},{"$f":"SUMIFS(Sheet1!$H$4:$H$1497,Sheet1!$F$4:$F$1497,B42,Sheet1!$Z$4:$Z$1497,$J$3)","v":0},null,null,"",{"$f":"IFERROR(IF(B41<\"\",SUMIFS(Sheet1!$L$4:$L$997,Sheet1!$F$4:$F$997,B41,Sheet1!$Z$4:$Z$997,$H$3)+F41/SUMIFS(Sheet1!$H$4:$H$997,Sheet1!$F$4:$F$997,B41,Sheet1!$Z$4:$Z$997,$H$3),F41/D41),\"\")","v":""},""]
[null,null,null,null,null,null,null,{"$f":"SUMIFS(Sheet1!$H$4:$H$1497,Sheet1!$F$4:$F$1497,B43,Sheet1!$Z$4:$Z$1497,$H$3)","v":0},{"$f":"SUMIFS(Sheet1!$J$4:$J$15,Sheet1!$F$4:$F$15,B43,Sheet1!$Z$4:$Z$15,$H$3)","v":0},{"$f":"SUMIFS(Sheet1!$H$4:$H$1497,Sheet1!$F$4:$F$1497,B43,Sheet1!$Z$4:$Z$1497,$J$3)","v":0},null,null,"",{"$f":"IFERROR(IF(B42<\"\",SUMIFS(Sheet1!$L$4:$L$997,Sheet1!$F$4:$F$997,B42,Sheet1!$Z$4:$Z$997,$H$3)+F42/SUMIFS(Sheet1!$H$4:$H$997,Sheet1!$F$4:$F$997,B42,Sheet1!$Z$4:$Z$997,$H$3),F42/D42),\"\")","v":""},""]
[null,null,null,null,null,null,null,{"$f":"SUMIFS(Sheet1!$H$4:$H$1497,Sheet1!$F$4:$F$1497,B44,Sheet1!$Z$4:$Z$1497,$H$3)","v":0},{"$f":"SUMIFS(Sheet1!$J$4:$J$15,Sheet1!$F$4:$F$15,B44,Sheet1!$Z$4:$Z$15,$H$3)","v":0},{"$f":"SUMIFS(Sheet1!$H$4:$H$1497,Sheet1!$F$4:$F$1497,B44,Sheet1!$Z$4:$Z$1497,$J$3)","v":0},null,null,"",{"$f":"IFERROR(IF(B43<\"\",SUMIFS(Sheet1!$L$4:$L$997,Sheet1!$F$4:$F$997,B43,Sheet1!$Z$4:$Z$997,$H$3)+F43/SUMIFS(Sheet1!$H$4:$H$997,Sheet1!$F$4:$F$997,B43,Sheet1!$Z$4:$Z$997,$H$3),F43/D43),\"\")","v":""},""]
[null,null,null,null,null,null,null,{"$f":"SUMIFS(Sheet1!$H$4:$H$1497,Sheet1!$F$4:$F$1497,B45,Sheet1!$Z$4:$Z$1497,$H$3)","v":0},{"$f":"SUMIFS(Sheet1!$J$4:$J$15,Sheet1!$F$4:$F$15,B45,Sheet1!$Z$4:$Z$15,$H$3)","v":0},{"$f":"SUMIFS(Sheet1!$H$4:$H$1497,Sheet1!$F$4:$F$1497,B45,Sheet1!$Z$4:$Z$1497,$J$3)","v":0},null,null,"",{"$f":"IFERROR(IF(B44<\"\",SUMIFS(Sheet1!$L$4:$L$997,Sheet1!$F$4:$F$997,B44,Sheet1!$Z$4:$Z$997,$H$3)+F44/SUMIFS(Sheet1!$H$4:$H$997,Sheet1!$F$4:$F$997,B44,Sheet1!$Z$4:$Z$997,$H$3),F44/D44),\"\")","v":""},""]
[null,null,null,null,null,null,null,{"$f":"SUMIFS(Sheet1!$H$4:$H$1497,Sheet1!$F$4:$F$1497,B46,Sheet1!$Z$4:$Z$1497,$H$3)","v":0},{"$f":"SUMIFS(Sheet1!$J$4:$J$15,Sheet1!$F$4:$F$15,B46,Sheet1!$Z$4:$Z$15,$H$3)","v":0},{"$f":"SUMIFS(Sheet1!$H$4:$H$1497,Sheet1!$F$4:$F$1497,B46,Sheet1!$Z$4:$Z$1497,$J$3)","v":0},null,null,"",{"$f":"IFERROR(IF(B45<\"\",SUMIFS(Sheet1!$L$4:$L$997,Sheet1!$F$4:$F$997,B45,Sheet1!$Z$4:$Z$997,$H$3)+F45/SUMIFS(Sheet1!$H$4:$H$997,Sheet1!$F$4:$F$997,B45,Sheet1!$Z$4:$Z$997,$H$3),F45/D45),\"\")","v":""},""]
[null,null,null,null,null,null,null,{"$f":"SUMIFS(Sheet1!$H$4:$H$1497,Sheet1!$F$4:$F$1497,B47,Sheet1!$Z$4:$Z$1497,$H$3)","v":0},{"$f":"SUMIFS(Sheet1!$J$4:$J$15,Sheet1!$F$4:$F$15,B47,Sheet1!$Z$4:$Z$15,$H$3)","v":0},{"$f":"SUMIFS(Sheet1!$H$4:$H$1497,Sheet1!$F$4:$F$1497,B47,Sheet1!$Z$4:$Z$1497,$J$3)","v":0},null,null,"",{"$f":"IFERROR(IF(B46<\"\",SUMIFS(Sheet1!$L$4:$L$997,Sheet1!$F$4:$F$997,B46,Sheet1!$Z$4:$Z$997,$H$3)+F46/SUMIFS(Sheet1!$H$4:$H$997,Sheet1!$F$4:$F$997,B46,Sheet1!$Z$4:$Z$997,$H$3),F46/D46),\"\")","v":""},""]
[null,null,null,null,null,null,null,{"$f":"SUMIFS(Sheet1!$H$4:$H$1497,Sheet1!$F$4:$F$1497,B48,Sheet1!$Z$4:$Z$1497,$H$3)","v":0},{"$f":"SUMIFS(Sheet1!$J$4:$J$15,Sheet1!$F$4:$F$15,B48,Sheet1!$Z$4:$Z$15,$H$3)","v":0},{"$f":"SUMIFS(Sheet1!$H$4:$H$1497,Sheet1!$F$4:$F$1497,B48,Sheet1!$Z$4:$Z$1497,$J$3)","v":0},null,null,"",{"$f":"IFERROR(IF(B47<\"\",SUMIFS(Sheet1!$L$4:$L$997,Sheet1!$F$4:$F$997,B47,Sheet1!$Z$4:$Z$997,$H$3)+F47/SUMIFS(Sheet1!$H$4:$H$997,Sheet1!$F$4:$F$997,B47,Sheet1!$Z$4:$Z$997,$H$3),F47/D47),\"\")","v":""},""]
[null,null,null,null,null,null,null,{"$f":"SUMIFS(Sheet1!$H$4:$H$1497,Sheet1!$F$4:$F$1497,B49,Sheet1!$Z$4:$Z$1497,$H$3)","v":0},{"$f":"SUMIFS(Sheet1!$J$4:$J$15,Sheet1!$F$4:$F$15,B49,Sheet1!$Z$4:$Z$15,$H$3)","v":0},{"$f":"SUMIFS(Sheet1!$H$4:$H$1497,Sheet1!$F$4:$F$1497,B49,Sheet1!$Z$4:$Z$1497,$J$3)","v":0},null,null,"",{"$f":"IFERROR(IF(B48<\"\",SUMIFS(Sheet1!$L$4:$L$997,Sheet1!$F$4:$F$997,B48,Sheet1!$Z$4:$Z$997,$H$3)+F48/SUMIFS(Sheet1!$H$4:$H$997,Sheet1!$F$4:$F$997,B48,Sheet1!$Z$4:$Z$997,$H$3),F48/D48),\"\")","v":""},""]
[null,null,null,null,null,null,null,{"$f":"SUMIFS(Sheet1!$H$4:$H$1497,Sheet1!$F$4:$F$1497,B50,Sheet1!$Z$4:$Z$1497,$H$3)","v":0},{"$f":"SUMIFS(Sheet1!$J$4:$J$15,Sheet1!$F$4:$F$15,B50,Sheet1!$Z$4:$Z$15,$H$3)","v":0},{"$f":"SUMIFS(Sheet1!$H$4:$H$1497,Sheet1!$F$4:$F$1497,B50,Sheet1!$Z$4:$Z$1497,$J$3)","v":0},null,null,"",{"$f":"IFERROR(IF(B49<\"\",SUMIFS(Sheet1!$L$4:$L$997,Sheet1!$F$4:$F$997,B49,Sheet1!$Z$4:$Z$997,$H$3)+F49/SUMIFS(Sheet1!$H$4:$H$997,Sheet1!$F$4:$F$997,B49,Sheet1!$Z$4:$Z$997,$H$3),F49/D49),\"\")","v":""},""]
[null,null,null,null,null,null,null,{"$f":"SUMIFS(Sheet1!$H$4:$H$1497,Sheet1!$F$4:$F$1497,B51,Sheet1!$Z$4:$Z$1497,$H$3)","v":0},{"$f":"SUMIFS(Sheet1!$J$4:$J$15,Sheet1!$F$4:$F$15,B51,Sheet1!$Z$4:$Z$15,$H$3)","v":0},{"$f":"SUMIFS(Sheet1!$H$4:$H$1497,Sheet1!$F$4:$F$1497,B51,Sheet1!$Z$4:$Z$1497,$J$3)","v":0},null,null,"",{"$f":"IFERROR(IF(B50<\"\",SUMIFS(Sheet1!$L$4:$L$997,Sheet1!$F$4:$F$997,B50,Sheet1!$Z$4:$Z$997,$H$3)+F50/SUMIFS(Sheet1!$H$4:$H$997,Sheet1!$F$4:$F$997,B50,Sheet1!$Z$4:$Z$997,$H$3),F50/D50),\"\")","v":""},""]
[null,null,null,null,null,null,null,{"$f":"SUMIFS(Sheet1!$H$4:$H$1497,Sheet1!$F$4:$F$1497,B52,Sheet1!$Z$4:$Z$1497,$H$3)","v":0},{"$f":"SUMIFS(Sheet1!$J$4:$J$15,Sheet1!$F$4:$F$15,B52,Sheet1!$Z$4:$Z$15,$H$3)","v":0},{"$f":"SUMIFS(Sheet1!$H$4:$H$1497,Sheet1!$F$4:$F$1497,B52,Sheet1!$Z$4:$Z$1497,$J$3)","v":0},null,null,"",{"$f":"IFERROR(IF(B51<\"\",SUMIFS(Sheet1!$L$4:$L$997,Sheet1!$F$4:$F$997,B51,Sheet1!$Z$4:$Z$997,$H$3)+F51/SUMIFS(Sheet1!$H$4:$H$997,Sheet1!$F$4:$F$997,B51,Sheet1!$Z$4:$Z$997,$H$3),F51/D51),\"\")","v":""},""]
[null,null,null,null,null,null,null,{"$f":"SUMIFS(Sheet1!$H$4:$H$1497,Sheet1!$F$4:$F$1497,B53,Sheet1!$Z$4:$Z$1497,$H$3)","v":0},{"$f":"SUMIFS(Sheet1!$J$4:$J$15,Sheet1!$F$4:$F$15,B53,Sheet1!$Z$4:$Z$15,$H$3)","v":0},{"$f":"SUMIFS(Sheet1!$H$4:$H$1497,Sheet1!$F$4:$F$1497,B53,Sheet1!$Z$4:$Z$1497,$J$3)","v":0},null,null,"",{"$f":"IFERROR(IF(B52<\"\",SUMIFS(Sheet1!$L$4:$L$997,Sheet1!$F$4:$F$997,B52,Sheet1!$Z$4:$Z$997,$H$3)+F52/SUMIFS(Sheet1!$H$4:$H$997,Sheet1!$F$4:$F$997,B52,Sheet1!$Z$4:$Z$997,$H$3),F52/D52),\"\")","v":""},""]
[null,null,null,null,null,null,null,{"$f":"SUMIFS(Sheet1!$H$4:$H$1497,Sheet1!$F$4:$F$1497,B54,Sheet1!$Z$4:$Z$1497,$H$3)","v":0},{"$f":"SUMIFS(Sheet1!$J$4:$J$15,Sheet1!$F$4:$F$15,B54,Sheet1!$Z$4:$Z$15,$H$3)","v":0},{"$f":"SUMIFS(Sheet1!$H$4:$H$1497,Sheet1!$F$4:$F$1497,B54,Sheet1!$Z$4:$Z$1497,$J$3)","v":0},null,null,"",{"$f":"IFERROR(IF(B53<\"\",SUMIFS(Sheet1!$L$4:$L$997,Sheet1!$F$4:$F$997,B53,Sheet1!$Z$4:$Z$997,$H$3)+F53/SUMIFS(Sheet1!$H$4:$H$997,Sheet1!$F$4:$F$997,B53,Sheet1!$Z$4:$Z$997,$H$3),F53/D53),\"\")","v":""},""]
[null,null,null,null,null,null,null,{"$f":"SUMIFS(Sheet1!$H$4:$H$1497,Sheet1!$F$4:$F$1497,B55,Sheet1!$Z$4:$Z$1497,$H$3)","v":0},{"$f":"SUMIFS(Sheet1!$J$4:$J$15,Sheet1!$F$4:$F$15,B55,Sheet1!$Z$4:$Z$15,$H$3)","v":0},{"$f":"SUMIFS(Sheet1!$H$4:$H$1497,Sheet1!$F$4:$F$1497,B55,Sheet1!$Z$4:$Z$1497,$J$3)","v":0},null,null,"",{"$f":"IFERROR(IF(B54<\"\",SUMIFS(Sheet1!$L$4:$L$997,Sheet1!$F$4:$F$997,B54,Sheet1!$Z$4:$Z$997,$H$3)+F54/SUMIFS(Sheet1!$H$4:$H$997,Sheet1!$F$4:$F$997,B54,Sheet1!$Z$4:$Z$997,$H$3),F54/D54),\"\")","v":""},""]
[null,null,null,null,null,null,null,{"$f":"SUMIFS(Sheet1!$H$4:$H$1497,Sheet1!$F$4:$F$1497,B56,Sheet1!$Z$4:$Z$1497,$H$3)","v":0},{"$f":"SUMIFS(Sheet1!$J$4:$J$15,Sheet1!$F$4:$F$15,B56,Sheet1!$Z$4:$Z$15,$H$3)","v":0},{"$f":"SUMIFS(Sheet1!$H$4:$H$1497,Sheet1!$F$4:$F$1497,B56,Sheet1!$Z$4:$Z$1497,$J$3)","v":0},null,null,"",{"$f":"IFERROR(IF(B55<\"\",SUMIFS(Sheet1!$L$4:$L$997,Sheet1!$F$4:$F$997,B55,Sheet1!$Z$4:$Z$997,$H$3)+F55/SUMIFS(Sheet1!$H$4:$H$997,Sheet1!$F$4:$F$997,B55,Sheet1!$Z$4:$Z$997,$H$3),F55/D55),\"\")","v":""},""]
[null,null,null,null,null,null,null,{"$f":"SUMIFS(Sheet1!$H$4:$H$1497,Sheet1!$F$4:$F$1497,B57,Sheet1!$Z$4:$Z$1497,$H$3)","v":0},{"$f":"SUMIFS(Sheet1!$J$4:$J$15,Sheet1!$F$4:$F$15,B57,Sheet1!$Z$4:$Z$15,$H$3)","v":0},{"$f":"SUMIFS(Sheet1!$H$4:$H$1497,Sheet1!$F$4:$F$1497,B57,Sheet1!$Z$4:$Z$1497,$J$3)","v":0},null,null,"",{"$f":"IFERROR(IF(B56<\"\",SUMIFS(Sheet1!$L$4:$L$997,Sheet1!$F$4:$F$997,B56,Sheet1!$Z$4:$Z$997,$H$3)+F56/SUMIFS(Sheet1!$H$4:$H$997,Sheet1!$F$4:$F$997,B56,Sheet1!$Z$4:$Z$997,$H$3),F56/D56),\"\")","v":""},""]
[null,null,null,null,null,null,null,{"$f":"SUMIFS(Sheet1!$H$4:$H$1497,Sheet1!$F$4:$F$1497,B58,Sheet1!$Z$4:$Z$1497,$H$3)","v":0},{"$f":"SUMIFS(Sheet1!$J$4:$J$15,Sheet1!$F$4:$F$15,B58,Sheet1!$Z$4:$Z$15,$H$3)","v":0},{"$f":"SUMIFS(Sheet1!$H$4:$H$1497,Sheet1!$F$4:$F$1497,B58,Sheet1!$Z$4:$Z$1497,$J$3)","v":0},null,null,"",{"$f":"IFERROR(IF(B57<\"\",SUMIFS(Sheet1!$L$4:$L$997,Sheet1!$F$4:$F$997,B57,Sheet1!$Z$4:$Z$997,$H$3)+F57/SUMIFS(Sheet1!$H$4:$H$997,Sheet1!$F$4:$F$997,B57,Sheet1!$Z$4:$Z$997,$H$3),F57/D57),\"\")","v":""},""]
[null,null,null,null,null,null,null,{"$f":"SUMIFS(Sheet1!$H$4:$H$1497,Sheet1!$F$4:$F$1497,B59,Sheet1!$Z$4:$Z$1497,$H$3)","v":0},{"$f":"SUMIFS(Sheet1!$J$4:$J$15,Sheet1!$F$4:$F$15,B59,Sheet1!$Z$4:$Z$15,$H$3)","v":0},{"$f":"SUMIFS(Sheet1!$H$4:$H$1497,Sheet1!$F$4:$F$1497,B59,Sheet1!$Z$4:$Z$1497,$J$3)","v":0},null,null,"",{"$f":"IFERROR(IF(B58<\"\",SUMIFS(Sheet1!$L$4:$L$997,Sheet1!$F$4:$F$997,B58,Sheet1!$Z$4:$Z$997,$H$3)+F58/SUMIFS(Sheet1!$H$4:$H$997,Sheet1!$F$4:$F$997,B58,Sheet1!$Z$4:$Z$997,$H$3),F58/D58),\"\")","v":""},""]
[null,null,null,null,null,null,null,{"$f":"SUMIFS(Sheet1!$H$4:$H$1497,Sheet1!$F$4:$F$1497,B60,Sheet1!$Z$4:$Z$1497,$H$3)","v":0},{"$f":"SUMIFS(Sheet1!$J$4:$J$15,Sheet1!$F$4:$F$15,B60,Sheet1!$Z$4:$Z$15,$H$3)","v":0},{"$f":"SUMIFS(Sheet1!$H$4:$H$1497,Sheet1!$F$4:$F$1497,B60,Sheet1!$Z$4:$Z$1497,$J$3)","v":0},null,null,"",{"$f":"IFERROR(IF(B59<\"\",SUMIFS(Sheet1!$L$4:$L$997,Sheet1!$F$4:$F$997,B59,Sheet1!$Z$4:$Z$997,$H$3)+F59/SUMIFS(Sheet1!$H$4:$H$997,Sheet1!$F$4:$F$997,B59,Sheet1!$Z$4:$Z$997,$H$3),F59/D59),\"\")","v":""},""]
[null,null,null,null,null,null,null,{"$f":"SUMIFS(Sheet1!$H$4:$H$1497,Sheet1!$F$4:$F$1497,B61,Sheet1!$Z$4:$Z$1497,$H$3)","v":0},{"$f":"SUMIFS(Sheet1!$J$4:$J$15,Sheet1!$F$4:$F$15,B61,Sheet1!$Z$4:$Z$15,$H$3)","v":0},{"$f":"SUMIFS(Sheet1!$H$4:$H$1497,Sheet1!$F$4:$F$1497,B61,Sheet1!$Z$4:$Z$1497,$J$3)","v":0},null,null,"",{"$f":"IFERROR(IF(B60<\"\",SUMIFS(Sheet1!$L$4:$L$997,Sheet1!$F$4:$F$997,B60,Sheet1!$Z$4:$Z$997,$H$3)+F60/SUMIFS(Sheet1!$H$4:$H$997,Sheet1!$F$4:$F$997,B60,Sheet1!$Z$4:$Z$997,$H$3),F60/D60),\"\")","v":""},""]
[null,null,null,null,null,null,null,{"$f":"SUMIFS(Sheet1!$H$4:$H$1497,Sheet1!$F$4:$F$1497,B62,Sheet1!$Z$4:$Z$1497,$H$3)","v":0},{"$f":"SUMIFS(Sheet1!$J$4:$J$15,Sheet1!$F$4:$F$15,B62,Sheet1!$Z$4:$Z$15,$H$3)","v":0},{"$f":"SUMIFS(Sheet1!$H$4:$H$1497,Sheet1!$F$4:$F$1497,B62,Sheet1!$Z$4:$Z$1497,$J$3)","v":0},null,null,"",{"$f":"IFERROR(IF(B61<\"\",SUMIFS(Sheet1!$L$4:$L$997,Sheet1!$F$4:$F$997,B61,Sheet1!$Z$4:$Z$997,$H$3)+F61/SUMIFS(Sheet1!$H$4:$H$997,Sheet1!$F$4:$F$997,B61,Sheet1!$Z$4:$Z$997,$H$3),F61/D61),\"\")","v":""},""]
[null,null,null,null,null,null,null,{"$f":"SUMIFS(Sheet1!$H$4:$H$1497,Sheet1!$F$4:$F$1497,B63,Sheet1!$Z$4:$Z$1497,$H$3)","v":0},{"$f":"SUMIFS(Sheet1!$J$4:$J$15,Sheet1!$F$4:$F$15,B63,Sheet1!$Z$4:$Z$15,$H$3)","v":0},{"$f":"SUMIFS(Sheet1!$H$4:$H$1497,Sheet1!$F$4:$F$1497,B63,Sheet1!$Z$4:$Z$1497,$J$3)","v":0},null,null,"",{"$f":"IFERROR(IF(B62<\"\",SUMIFS(Sheet1!$L$4:$L$997,Sheet1!$F$4:$F$997,B62,Sheet1!$Z$4:$Z$997,$H$3)+F62/SUMIFS(Sheet1!$H$4:$H$997,Sheet1!$F$4:$F$997,B62,Sheet1!$Z$4:$Z$997,$H$3),F62/D62),\"\")","v":""},""]
[null,null,null,null,null,null,null,{"$f":"SUMIFS(Sheet1!$H$4:$H$1497,Sheet1!$F$4:$F$1497,B64,Sheet1!$Z$4:$Z$1497,$H$3)","v":0},{"$f":"SUMIFS(Sheet1!$J$4:$J$15,Sheet1!$F$4:$F$15,B64,Sheet1!$Z$4:$Z$15,$H$3)","v":0},{"$f":"SUMIFS(Sheet1!$H$4:$H$1497,Sheet1!$F$4:$F$1497,B64,Sheet1!$Z$4:$Z$1497,$J$3)","v":0},null,null,"",{"$f":"IFERROR(IF(B63<\"\",SUMIFS(Sheet1!$L$4:$L$997,Sheet1!$F$4:$F$997,B63,Sheet1!$Z$4:$Z$997,$H$3)+F63/SUMIFS(Sheet1!$H$4:$H$997,Sheet1!$F$4:$F$997,B63,Sheet1!$Z$4:$Z$997,$H$3),F63/D63),\"\")","v":""},""]
[null,null,null,null,null,null,null,{"$f":"SUMIFS(Sheet1!$H$4:$H$1497,Sheet1!$F$4:$F$1497,B65,Sheet1!$Z$4:$Z$1497,$H$3)","v":0},{"$f":"SUMIFS(Sheet1!$J$4:$J$15,Sheet1!$F$4:$F$15,B65,Sheet1!$Z$4:$Z$15,$H$3)","v":0},{"$f":"SUMIFS(Sheet1!$H$4:$H$1497,Sheet1!$F$4:$F$1497,B65,Sheet1!$Z$4:$Z$1497,$J$3)","v":0},null,null,"",{"$f":"IFERROR(IF(B64<\"\",SUMIFS(Sheet1!$L$4:$L$997,Sheet1!$F$4:$F$997,B64,Sheet1!$Z$4:$Z$997,$H$3)+F64/SUMIFS(Sheet1!$H$4:$H$997,Sheet1!$F$4:$F$997,B64,Sheet1!$Z$4:$Z$997,$H$3),F64/D64),\"\")","v":""},""]
[null,null,null,null,null,null,null,{"$f":"SUMIFS(Sheet1!$H$4:$H$1497,Sheet1!$F$4:$F$1497,B66,Sheet1!$Z$4:$Z$1497,$H$3)","v":0},{"$f":"SUMIFS(Sheet1!$J$4:$J$15,Sheet1!$F$4:$F$15,B66,Sheet1!$Z$4:$Z$15,$H$3)","v":0},{"$f":"SUMIFS(Sheet1!$H$4:$H$1497,Sheet1!$F$4:$F$1497,B66,Sheet1!$Z$4:$Z$1497,$J$3)","v":0},null,null,"",{"$f":"IFERROR(IF(B65<\"\",SUMIFS(Sheet1!$L$4:$L$997,Sheet1!$F$4:$F$997,B65,Sheet1!$Z$4:$Z$997,$H$3)+F65/SUMIFS(Sheet1!$H$4:$H$997,Sheet1!$F$4:$F$997,B65,Sheet1!$Z$4:$Z$997,$H$3),F65/D65),\"\")","v":""},""]
[null,null,null,null,null,null,null,{"$f":"SUMIFS(Sheet1!$H$4:$H$1497,Sheet1!$F$4:$F$1497,B67,Sheet1!$Z$4:$Z$1497,$H$3)","v":0},{"$f":"SUMIFS(Sheet1!$J$4:$J$15,Sheet1!$F$4:$F$15,B67,Sheet1!$Z$4:$Z$15,$H$3)","v":0},{"$f":"SUMIFS(Sheet1!$H$4:$H$1497,Sheet1!$F$4:$F$1497,B67,Sheet1!$Z$4:$Z$1497,$J$3)","v":0},null,null,"",{"$f":"IFERROR(IF(B66<\"\",SUMIFS(Sheet1!$L$4:$L$997,Sheet1!$F$4:$F$997,B66,Sheet1!$Z$4:$Z$997,$H$3)+F66/SUMIFS(Sheet1!$H$4:$H$997,Sheet1!$F$4:$F$997,B66,Sheet1!$Z$4:$Z$997,$H$3),F66/D66),\"\")","v":""},""]
[null,null,null,null,null,null,null,{"$f":"SUMIFS(Sheet1!$H$4:$H$1497,Sheet1!$F$4:$F$1497,B68,Sheet1!$Z$4:$Z$1497,$H$3)","v":0},{"$f":"SUMIFS(Sheet1!$J$4:$J$15,Sheet1!$F$4:$F$15,B68,Sheet1!$Z$4:$Z$15,$H$3)","v":0},{"$f":"SUMIFS(Sheet1!$H$4:$H$1497,Sheet1!$F$4:$F$1497,B68,Sheet1!$Z$4:$Z$1497,$J$3)","v":0},null,null,"",{"$f":"IFERROR(IF(B67<\"\",SUMIFS(Sheet1!$L$4:$L$997,Sheet1!$F$4:$F$997,B67,Sheet1!$Z$4:$Z$997,$H$3)+F67/SUMIFS(Sheet1!$H$4:$H$997,Sheet1!$F$4:$F$997,B67,Sheet1!$Z$4:$Z$997,$H$3),F67/D67),\"\")","v":""},""]
[null,null,null,null,null,null,null,{"$f":"SUMIFS(Sheet1!$H$4:$H$1497,Sheet1!$F$4:$F$1497,B69,Sheet1!$Z$4:$Z$1497,$H$3)","v":0},{"$f":"SUMIFS(Sheet1!$J$4:$J$15,Sheet1!$F$4:$F$15,B69,Sheet1!$Z$4:$Z$15,$H$3)","v":0},{"$f":"SUMIFS(Sheet1!$H$4:$H$1497,Sheet1!$F$4:$F$1497,B69,Sheet1!$Z$4:$Z$1497,$J$3)","v":0},null,null,"",{"$f":"IFERROR(IF(B68<\"\",SUMIFS(Sheet1!$L$4:$L$997,Sheet1!$F$4:$F$997,B68,Sheet1!$Z$4:$Z$997,$H$3)+F68/SUMIFS(Sheet1!$H$4:$H$997,Sheet1!$F$4:$F$997,B68,Sheet1!$Z$4:$Z$997,$H$3),F68/D68),\"\")","v":""},""]
[null,null,null,null,null,null,null,{"$f":"SUMIFS(Sheet1!$H$4:$H$1497,Sheet1!$F$4:$F$1497,B70,Sheet1!$Z$4:$Z$1497,$H$3)","v":0},{"$f":"SUMIFS(Sheet1!$J$4:$J$15,Sheet1!$F$4:$F$15,B70,Sheet1!$Z$4:$Z$15,$H$3)","v":0},{"$f":"SUMIFS(Sheet1!$H$4:$H$1497,Sheet1!$F$4:$F$1497,B70,Sheet1!$Z$4:$Z$1497,$J$3)","v":0},null,null,{"$f":"IF(L69<>\"\",IF(L69>=K69,\"مطلوب\",\"\"),\"\")","v":""},{"$f":"IFERROR(IF(B69<\"\",SUMIFS(Sheet1!$L$4:$L$997,Sheet1!$F$4:$F$997,B69,Sheet1!$Z$4:$Z$997,$H$3)+F69/SUMIFS(Sheet1!$H$4:$H$997,Sheet1!$F$4:$F$997,B69,Sheet1!$Z$4:$Z$997,$H$3),F69/D69),\"\")","v":""},{"$f":"IFERROR(SUMPRODUCT(K69*N69),\"\")","v":""}]
[null,null,null,null,null,null,null,{"$f":"SUMIFS(Sheet1!$H$4:$H$1497,Sheet1!$F$4:$F$1497,B71,Sheet1!$Z$4:$Z$1497,$H$3)","v":0},{"$f":"SUMIFS(Sheet1!$J$4:$J$15,Sheet1!$F$4:$F$15,B71,Sheet1!$Z$4:$Z$15,$H$3)","v":0},{"$f":"SUMIFS(Sheet1!$H$4:$H$1497,Sheet1!$F$4:$F$1497,B71,Sheet1!$Z$4:$Z$1497,$J$3)","v":0},null,null,"",{"$f":"IFERROR(IF(B70<\"\",SUMIFS(Sheet1!$L$4:$L$997,Sheet1!$F$4:$F$997,B70,Sheet1!$Z$4:$Z$997,$H$3)+F70/SUMIFS(Sheet1!$H$4:$H$997,Sheet1!$F$4:$F$997,B70,Sheet1!$Z$4:$Z$997,$H$3),F70/D70),\"\")","v":""},""]
[null,null,null,null,null,null,null,{"$f":"SUMIFS(Sheet1!$H$4:$H$1497,Sheet1!$F$4:$F$1497,B72,Sheet1!$Z$4:$Z$1497,$H$3)","v":0},{"$f":"SUMIFS(Sheet1!$J$4:$J$15,Sheet1!$F$4:$F$15,B72,Sheet1!$Z$4:$Z$15,$H$3)","v":0},{"$f":"SUMIFS(Sheet1!$H$4:$H$1497,Sheet1!$F$4:$F$1497,B72,Sheet1!$Z$4:$Z$1497,$J$3)","v":0},null,null,"",{"$f":"IFERROR(IF(B71<\"\",SUMIFS(Sheet1!$L$4:$L$997,Sheet1!$F$4:$F$997,B71,Sheet1!$Z$4:$Z$997,$H$3)+F71/SUMIFS(Sheet1!$H$4:$H$997,Sheet1!$F$4:$F$997,B71,Sheet1!$Z$4:$Z$997,$H$3),F71/D71),\"\")","v":""},""]
[null,null,null,null,null,null,null,{"$f":"SUMIFS(Sheet1!$H$4:$H$1497,Sheet1!$F$4:$F$1497,B73,Sheet1!$Z$4:$Z$1497,$H$3)","v":0},{"$f":"SUMIFS(Sheet1!$J$4:$J$15,Sheet1!$F$4:$F$15,B73,Sheet1!$Z$4:$Z$15,$H$3)","v":0},{"$f":"SUMIFS(Sheet1!$H$4:$H$1497,Sheet1!$F$4:$F$1497,B73,Sheet1!$Z$4:$Z$1497,$J$3)","v":0},null,null,"",{"$f":"IFERROR(IF(B72<\"\",SUMIFS(Sheet1!$L$4:$L$997,Sheet1!$F$4:$F$997,B72,Sheet1!$Z$4:$Z$997,$H$3)+F72/SUMIFS(Sheet1!$H$4:$H$997,Sheet1!$F$4:$F$997,B72,Sheet1!$Z$4:$Z$997,$H$3),F72/D72),\"\")","v":""},""]
[null,null,null,null,null,null,null,{"$f":"SUMIFS(Sheet1!$H$4:$H$1497,Sheet1!$F$4:$F$1497,B74,Sheet1!$Z$4:$Z$1497,$H$3)","v":0},{"$f":"SUMIFS(Sheet1!$J$4:$J$15,Sheet1!$F$4:$F$15,B74,Sheet1!$Z$4:$Z$15,$H$3)","v":0},{"$f":"SUMIFS(Sheet1!$H$4:$H$1497,Sheet1!$F$4:$F$1497,B74,Sheet1!$Z$4:$Z$1497,$J$3)","v":0},null,null,"",{"$f":"IFERROR(IF(B73<\"\",SUMIFS(Sheet1!$L$4:$L$997,Sheet1!$F$4:$F$997,B73,Sheet1!$Z$4:$Z$997,$H$3)+F73/SUMIFS(Sheet1!$H$4:$H$997,Sheet1!$F$4:$F$997,B73,Sheet1!$Z$4:$Z$997,$H$3),F73/D73),\"\")","v":""},""]
[null,null,null,null,null,null,null,{"$f":"SUMIFS(Sheet1!$H$4:$H$1497,Sheet1!$F$4:$F$1497,B75,Sheet1!$Z$4:$Z$1497,$H$3)","v":0},{"$f":"SUMIFS(Sheet1!$J$4:$J$15,Sheet1!$F$4:$F$15,B75,Sheet1!$Z$4:$Z$15,$H$3)","v":0},{"$f":"SUMIFS(Sheet1!$H$4:$H$1497,Sheet1!$F$4:$F$1497,B75,Sheet1!$Z$4:$Z$1497,$J$3)","v":0},null,null,"",{"$f":"IFERROR(IF(B74<\"\",SUMIFS(Sheet1!$L$4:$L$997,Sheet1!$F$4:$F$997,B74,Sheet1!$Z$4:$Z$997,$H$3)+F74/SUMIFS(Sheet1!$H$4:$H$997,Sheet1!$F$4:$F$997,B74,Sheet1!$Z$4:$Z$997,$H$3),F74/D74),\"\")","v":""},""]
[null,null,null,null,null,null,null,{"$f":"SUMIFS(Sheet1!$H$4:$H$1497,Sheet1!$F$4:$F$1497,B76,Sheet1!$Z$4:$Z$1497,$H$3)","v":0},{"$f":"SUMIFS(Sheet1!$J$4:$J$15,Sheet1!$F$4:$F$15,B76,Sheet1!$Z$4:$Z$15,$H$3)","v":0},{"$f":"SUMIFS(Sheet1!$H$4:$H$1497,Sheet1!$F$4:$F$1497,B76,Sheet1!$Z$4:$Z$1497,$J$3)","v":0},null,null,"",{"$f":"IFERROR(IF(B75<\"\",SUMIFS(Sheet1!$L$4:$L$997,Sheet1!$F$4:$F$997,B75,Sheet1!$Z$4:$Z$997,$H$3)+F75/SUMIFS(Sheet1!$H$4:$H$997,Sheet1!$F$4:$F$997,B75,Sheet1!$Z$4:$Z$997,$H$3),F75/D75),\"\")","v":""},""]
[null,null,null,null,null,null,null,{"$f":"SUMIFS(Sheet1!$H$4:$H$1497,Sheet1!$F$4:$F$1497,B77,Sheet1!$Z$4:$Z$1497,$H$3)","v":0},{"$f":"SUMIFS(Sheet1!$J$4:$J$15,Sheet1!$F$4:$F$15,B77,Sheet1!$Z$4:$Z$15,$H$3)","v":0},{"$f":"SUMIFS(Sheet1!$H$4:$H$1497,Sheet1!$F$4:$F$1497,B77,Sheet1!$Z$4:$Z$1497,$J$3)","v":0},null,null,"",{"$f":"IFERROR(IF(B76<\"\",SUMIFS(Sheet1!$L$4:$L$997,Sheet1!$F$4:$F$997,B76,Sheet1!$Z$4:$Z$997,$H$3)+F76/SUMIFS(Sheet1!$H$4:$H$997,Sheet1!$F$4:$F$997,B76,Sheet1!$Z$4:$Z$997,$H$3),F76/D76),\"\")","v":""},""]
[null,null,null,null,null,null,null,{"$f":"SUMIFS(Sheet1!$H$4:$H$1497,Sheet1!$F$4:$F$1497,B78,Sheet1!$Z$4:$Z$1497,$H$3)","v":0},{"$f":"SUMIFS(Sheet1!$J$4:$J$15,Sheet1!$F$4:$F$15,B78,Sheet1!$Z$4:$Z$15,$H$3)","v":0},{"$f":"SUMIFS(Sheet1!$H$4:$H$1497,Sheet1!$F$4:$F$1497,B78,Sheet1!$Z$4:$Z$1497,$J$3)","v":0},null,null,"",{"$f":"IFERROR(IF(B77<\"\",SUMIFS(Sheet1!$L$4:$L$997,Sheet1!$F$4:$F$997,B77,Sheet1!$Z$4:$Z$997,$H$3)+F77/SUMIFS(Sheet1!$H$4:$H$997,Sheet1!$F$4:$F$997,B77,Sheet1!$Z$4:$Z$997,$H$3),F77/D77),\"\")","v":""},""]
[null,null,null,null,null,null,null,{"$f":"SUMIFS(Sheet1!$H$4:$H$1497,Sheet1!$F$4:$F$1497,B79,Sheet1!$Z$4:$Z$1497,$H$3)","v":0},{"$f":"SUMIFS(Sheet1!$J$4:$J$15,Sheet1!$F$4:$F$15,B79,Sheet1!$Z$4:$Z$15,$H$3)","v":0},{"$f":"SUMIFS(Sheet1!$H$4:$H$1497,Sheet1!$F$4:$F$1497,B79,Sheet1!$Z$4:$Z$1497,$J$3)","v":0},null,null,"",{"$f":"IFERROR(IF(B78<\"\",SUMIFS(Sheet1!$L$4:$L$997,Sheet1!$F$4:$F$997,B78,Sheet1!$Z$4:$Z$997,$H$3)+F78/SUMIFS(Sheet1!$H$4:$H$997,Sheet1!$F$4:$F$997,B78,Sheet1!$Z$4:$Z$997,$H$3),F78/D78),\"\")","v":""},""]
[null,null,null,null,null,null,null,{"$f":"SUMIFS(Sheet1!$H$4:$H$1497,Sheet1!$F$4:$F$1497,B80,Sheet1!$Z$4:$Z$1497,$H$3)","v":0},{"$f":"SUMIFS(Sheet1!$J$4:$J$15,Sheet1!$F$4:$F$15,B80,Sheet1!$Z$4:$Z$15,$H$3)","v":0},{"$f":"SUMIFS(Sheet1!$H$4:$H$1497,Sheet1!$F$4:$F$1497,B80,Sheet1!$Z$4:$Z$1497,$J$3)","v":0},null,null,"",{"$f":"IFERROR(IF(B79<\"\",SUMIFS(Sheet1!$L$4:$L$997,Sheet1!$F$4:$F$997,B79,Sheet1!$Z$4:$Z$997,$H$3)+F79/SUMIFS(Sheet1!$H$4:$H$997,Sheet1!$F$4:$F$997,B79,Sheet1!$Z$4:$Z$997,$H$3),F79/D79),\"\")","v":""},""]
[null,null,null,null,null,null,null,{"$f":"SUMIFS(Sheet1!$H$4:$H$1497,Sheet1!$F$4:$F$1497,B81,Sheet1!$Z$4:$Z$1497,$H$3)","v":0},{"$f":"SUMIFS(Sheet1!$J$4:$J$15,Sheet1!$F$4:$F$15,B81,Sheet1!$Z$4:$Z$15,$H$3)","v":0},{"$f":"SUMIFS(Sheet1!$H$4:$H$1497,Sheet1!$F$4:$F$1497,B81,Sheet1!$Z$4:$Z$1497,$J$3)","v":0},null,null,"",{"$f":"IFERROR(IF(B80<\"\",SUMIFS(Sheet1!$L$4:$L$997,Sheet1!$F$4:$F$997,B80,Sheet1!$Z$4:$Z$997,$H$3)+F80/SUMIFS(Sheet1!$H$4:$H$997,Sheet1!$F$4:$F$997,B80,Sheet1!$Z$4:$Z$997,$H$3),F80/D80),\"\")","v":""},""]
[null,null,null,null,null,null,null,{"$f":"SUMIFS(Sheet1!$H$4:$H$1497,Sheet1!$F$4:$F$1497,B82,Sheet1!$Z$4:$Z$1497,$H$3)","v":0},{"$f":"SUMIFS(Sheet1!$J$4:$J$15,Sheet1!$F$4:$F$15,B82,Sheet1!$Z$4:$Z$15,$H$3)","v":0},{"$f":"SUMIFS(Sheet1!$H$4:$H$1497,Sheet1!$F$4:$F$1497,B82,Sheet1!$Z$4:$Z$1497,$J$3)","v":0},null,null,"",{"$f":"IFERROR(IF(B81<\"\",SUMIFS(Sheet1!$L$4:$L$997,Sheet1!$F$4:$F$997,B81,Sheet1!$Z$4:$Z$997,$H$3)+F81/SUMIFS(Sheet1!$H$4:$H$997,Sheet1!$F$4:$F$997,B81,Sheet1!$Z$4:$Z$997,$H$3),F81/D81),\"\")","v":""},""]
[null,null,null,null,null,null,null,{"$f":"SUMIFS(Sheet1!$H$4:$H$1497,Sheet1!$F$4:$F$1497,B83,Sheet1!$Z$4:$Z$1497,$H$3)","v":0},{"$f":"SUMIFS(Sheet1!$J$4:$J$15,Sheet1!$F$4:$F$15,B83,Sheet1!$Z$4:$Z$15,$H$3)","v":0},{"$f":"SUMIFS(Sheet1!$H$4:$H$1497,Sheet1!$F$4:$F$1497,B83,Sheet1!$Z$4:$Z$1497,$J$3)","v":0},null,null,"",{"$f":"IFERROR(IF(B82<\"\",SUMIFS(Sheet1!$L$4:$L$997,Sheet1!$F$4:$F$997,B82,Sheet1!$Z$4:$Z$997,$H$3)+F82/SUMIFS(Sheet1!$H$4:$H$997,Sheet1!$F$4:$F$997,B82,Sheet1!$Z$4:$Z$997,$H$3),F82/D82),\"\")","v":""},""]
[null,null,null,null,null,null,null,{"$f":"SUMIFS(Sheet1!$H$4:$H$1497,Sheet1!$F$4:$F$1497,B84,Sheet1!$Z$4:$Z$1497,$H$3)","v":0},{"$f":"SUMIFS(Sheet1!$J$4:$J$15,Sheet1!$F$4:$F$15,B84,Sheet1!$Z$4:$Z$15,$H$3)","v":0},{"$f":"SUMIFS(Sheet1!$H$4:$H$1497,Sheet1!$F$4:$F$1497,B84,Sheet1!$Z$4:$Z$1497,$J$3)","v":0},null,null,"",{"$f":"IFERROR(IF(B83<\"\",SUMIFS(Sheet1!$L$4:$L$997,Sheet1!$F$4:$F$997,B83,Sheet1!$Z$4:$Z$997,$H$3)+F83/SUMIFS(Sheet1!$H$4:$H$997,Sheet1!$F$4:$F$997,B83,Sheet1!$Z$4:$Z$997,$H$3),F83/D83),\"\")","v":""},""]
[null,null,null,null,null,null,null,{"$f":"SUMIFS(Sheet1!$H$4:$H$1497,Sheet1!$F$4:$F$1497,B85,Sheet1!$Z$4:$Z$1497,$H$3)","v":0},{"$f":"SUMIFS(Sheet1!$J$4:$J$15,Sheet1!$F$4:$F$15,B85,Sheet1!$Z$4:$Z$15,$H$3)","v":0},{"$f":"SUMIFS(Sheet1!$H$4:$H$1497,Sheet1!$F$4:$F$1497,B85,Sheet1!$Z$4:$Z$1497,$J$3)","v":0},null,null,"",{"$f":"IFERROR(IF(B84<\"\",SUMIFS(Sheet1!$L$4:$L$997,Sheet1!$F$4:$F$997,B84,Sheet1!$Z$4:$Z$997,$H$3)+F84/SUMIFS(Sheet1!$H$4:$H$997,Sheet1!$F$4:$F$997,B84,Sheet1!$Z$4:$Z$997,$H$3),F84/D84),\"\")","v":""},""]
[null,null,null,null,null,null,null,{"$f":"SUMIFS(Sheet1!$H$4:$H$1497,Sheet1!$F$4:$F$1497,B86,Sheet1!$Z$4:$Z$1497,$H$3)","v":0},{"$f":"SUMIFS(Sheet1!$J$4:$J$15,Sheet1!$F$4:$F$15,B86,Sheet1!$Z$4:$Z$15,$H$3)","v":0},{"$f":"SUMIFS(Sheet1!$H$4:$H$1497,Sheet1!$F$4:$F$1497,B86,Sheet1!$Z$4:$Z$1497,$J$3)","v":0},null,null,"",{"$f":"IFERROR(IF(B85<\"\",SUMIFS(Sheet1!$L$4:$L$997,Sheet1!$F$4:$F$997,B85,Sheet1!$Z$4:$Z$997,$H$3)+F85/SUMIFS(Sheet1!$H$4:$H$997,Sheet1!$F$4:$F$997,B85,Sheet1!$Z$4:$Z$997,$H$3),F85/D85),\"\")","v":""},""]
[null,null,null,null,null,null,null,{"$f":"SUMIFS(Sheet1!$H$4:$H$1497,Sheet1!$F$4:$F$1497,B87,Sheet1!$Z$4:$Z$1497,$H$3)","v":0},{"$f":"SUMIFS(Sheet1!$J$4:$J$15,Sheet1!$F$4:$F$15,B87,Sheet1!$Z$4:$Z$15,$H$3)","v":0},{"$f":"SUMIFS(Sheet1!$H$4:$H$1497,Sheet1!$F$4:$F$1497,B87,Sheet1!$Z$4:$Z$1497,$J$3)","v":0},null,null,"",{"$f":"IFERROR(IF(B86<\"\",SUMIFS(Sheet1!$L$4:$L$997,Sheet1!$F$4:$F$997,B86,Sheet1!$Z$4:$Z$997,$H$3)+F86/SUMIFS(Sheet1!$H$4:$H$997,Sheet1!$F$4:$F$997,B86,Sheet1!$Z$4:$Z$997,$H$3),F86/D86),\"\")","v":""},""]
[null,null,null,null,null,null,null,{"$f":"SUMIFS(Sheet1!$H$4:$H$1497,Sheet1!$F$4:$F$1497,B88,Sheet1!$Z$4:$Z$1497,$H$3)","v":0},{"$f":"SUMIFS(Sheet1!$J$4:$J$15,Sheet1!$F$4:$F$15,B88,Sheet1!$Z$4:$Z$15,$H$3)","v":0},{"$f":"SUMIFS(Sheet1!$H$4:$H$1497,Sheet1!$F$4:$F$1497,B88,Sheet1!$Z$4:$Z$1497,$J$3)","v":0},null,null,"",{"$f":"IFERROR(IF(B87<\"\",SUMIFS(Sheet1!$L$4:$L$997,Sheet1!$F$4:$F$997,B87,Sheet1!$Z$4:$Z$997,$H$3)+F87/SUMIFS(Sheet1!$H$4:$H$997,Sheet1!$F$4:$F$997,B87,Sheet1!$Z$4:$Z$997,$H$3),F87/D87),\"\")","v":""},""]
[null,null,null,null,null,null,null,{"$f":"SUMIFS(Sheet1!$H$4:$H$1497,Sheet1!$F$4:$F$1497,B89,Sheet1!$Z$4:$Z$1497,$H$3)","v":0},{"$f":"SUMIFS(Sheet1!$J$4:$J$15,Sheet1!$F$4:$F$15,B89,Sheet1!$Z$4:$Z$15,$H$3)","v":0},{"$f":"SUMIFS(Sheet1!$H$4:$H$1497,Sheet1!$F$4:$F$1497,B89,Sheet1!$Z$4:$Z$1497,$J$3)","v":0},null,null,"",{"$f":"IFERROR(IF(B88<\"\",SUMIFS(Sheet1!$L$4:$L$997,Sheet1!$F$4:$F$997,B88,Sheet1!$Z$4:$Z$997,$H$3)+F88/SUMIFS(Sheet1!$H$4:$H$997,Sheet1!$F$4:$F$997,B88,Sheet1!$Z$4:$Z$997,$H$3),F88/D88),\"\")","v":""},""]
[null,null,null,null,null,null,null,{"$f":"SUMIFS(Sheet1!$H$4:$H$1497,Sheet1!$F$4:$F$1497,B90,Sheet1!$Z$4:$Z$1497,$H$3)","v":0},{"$f":"SUMIFS(Sheet1!$J$4:$J$15,Sheet1!$F$4:$F$15,B90,Sheet1!$Z$4:$Z$15,$H$3)","v":0},{"$f":"SUMIFS(Sheet1!$H$4:$H$1497,Sheet1!$F$4:$F$1497,B90,Sheet1!$Z$4:$Z$1497,$J$3)","v":0},null,null,"",{"$f":"IFERROR(IF(B89<\"\",SUMIFS(Sheet1!$L$4:$L$997,Sheet1!$F$4:$F$997,B89,Sheet1!$Z$4:$Z$997,$H$3)+F89/SUMIFS(Sheet1!$H$4:$H$997,Sheet1!$F$4:$F$997,B89,Sheet1!$Z$4:$Z$997,$H$3),F89/D89),\"\")","v":""},""]
[null,null,null,null,null,null,null,{"$f":"SUMIFS(Sheet1!$H$4:$H$1497,Sheet1!$F$4:$F$1497,B91,Sheet1!$Z$4:$Z$1497,$H$3)","v":0},{"$f":"SUMIFS(Sheet1!$J$4:$J$15,Sheet1!$F$4:$F$15,B91,Sheet1!$Z$4:$Z$15,$H$3)","v":0},{"$f":"SUMIFS(Sheet1!$H$4:$H$1497,Sheet1!$F$4:$F$1497,B91,Sheet1!$Z$4:$Z$1497,$J$3)","v":0},null,null,"",{"$f":"IFERROR(IF(B90<\"\",SUMIFS(Sheet1!$L$4:$L$997,Sheet1!$F$4:$F$997,B90,Sheet1!$Z$4:$Z$997,$H$3)+F90/SUMIFS(Sheet1!$H$4:$H$997,Sheet1!$F$4:$F$997,B90,Sheet1!$Z$4:$Z$997,$H$3),F90/D90),\"\")","v":""},""]
[null,null,null,null,null,null,null,{"$f":"SUMIFS(Sheet1!$H$4:$H$1497,Sheet1!$F$4:$F$1497,B92,Sheet1!$Z$4:$Z$1497,$H$3)","v":0},{"$f":"SUMIFS(Sheet1!$J$4:$J$15,Sheet1!$F$4:$F$15,B92,Sheet1!$Z$4:$Z$15,$H$3)","v":0},{"$f":"SUMIFS(Sheet1!$H$4:$H$1497,Sheet1!$F$4:$F$1497,B92,Sheet1!$Z$4:$Z$1497,$J$3)","v":0},null,null,"",{"$f":"IFERROR(IF(B91<\"\",SUMIFS(Sheet1!$L$4:$L$997,Sheet1!$F$4:$F$997,B91,Sheet1!$Z$4:$Z$997,$H$3)+F91/SUMIFS(Sheet1!$H$4:$H$997,Sheet1!$F$4:$F$997,B91,Sheet1!$Z$4:$Z$997,$H$3),F91/D91),\"\")","v":""},""]
[null,null,null,null,null,null,null,{"$f":"SUMIFS(Sheet1!$H$4:$H$1497,Sheet1!$F$4:$F$1497,B93,Sheet1!$Z$4:$Z$1497,$H$3)","v":0},{"$f":"SUMIFS(Sheet1!$J$4:$J$15,Sheet1!$F$4:$F$15,B93,Sheet1!$Z$4:$Z$15,$H$3)","v":0},{"$f":"SUMIFS(Sheet1!$H$4:$H$1497,Sheet1!$F$4:$F$1497,B93,Sheet1!$Z$4:$Z$1497,$J$3)","v":0},null,null,"",{"$f":"IFERROR(IF(B92<\"\",SUMIFS(Sheet1!$L$4:$L$997,Sheet1!$F$4:$F$997,B92,Sheet1!$Z$4:$Z$997,$H$3)+F92/SUMIFS(Sheet1!$H$4:$H$997,Sheet1!$F$4:$F$997,B92,Sheet1!$Z$4:$Z$997,$H$3),F92/D92),\"\")","v":""},""]
[null,null,null,null,null,null,null,{"$f":"SUMIFS(Sheet1!$H$4:$H$1497,Sheet1!$F$4:$F$1497,B94,Sheet1!$Z$4:$Z$1497,$H$3)","v":0},{"$f":"SUMIFS(Sheet1!$J$4:$J$15,Sheet1!$F$4:$F$15,B94,Sheet1!$Z$4:$Z$15,$H$3)","v":0},{"$f":"SUMIFS(Sheet1!$H$4:$H$1497,Sheet1!$F$4:$F$1497,B94,Sheet1!$Z$4:$Z$1497,$J$3)","v":0},null,null,"",{"$f":"IFERROR(IF(B93<\"\",SUMIFS(Sheet1!$L$4:$L$997,Sheet1!$F$4:$F$997,B93,Sheet1!$Z$4:$Z$997,$H$3)+F93/SUMIFS(Sheet1!$H$4:$H$997,Sheet1!$F$4:$F$997,B93,Sheet1!$Z$4:$Z$997,$H$3),F93/D93),\"\")","v":""},""]
[null,null,null,null,null,null,null,{"$f":"SUMIFS(Sheet1!$H$4:$H$1497,Sheet1!$F$4:$F$1497,B95,Sheet1!$Z$4:$Z$1497,$H$3)","v":0},{"$f":"SUMIFS(Sheet1!$J$4:$J$15,Sheet1!$F$4:$F$15,B95,Sheet1!$Z$4:$Z$15,$H$3)","v":0},{"$f":"SUMIFS(Sheet1!$H$4:$H$1497,Sheet1!$F$4:$F$1497,B95,Sheet1!$Z$4:$Z$1497,$J$3)","v":0},null,null,"",{"$f":"IFERROR(IF(B94<\"\",SUMIFS(Sheet1!$L$4:$L$997,Sheet1!$F$4:$F$997,B94,Sheet1!$Z$4:$Z$997,$H$3)+F94/SUMIFS(Sheet1!$H$4:$H$997,Sheet1!$F$4:$F$997,B94,Sheet1!$Z$4:$Z$997,$H$3),F94/D94),\"\")","v":""},""]
[null,null,null,null,null,null,null,{"$f":"SUMIFS(Sheet1!$H$4:$H$1497,Sheet1!$F$4:$F$1497,B96,Sheet1!$Z$4:$Z$1497,$H$3)","v":0},{"$f":"SUMIFS(Sheet1!$J$4:$J$15,Sheet1!$F$4:$F$15,B96,Sheet1!$Z$4:$Z$15,$H$3)","v":0},{"$f":"SUMIFS(Sheet1!$H$4:$H$1497,Sheet1!$F$4:$F$1497,B96,Sheet1!$Z$4:$Z$1497,$J$3)","v":0},null,null,"",{"$f":"IFERROR(IF(B95<\"\",SUMIFS(Sheet1!$L$4:$L$997,Sheet1!$F$4:$F$997,B95,Sheet1!$Z$4:$Z$997,$H$3)+F95/SUMIFS(Sheet1!$H$4:$H$997,Sheet1!$F$4:$F$997,B95,Sheet1!$Z$4:$Z$997,$H$3),F95/D95),\"\")","v":""},""]
[null,null,null,null,null,null,null,{"$f":"SUMIFS(Sheet1!$H$4:$H$1497,Sheet1!$F$4:$F$1497,B97,Sheet1!$Z$4:$Z$1497,$H$3)","v":0},{"$f":"SUMIFS(Sheet1!$J$4:$J$15,Sheet1!$F$4:$F$15,B97,Sheet1!$Z$4:$Z$15,$H$3)","v":0},{"$f":"SUMIFS(Sheet1!$H$4:$H$1497,Sheet1!$F$4:$F$1497,B97,Sheet1!$Z$4:$Z$1497,$J$3)","v":0},null,null,"",{"$f":"IFERROR(IF(B96<\"\",SUMIFS(Sheet1!$L$4:$L$997,Sheet1!$F$4:$F$997,B96,Sheet1!$Z$4:$Z$997,$H$3)+F96/SUMIFS(Sheet1!$H$4:$H$997,Sheet1!$F$4:$F$997,B96,Sheet1!$Z$4:$Z$997,$H$3),F96/D96),\"\")","v":""},""]
[null,null,null,null,null,null,null,{"$f":"SUMIFS(Sheet1!$H$4:$H$1497,Sheet1!$F$4:$F$1497,B98,Sheet1!$Z$4:$Z$1497,$H$3)","v":0},{"$f":"SUMIFS(Sheet1!$J$4:$J$15,Sheet1!$F$4:$F$15,B98,Sheet1!$Z$4:$Z$15,$H$3)","v":0},{"$f":"SUMIFS(Sheet1!$H$4:$H$1497,Sheet1!$F$4:$F$1497,B98,Sheet1!$Z$4:$Z$1497,$J$3)","v":0},null,null,"",{"$f":"IFERROR(IF(B97<\"\",SUMIFS(Sheet1!$L$4:$L$997,Sheet1!$F$4:$F$997,B97,Sheet1!$Z$4:$Z$997,$H$3)+F97/SUMIFS(Sheet1!$H$4:$H$997,Sheet1!$F$4:$F$997,B97,Sheet1!$Z$4:$Z$997,$H$3),F97/D97),\"\")","v":""},""]
[null,null,null,null,null,null,null,{"$f":"SUMIFS(Sheet1!$H$4:$H$1497,Sheet1!$F$4:$F$1497,B99,Sheet1!$Z$4:$Z$1497,$H$3)","v":0},{"$f":"SUMIFS(Sheet1!$J$4:$J$15,Sheet1!$F$4:$F$15,B99,Sheet1!$Z$4:$Z$15,$H$3)","v":0},{"$f":"SUMIFS(Sheet1!$H$4:$H$1497,Sheet1!$F$4:$F$1497,B99,Sheet1!$Z$4:$Z$1497,$J$3)","v":0},null,null,"",{"$f":"IFERROR(IF(B98<\"\",SUMIFS(Sheet1!$L$4:$L$997,Sheet1!$F$4:$F$997,B98,Sheet1!$Z$4:$Z$997,$H$3)+F98/SUMIFS(Sheet1!$H$4:$H$997,Sheet1!$F$4:$F$997,B98,Sheet1!$Z$4:$Z$997,$H$3),F98/D98),\"\")","v":""},""]
[null,null,null,null,null,null,null,{"$f":"SUMIFS(Sheet1!$H$4:$H$1497,Sheet1!$F$4:$F$1497,B100,Sheet1!$Z$4:$Z$1497,$H$3)","v":0},{"$f":"SUMIFS(Sheet1!$J$4:$J$15,Sheet1!$F$4:$F$15,B100,Sheet1!$Z$4:$Z$15,$H$3)","v":0},{"$f":"SUMIFS(Sheet1!$H$4:$H$1497,Sheet1!$F$4:$F$1497,B100,Sheet1!$Z$4:$Z$1497,$J$3)","v":0},null,null,"",{"$f":"IFERROR(IF(B99<\"\",SUMIFS(Sheet1!$L$4:$L$997,Sheet1!$F$4:$F$997,B99,Sheet1!$Z$4:$Z$997,$H$3)+F99/SUMIFS(Sheet1!$H$4:$H$997,Sheet1!$F$4:$F$997,B99,Sheet1!$Z$4:$Z$997,$H$3),F99/D99),\"\")","v":""},""]
[null,null,null,null,null,null,null,{"$f":"SUMIFS(Sheet1!$H$4:$H$1497,Sheet1!$F$4:$F$1497,B101,Sheet1!$Z$4:$Z$1497,$H$3)","v":0},{"$f":"SUMIFS(Sheet1!$J$4:$J$15,Sheet1!$F$4:$F$15,B101,Sheet1!$Z$4:$Z$15,$H$3)","v":0},{"$f":"SUMIFS(Sheet1!$H$4:$H$1497,Sheet1!$F$4:$F$1497,B101,Sheet1!$Z$4:$Z$1497,$J$3)","v":0},null,null,"",{"$f":"IFERROR(IF(B100<\"\",SUMIFS(Sheet1!$L$4:$L$997,Sheet1!$F$4:$F$997,B100,Sheet1!$Z$4:$Z$997,$H$3)+F100/SUMIFS(Sheet1!$H$4:$H$997,Sheet1!$F$4:$F$997,B100,Sheet1!$Z$4:$Z$997,$H$3),F100/D100),\"\")","v":""},""]
[null,null,null,null,null,null,null,{"$f":"SUMIFS(Sheet1!$H$4:$H$1497,Sheet1!$F$4:$F$1497,B102,Sheet1!$Z$4:$Z$1497,$H$3)","v":0},{"$f":"SUMIFS(Sheet1!$J$4:$J$15,Sheet1!$F$4:$F$15,B102,Sheet1!$Z$4:$Z$15,$H$3)","v":0},{"$f":"SUMIFS(Sheet1!$H$4:$H$1497,Sheet1!$F$4:$F$1497,B102,Sheet1!$Z$4:$Z$1497,$J$3)","v":0},null,null,"",{"$f":"IFERROR(IF(B101<\"\",SUMIFS(Sheet1!$L$4:$L$997,Sheet1!$F$4:$F$997,B101,Sheet1!$Z$4:$Z$997,$H$3)+F101/SUMIFS(Sheet1!$H$4:$H$997,Sheet1!$F$4:$F$997,B101,Sheet1!$Z$4:$Z$997,$H$3),F101/D101),\"\")","v":""},""]
[null,null,null,null,null,null,null,{"$f":"SUMIFS(Sheet1!$H$4:$H$1497,Sheet1!$F$4:$F$1497,B103,Sheet1!$Z$4:$Z$1497,$H$3)","v":0},{"$f":"SUMIFS(Sheet1!$J$4:$J$15,Sheet1!$F$4:$F$15,B103,Sheet1!$Z$4:$Z$15,$H$3)","v":0},{"$f":"SUMIFS(Sheet1!$H$4:$H$1497,Sheet1!$F$4:$F$1497,B103,Sheet1!$Z$4:$Z$1497,$J$3)","v":0},null,null,"",{"$f":"IFERROR(IF(B102<\"\",SUMIFS(Sheet1!$L$4:$L$997,Sheet1!$F$4:$F$997,B102,Sheet1!$Z$4:$Z$997,$H$3)+F102/SUMIFS(Sheet1!$H$4:$H$997,Sheet1!$F$4:$F$997,B102,Sheet1!$Z$4:$Z$997,$H$3),F102/D102),\"\")","v":""},""]
[null,null,null,null,null,null,null,{"$f":"SUMIFS(Sheet1!$H$4:$H$1497,Sheet1!$F$4:$F$1497,B104,Sheet1!$Z$4:$Z$1497,$H$3)","v":0},{"$f":"SUMIFS(Sheet1!$J$4:$J$15,Sheet1!$F$4:$F$15,B104,Sheet1!$Z$4:$Z$15,$H$3)","v":0},{"$f":"SUMIFS(Sheet1!$H$4:$H$1497,Sheet1!$F$4:$F$1497,B104,Sheet1!$Z$4:$Z$1497,$J$3)","v":0},null,null,"",{"$f":"IFERROR(IF(B103<\"\",SUMIFS(Sheet1!$L$4:$L$997,Sheet1!$F$4:$F$997,B103,Sheet1!$Z$4:$Z$997,$H$3)+F103/SUMIFS(Sheet1!$H$4:$H$997,Sheet1!$F$4:$F$997,B103,Sheet1!$Z$4:$Z$997,$H$3),F103/D103),\"\")","v":""},""]
[null,null,null,null,null,null,null,{"$f":"SUMIFS(Sheet1!$H$4:$H$1497,Sheet1!$F$4:$F$1497,B105,Sheet1!$Z$4:$Z$1497,$H$3)","v":0},{"$f":"SUMIFS(Sheet1!$J$4:$J$15,Sheet1!$F$4:$F$15,B105,Sheet1!$Z$4:$Z$15,$H$3)","v":0},{"$f":"SUMIFS(Sheet1!$H$4:$H$1497,Sheet1!$F$4:$F$1497,B105,Sheet1!$Z$4:$Z$1497,$J$3)","v":0},null,null,"",{"$f":"IFERROR(IF(B104<\"\",SUMIFS(Sheet1!$L$4:$L$997,Sheet1!$F$4:$F$997,B104,Sheet1!$Z$4:$Z$997,$H$3)+F104/SUMIFS(Sheet1!$H$4:$H$997,Sheet1!$F$4:$F$997,B104,Sheet1!$Z$4:$Z$997,$H$3),F104/D104),\"\")","v":""},""]
[null,null,null,null,null,null,null,{"$f":"SUMIFS(Sheet1!$H$4:$H$1497,Sheet1!$F$4:$F$1497,B106,Sheet1!$Z$4:$Z$1497,$H$3)","v":0},{"$f":"SUMIFS(Sheet1!$J$4:$J$15,Sheet1!$F$4:$F$15,B106,Sheet1!$Z$4:$Z$15,$H$3)","v":0},{"$f":"SUMIFS(Sheet1!$H$4:$H$1497,Sheet1!$F$4:$F$1497,B106,Sheet1!$Z$4:$Z$1497,$J$3)","v":0},null,null,"",{"$f":"IFERROR(IF(B105<\"\",SUMIFS(Sheet1!$L$4:$L$997,Sheet1!$F$4:$F$997,B105,Sheet1!$Z$4:$Z$997,$H$3)+F105/SUMIFS(Sheet1!$H$4:$H$997,Sheet1!$F$4:$F$997,B105,Sheet1!$Z$4:$Z$997,$H$3),F105/D105),\"\")","v":""},""]
[null,null,null,null,null,null,null,{"$f":"SUMIFS(Sheet1!$H$4:$H$1497,Sheet1!$F$4:$F$1497,B107,Sheet1!$Z$4:$Z$1497,$H$3)","v":0},{"$f":"SUMIFS(Sheet1!$J$4:$J$15,Sheet1!$F$4:$F$15,B107,Sheet1!$Z$4:$Z$15,$H$3)","v":0},{"$f":"SUMIFS(Sheet1!$H$4:$H$1497,Sheet1!$F$4:$F$1497,B107,Sheet1!$Z$4:$Z$1497,$J$3)","v":0},null,null,"",{"$f":"IFERROR(IF(B106<\"\",SUMIFS(Sheet1!$L$4:$L$997,Sheet1!$F$4:$F$997,B106,Sheet1!$Z$4:$Z$997,$H$3)+F106/SUMIFS(Sheet1!$H$4:$H$997,Sheet1!$F$4:$F$997,B106,Sheet1!$Z$4:$Z$997,$H$3),F106/D106),\"\")","v":""},""]
[null,null,null,null,null,null,null,{"$f":"SUMIFS(Sheet1!$H$4:$H$1497,Sheet1!$F$4:$F$1497,B108,Sheet1!$Z$4:$Z$1497,$H$3)","v":0},{"$f":"SUMIFS(Sheet1!$J$4:$J$15,Sheet1!$F$4:$F$15,B108,Sheet1!$Z$4:$Z$15,$H$3)","v":0},{"$f":"SUMIFS(Sheet1!$H$4:$H$1497,Sheet1!$F$4:$F$1497,B108,Sheet1!$Z$4:$Z$1497,$J$3)","v":0},null,null,"",{"$f":"IFERROR(IF(B107<\"\",SUMIFS(Sheet1!$L$4:$L$997,Sheet1!$F$4:$F$997,B107,Sheet1!$Z$4:$Z$997,$H$3)+F107/SUMIFS(Sheet1!$H$4:$H$997,Sheet1!$F$4:$F$997,B107,Sheet1!$Z$4:$Z$997,$H$3),F107/D107),\"\")","v":""},""]
[null,null,null,null,null,null,null,{"$f":"SUMIFS(Sheet1!$H$4:$H$1497,Sheet1!$F$4:$F$1497,B109,Sheet1!$Z$4:$Z$1497,$H$3)","v":0},{"$f":"SUMIFS(Sheet1!$J$4:$J$15,Sheet1!$F$4:$F$15,B109,Sheet1!$Z$4:$Z$15,$H$3)","v":0},{"$f":"SUMIFS(Sheet1!$H$4:$H$1497,Sheet1!$F$4:$F$1497,B109,Sheet1!$Z$4:$Z$1497,$J$3)","v":0},null,null,"",{"$f":"IFERROR(IF(B108<\"\",SUMIFS(Sheet1!$L$4:$L$997,Sheet1!$F$4:$F$997,B108,Sheet1!$Z$4:$Z$997,$H$3)+F108/SUMIFS(Sheet1!$H$4:$H$997,Sheet1!$F$4:$F$997,B108,Sheet1!$Z$4:$Z$997,$H$3),F108/D108),\"\")","v":""},""]
[null,null,null,null,null,null,null,{"$f":"SUMIFS(Sheet1!$H$4:$H$1497,Sheet1!$F$4:$F$1497,B110,Sheet1!$Z$4:$Z$1497,$H$3)","v":0},{"$f":"SUMIFS(Sheet1!$J$4:$J$15,Sheet1!$F$4:$F$15,B110,Sheet1!$Z$4:$Z$15,$H$3)","v":0},{"$f":"SUMIFS(Sheet1!$H$4:$H$1497,Sheet1!$F$4:$F$1497,B110,Sheet1!$Z$4:$Z$1497,$J$3)","v":0},null,null,"",{"$f":"IFERROR(IF(B109<\"\",SUMIFS(Sheet1!$L$4:$L$997,Sheet1!$F$4:$F$997,B109,Sheet1!$Z$4:$Z$997,$H$3)+F109/SUMIFS(Sheet1!$H$4:$H$997,Sheet1!$F$4:$F$997,B109,Sheet1!$Z$4:$Z$997,$H$3),F109/D109),\"\")","v":""},""]
[null,null,null,null,null,null,null,{"$f":"SUMIFS(Sheet1!$H$4:$H$1497,Sheet1!$F$4:$F$1497,B111,Sheet1!$Z$4:$Z$1497,$H$3)","v":0},{"$f":"SUMIFS(Sheet1!$J$4:$J$15,Sheet1!$F$4:$F$15,B111,Sheet1!$Z$4:$Z$15,$H$3)","v":0},{"$f":"SUMIFS(Sheet1!$H$4:$H$1497,Sheet1!$F$4:$F$1497,B111,Sheet1!$Z$4:$Z$1497,$J$3)","v":0},null,null,"",{"$f":"IFERROR(IF(B110<\"\",SUMIFS(Sheet1!$L$4:$L$997,Sheet1!$F$4:$F$997,B110,Sheet1!$Z$4:$Z$997,$H$3)+F110/SUMIFS(Sheet1!$H$4:$H$997,Sheet1!$F$4:$F$997,B110,Sheet1!$Z$4:$Z$997,$H$3),F110/D110),\"\")","v":""},""]
[null,null,null,null,null,null,null,{"$f":"SUMIFS(Sheet1!$H$4:$H$1497,Sheet1!$F$4:$F$1497,B112,Sheet1!$Z$4:$Z$1497,$H$3)","v":0},{"$f":"SUMIFS(Sheet1!$J$4:$J$15,Sheet1!$F$4:$F$15,B112,Sheet1!$Z$4:$Z$15,$H$3)","v":0},{"$f":"SUMIFS(Sheet1!$H$4:$H$1497,Sheet1!$F$4:$F$1497,B112,Sheet1!$Z$4:$Z$1497,$J$3)","v":0},null,null,"",{"$f":"IFERROR(IF(B111<\"\",SUMIFS(Sheet1!$L$4:$L$997,Sheet1!$F$4:$F$997,B111,Sheet1!$Z$4:$Z$997,$H$3)+F111/SUMIFS(Sheet1!$H$4:$H$997,Sheet1!$F$4:$F$997,B111,Sheet1!$Z$4:$Z$997,$H$3),F111/D111),\"\")","v":""},""]
[null,null,null,null,null,null,null,{"$f":"SUMIFS(Sheet1!$H$4:$H$1497,Sheet1!$F$4:$F$1497,B113,Sheet1!$Z$4:$Z$1497,$H$3)","v":0},{"$f":"SUMIFS(Sheet1!$J$4:$J$15,Sheet1!$F$4:$F$15,B113,Sheet1!$Z$4:$Z$15,$H$3)","v":0},{"$f":"SUMIFS(Sheet1!$H$4:$H$1497,Sheet1!$F$4:$F$1497,B113,Sheet1!$Z$4:$Z$1497,$J$3)","v":0},null,null,"",{"$f":"IFERROR(IF(B112<\"\",SUMIFS(Sheet1!$L$4:$L$997,Sheet1!$F$4:$F$997,B112,Sheet1!$Z$4:$Z$997,$H$3)+F112/SUMIFS(Sheet1!$H$4:$H$997,Sheet1!$F$4:$F$997,B112,Sheet1!$Z$4:$Z$997,$H$3),F112/D112),\"\")","v":""},""]
[null,null,null,null,null,null,null,{"$f":"SUMIFS(Sheet1!$H$4:$H$1497,Sheet1!$F$4:$F$1497,B114,Sheet1!$Z$4:$Z$1497,$H$3)","v":0},{"$f":"SUMIFS(Sheet1!$J$4:$J$15,Sheet1!$F$4:$F$15,B114,Sheet1!$Z$4:$Z$15,$H$3)","v":0},{"$f":"SUMIFS(Sheet1!$H$4:$H$1497,Sheet1!$F$4:$F$1497,B114,Sheet1!$Z$4:$Z$1497,$J$3)","v":0},null,null,"",{"$f":"IFERROR(IF(B113<\"\",SUMIFS(Sheet1!$L$4:$L$997,Sheet1!$F$4:$F$997,B113,Sheet1!$Z$4:$Z$997,$H$3)+F113/SUMIFS(Sheet1!$H$4:$H$997,Sheet1!$F$4:$F$997,B113,Sheet1!$Z$4:$Z$997,$H$3),F113/D113),\"\")","v":""},""]
[null,null,null,null,null,null,null,{"$f":"SUMIFS(Sheet1!$H$4:$H$1497,Sheet1!$F$4:$F$1497,B115,Sheet1!$Z$4:$Z$1497,$H$3)","v":0},{"$f":"SUMIFS(Sheet1!$J$4:$J$15,Sheet1!$F$4:$F$15,B115,Sheet1!$Z$4:$Z$15,$H$3)","v":0},{"$f":"SUMIFS(Sheet1!$H$4:$H$1497,Sheet1!$F$4:$F$1497,B115,Sheet1!$Z$4:$Z$1497,$J$3)","v":0},null,null,"",{"$f":"IFERROR(IF(B114<\"\",SUMIFS(Sheet1!$L$4:$L$997,Sheet1!$F$4:$F$997,B114,Sheet1!$Z$4:$Z$997,$H$3)+F114/SUMIFS(Sheet1!$H$4:$H$997,Sheet1!$F$4:$F$997,B114,Sheet1!$Z$4:$Z$997,$H$3),F114/D114),\"\")","v":""},""]
[null,null,null,null,null,null,null,{"$f":"SUMIFS(Sheet1!$H$4:$H$1497,Sheet1!$F$4:$F$1497,B116,Sheet1!$Z$4:$Z$1497,$H$3)","v":0},{"$f":"SUMIFS(Sheet1!$J$4:$J$15,Sheet1!$F$4:$F$15,B116,Sheet1!$Z$4:$Z$15,$H$3)","v":0},{"$f":"SUMIFS(Sheet1!$H$4:$H$1497,Sheet1!$F$4:$F$1497,B116,Sheet1!$Z$4:$Z$1497,$J$3)","v":0},null,null,"",{"$f":"IFERROR(IF(B115<\"\",SUMIFS(Sheet1!$L$4:$L$997,Sheet1!$F$4:$F$997,B115,Sheet1!$Z$4:$Z$997,$H$3)+F115/SUMIFS(Sheet1!$H$4:$H$997,Sheet1!$F$4:$F$997,B115,Sheet1!$Z$4:$Z$997,$H$3),F115/D115),\"\")","v":""},""]
[null,null,null,null,null,null,null,{"$f":"SUMIFS(Sheet1!$H$4:$H$1497,Sheet1!$F$4:$F$1497,B117,Sheet1!$Z$4:$Z$1497,$H$3)","v":0},{"$f":"SUMIFS(Sheet1!$J$4:$J$15,Sheet1!$F$4:$F$15,B117,Sheet1!$Z$4:$Z$15,$H$3)","v":0},{"$f":"SUMIFS(Sheet1!$H$4:$H$1497,Sheet1!$F$4:$F$1497,B117,Sheet1!$Z$4:$Z$1497,$J$3)","v":0},null,null,"",{"$f":"IFERROR(IF(B116<\"\",SUMIFS(Sheet1!$L$4:$L$997,Sheet1!$F$4:$F$997,B116,Sheet1!$Z$4:$Z$997,$H$3)+F116/SUMIFS(Sheet1!$H$4:$H$997,Sheet1!$F$4:$F$997,B116,Sheet1!$Z$4:$Z$997,$H$3),F116/D116),\"\")","v":""},""]
[null,null,null,null,null,null,null,{"$f":"SUMIFS(Sheet1!$H$4:$H$1497,Sheet1!$F$4:$F$1497,B118,Sheet1!$Z$4:$Z$1497,$H$3)","v":0},{"$f":"SUMIFS(Sheet1!$J$4:$J$15,Sheet1!$F$4:$F$15,B118,Sheet1!$Z$4:$Z$15,$H$3)","v":0},{"$f":"SUMIFS(Sheet1!$H$4:$H$1497,Sheet1!$F$4:$F$1497,B118,Sheet1!$Z$4:$Z$1497,$J$3)","v":0},null,null,"",{"$f":"IFERROR(IF(B117<\"\",SUMIFS(Sheet1!$L$4:$L$997,Sheet1!$F$4:$F$997,B117,Sheet1!$Z$4:$Z$997,$H$3)+F117/SUMIFS(Sheet1!$H$4:$H$997,Sheet1!$F$4:$F$997,B117,Sheet1!$Z$4:$Z$997,$H$3),F117/D117),\"\")","v":""},""]
[null,null,null,null,null,null,null,{"$f":"SUMIFS(Sheet1!$H$4:$H$1497,Sheet1!$F$4:$F$1497,B119,Sheet1!$Z$4:$Z$1497,$H$3)","v":0},{"$f":"SUMIFS(Sheet1!$J$4:$J$15,Sheet1!$F$4:$F$15,B119,Sheet1!$Z$4:$Z$15,$H$3)","v":0},{"$f":"SUMIFS(Sheet1!$H$4:$H$1497,Sheet1!$F$4:$F$1497,B119,Sheet1!$Z$4:$Z$1497,$J$3)","v":0},null,null,"",{"$f":"IFERROR(IF(B118<\"\",SUMIFS(Sheet1!$L$4:$L$997,Sheet1!$F$4:$F$997,B118,Sheet1!$Z$4:$Z$997,$H$3)+F118/SUMIFS(Sheet1!$H$4:$H$997,Sheet1!$F$4:$F$997,B118,Sheet1!$Z$4:$Z$997,$H$3),F118/D118),\"\")","v":""},""]
[null,null,null,null,null,null,null,{"$f":"SUMIFS(Sheet1!$H$4:$H$1497,Sheet1!$F$4:$F$1497,B120,Sheet1!$Z$4:$Z$1497,$H$3)","v":0},{"$f":"SUMIFS(Sheet1!$J$4:$J$15,Sheet1!$F$4:$F$15,B120,Sheet1!$Z$4:$Z$15,$H$3)","v":0},{"$f":"SUMIFS(Sheet1!$H$4:$H$1497,Sheet1!$F$4:$F$1497,B120,Sheet1!$Z$4:$Z$1497,$J$3)","v":0},null,null,"",{"$f":"IFERROR(IF(B119<\"\",SUMIFS(Sheet1!$L$4:$L$997,Sheet1!$F$4:$F$997,B119,Sheet1!$Z$4:$Z$997,$H$3)+F119/SUMIFS(Sheet1!$H$4:$H$997,Sheet1!$F$4:$F$997,B119,Sheet1!$Z$4:$Z$997,$H$3),F119/D119),\"\")","v":""},""]
[null,null,null,null,null,null,null,{"$f":"SUMIFS(Sheet1!$H$4:$H$1497,Sheet1!$F$4:$F$1497,B121,Sheet1!$Z$4:$Z$1497,$H$3)","v":0},{"$f":"SUMIFS(Sheet1!$J$4:$J$15,Sheet1!$F$4:$F$15,B121,Sheet1!$Z$4:$Z$15,$H$3)","v":0},{"$f":"SUMIFS(Sheet1!$H$4:$H$1497,Sheet1!$F$4:$F$1497,B121,Sheet1!$Z$4:$Z$1497,$J$3)","v":0},null,null,"",{"$f":"IFERROR(IF(B120<\"\",SUMIFS(Sheet1!$L$4:$L$997,Sheet1!$F$4:$F$997,B120,Sheet1!$Z$4:$Z$997,$H$3)+F120/SUMIFS(Sheet1!$H$4:$H$997,Sheet1!$F$4:$F$997,B120,Sheet1!$Z$4:$Z$997,$H$3),F120/D120),\"\")","v":""},""]
[null,null,null,null,null,null,null,{"$f":"SUMIFS(Sheet1!$H$4:$H$1497,Sheet1!$F$4:$F$1497,B122,Sheet1!$Z$4:$Z$1497,$H$3)","v":0},{"$f":"SUMIFS(Sheet1!$J$4:$J$15,Sheet1!$F$4:$F$15,B122,Sheet1!$Z$4:$Z$15,$H$3)","v":0},{"$f":"SUMIFS(Sheet1!$H$4:$H$1497,Sheet1!$F$4:$F$1497,B122,Sheet1!$Z$4:$Z$1497,$J$3)","v":0},null,null,"",{"$f":"IFERROR(IF(B121<\"\",SUMIFS(Sheet1!$L$4:$L$997,Sheet1!$F$4:$F$997,B121,Sheet1!$Z$4:$Z$997,$H$3)+F121/SUMIFS(Sheet1!$H$4:$H$997,Sheet1!$F$4:$F$997,B121,Sheet1!$Z$4:$Z$997,$H$3),F121/D121),\"\")","v":""},""]
[null,null,null,null,null,null,null,{"$f":"SUMIFS(Sheet1!$H$4:$H$1497,Sheet1!$F$4:$F$1497,B123,Sheet1!$Z$4:$Z$1497,$H$3)","v":0},{"$f":"SUMIFS(Sheet1!$J$4:$J$15,Sheet1!$F$4:$F$15,B123,Sheet1!$Z$4:$Z$15,$H$3)","v":0},{"$f":"SUMIFS(Sheet1!$H$4:$H$1497,Sheet1!$F$4:$F$1497,B123,Sheet1!$Z$4:$Z$1497,$J$3)","v":0},null,null,"",{"$f":"IFERROR(IF(B122<\"\",SUMIFS(Sheet1!$L$4:$L$997,Sheet1!$F$4:$F$997,B122,Sheet1!$Z$4:$Z$997,$H$3)+F122/SUMIFS(Sheet1!$H$4:$H$997,Sheet1!$F$4:$F$997,B122,Sheet1!$Z$4:$Z$997,$H$3),F122/D122),\"\")","v":""},""]
[null,null,null,null,null,null,null,{"$f":"SUMIFS(Sheet1!$H$4:$H$1497,Sheet1!$F$4:$F$1497,B124,Sheet1!$Z$4:$Z$1497,$H$3)","v":0},{"$f":"SUMIFS(Sheet1!$J$4:$J$15,Sheet1!$F$4:$F$15,B124,Sheet1!$Z$4:$Z$15,$H$3)","v":0},{"$f":"SUMIFS(Sheet1!$H$4:$H$1497,Sheet1!$F$4:$F$1497,B124,Sheet1!$Z$4:$Z$1497,$J$3)","v":0},null,null,"",{"$f":"IFERROR(IF(B123<\"\",SUMIFS(Sheet1!$L$4:$L$997,Sheet1!$F$4:$F$997,B123,Sheet1!$Z$4:$Z$997,$H$3)+F123/SUMIFS(Sheet1!$H$4:$H$997,Sheet1!$F$4:$F$997,B123,Sheet1!$Z$4:$Z$997,$H$3),F123/D123),\"\")","v":""},""]
[null,null,null,null,null,null,null,{"$f":"SUMIFS(Sheet1!$H$4:$H$1497,Sheet1!$F$4:$F$1497,B125,Sheet1!$Z$4:$Z$1497,$H$3)","v":0},{"$f":"SUMIFS(Sheet1!$J$4:$J$15,Sheet1!$F$4:$F$15,B125,Sheet1!$Z$4:$Z$15,$H$3)","v":0},{"$f":"SUMIFS(Sheet1!$H$4:$H$1497,Sheet1!$F$4:$F$1497,B125,Sheet1!$Z$4:$Z$1497,$J$3)","v":0},null,null,"",{"$f":"IFERROR(IF(B124<\"\",SUMIFS(Sheet1!$L$4:$L$997,Sheet1!$F$4:$F$997,B124,Sheet1!$Z$4:$Z$997,$H$3)+F124/SUMIFS(Sheet1!$H$4:$H$997,Sheet1!$F$4:$F$997,B124,Sheet1!$Z$4:$Z$997,$H$3),F124/D124),\"\")","v":""},""]
[null,null,null,null,null,null,null,{"$f":"SUMIFS(Sheet1!$H$4:$H$1497,Sheet1!$F$4:$F$1497,B126,Sheet1!$Z$4:$Z$1497,$H$3)","v":0},{"$f":"SUMIFS(Sheet1!$J$4:$J$15,Sheet1!$F$4:$F$15,B126,Sheet1!$Z$4:$Z$15,$H$3)","v":0},{"$f":"SUMIFS(Sheet1!$H$4:$H$1497,Sheet1!$F$4:$F$1497,B126,Sheet1!$Z$4:$Z$1497,$J$3)","v":0},null,null,"",{"$f":"IFERROR(IF(B125<\"\",SUMIFS(Sheet1!$L$4:$L$997,Sheet1!$F$4:$F$997,B125,Sheet1!$Z$4:$Z$997,$H$3)+F125/SUMIFS(Sheet1!$H$4:$H$997,Sheet1!$F$4:$F$997,B125,Sheet1!$Z$4:$Z$997,$H$3),F125/D125),\"\")","v":""},""]
[null,null,null,null,null,null,null,{"$f":"SUMIFS(Sheet1!$H$4:$H$1497,Sheet1!$F$4:$F$1497,B127,Sheet1!$Z$4:$Z$1497,$H$3)","v":0},{"$f":"SUMIFS(Sheet1!$J$4:$J$15,Sheet1!$F$4:$F$15,B127,Sheet1!$Z$4:$Z$15,$H$3)","v":0},{"$f":"SUMIFS(Sheet1!$H$4:$H$1497,Sheet1!$F$4:$F$1497,B127,Sheet1!$Z$4:$Z$1497,$J$3)","v":0},null,null,"",{"$f":"IFERROR(IF(B126<\"\",SUMIFS(Sheet1!$L$4:$L$997,Sheet1!$F$4:$F$997,B126,Sheet1!$Z$4:$Z$997,$H$3)+F126/SUMIFS(Sheet1!$H$4:$H$997,Sheet1!$F$4:$F$997,B126,Sheet1!$Z$4:$Z$997,$H$3),F126/D126),\"\")","v":""},""]
[null,null,null,null,null,null,null,{"$f":"SUMIFS(Sheet1!$H$4:$H$1497,Sheet1!$F$4:$F$1497,B128,Sheet1!$Z$4:$Z$1497,$H$3)","v":0},{"$f":"SUMIFS(Sheet1!$J$4:$J$15,Sheet1!$F$4:$F$15,B128,Sheet1!$Z$4:$Z$15,$H$3)","v":0},{"$f":"SUMIFS(Sheet1!$H$4:$H$1497,Sheet1!$F$4:$F$1497,B128,Sheet1!$Z$4:$Z$1497,$J$3)","v":0},null,null,"",{"$f":"IFERROR(IF(B127<\"\",SUMIFS(Sheet1!$L$4:$L$997,Sheet1!$F$4:$F$997,B127,Sheet1!$Z$4:$Z$997,$H$3)+F127/SUMIFS(Sheet1!$H$4:$H$997,Sheet1!$F$4:$F$997,B127,Sheet1!$Z$4:$Z$997,$H$3),F127/D127),\"\")","v":""},""]
[null,null,null,null,null,null,null,{"$f":"SUMIFS(Sheet1!$H$4:$H$1497,Sheet1!$F$4:$F$1497,B129,Sheet1!$Z$4:$Z$1497,$H$3)","v":0},{"$f":"SUMIFS(Sheet1!$J$4:$J$15,Sheet1!$F$4:$F$15,B129,Sheet1!$Z$4:$Z$15,$H$3)","v":0},{"$f":"SUMIFS(Sheet1!$H$4:$H$1497,Sheet1!$F$4:$F$1497,B129,Sheet1!$Z$4:$Z$1497,$J$3)","v":0},null,null,"",{"$f":"IFERROR(IF(B128<\"\",SUMIFS(Sheet1!$L$4:$L$997,Sheet1!$F$4:$F$997,B128,Sheet1!$Z$4:$Z$997,$H$3)+F128/SUMIFS(Sheet1!$H$4:$H$997,Sheet1!$F$4:$F$997,B128,Sheet1!$Z$4:$Z$997,$H$3),F128/D128),\"\")","v":""},""]
[null,null,null,null,null,null,null,{"$f":"SUMIFS(Sheet1!$H$4:$H$1497,Sheet1!$F$4:$F$1497,B130,Sheet1!$Z$4:$Z$1497,$H$3)","v":0},{"$f":"SUMIFS(Sheet1!$J$4:$J$15,Sheet1!$F$4:$F$15,B130,Sheet1!$Z$4:$Z$15,$H$3)","v":0},{"$f":"SUMIFS(Sheet1!$H$4:$H$1497,Sheet1!$F$4:$F$1497,B130,Sheet1!$Z$4:$Z$1497,$J$3)","v":0},null,null,"",{"$f":"IFERROR(IF(B129<\"\",SUMIFS(Sheet1!$L$4:$L$997,Sheet1!$F$4:$F$997,B129,Sheet1!$Z$4:$Z$997,$H$3)+F129/SUMIFS(Sheet1!$H$4:$H$997,Sheet1!$F$4:$F$997,B129,Sheet1!$Z$4:$Z$997,$H$3),F129/D129),\"\")","v":""},""]
[null,null,null,null,null,null,null,{"$f":"SUMIFS(Sheet1!$H$4:$H$1497,Sheet1!$F$4:$F$1497,B131,Sheet1!$Z$4:$Z$1497,$H$3)","v":0},{"$f":"SUMIFS(Sheet1!$J$4:$J$15,Sheet1!$F$4:$F$15,B131,Sheet1!$Z$4:$Z$15,$H$3)","v":0},{"$f":"SUMIFS(Sheet1!$H$4:$H$1497,Sheet1!$F$4:$F$1497,B131,Sheet1!$Z$4:$Z$1497,$J$3)","v":0},null,null,"",{"$f":"IFERROR(IF(B130<\"\",SUMIFS(Sheet1!$L$4:$L$997,Sheet1!$F$4:$F$997,B130,Sheet1!$Z$4:$Z$997,$H$3)+F130/SUMIFS(Sheet1!$H$4:$H$997,Sheet1!$F$4:$F$997,B130,Sheet1!$Z$4:$Z$997,$H$3),F130/D130),\"\")","v":""},""]
[null,null,null,null,null,null,null,{"$f":"SUMIFS(Sheet1!$H$4:$H$1497,Sheet1!$F$4:$F$1497,B132,Sheet1!$Z$4:$Z$1497,$H$3)","v":0},{"$f":"SUMIFS(Sheet1!$J$4:$J$15,Sheet1!$F$4:$F$15,B132,Sheet1!$Z$4:$Z$15,$H$3)","v":0},{"$f":"SUMIFS(Sheet1!$H$4:$H$1497,Sheet1!$F$4:$F$1497,B132,Sheet1!$Z$4:$Z$1497,$J$3)","v":0},null,null,"",{"$f":"IFERROR(IF(B131<\"\",SUMIFS(Sheet1!$L$4:$L$997,Sheet1!$F$4:$F$997,B131,Sheet1!$Z$4:$Z$997,$H$3)+F131/SUMIFS(Sheet1!$H$4:$H$997,Sheet1!$F$4:$F$997,B131,Sheet1!$Z$4:$Z$997,$H$3),F131/D131),\"\")","v":""},""]
[null,null,null,null,null,null,null,{"$f":"SUMIFS(Sheet1!$H$4:$H$1497,Sheet1!$F$4:$F$1497,B133,Sheet1!$Z$4:$Z$1497,$H$3)","v":0},{"$f":"SUMIFS(Sheet1!$J$4:$J$15,Sheet1!$F$4:$F$15,B133,Sheet1!$Z$4:$Z$15,$H$3)","v":0},{"$f":"SUMIFS(Sheet1!$H$4:$H$1497,Sheet1!$F$4:$F$1497,B133,Sheet1!$Z$4:$Z$1497,$J$3)","v":0},null,null,"",{"$f":"IFERROR(IF(B132<\"\",SUMIFS(Sheet1!$L$4:$L$997,Sheet1!$F$4:$F$997,B132,Sheet1!$Z$4:$Z$997,$H$3)+F132/SUMIFS(Sheet1!$H$4:$H$997,Sheet1!$F$4:$F$997,B132,Sheet1!$Z$4:$Z$997,$H$3),F132/D132),\"\")","v":""},""]
[null,null,null,null,null,null,null,{"$f":"SUMIFS(Sheet1!$H$4:$H$1497,Sheet1!$F$4:$F$1497,B134,Sheet1!$Z$4:$Z$1497,$H$3)","v":0},{"$f":"SUMIFS(Sheet1!$J$4:$J$15,Sheet1!$F$4:$F$15,B134,Sheet1!$Z$4:$Z$15,$H$3)","v":0},{"$f":"SUMIFS(Sheet1!$H$4:$H$1497,Sheet1!$F$4:$F$1497,B134,Sheet1!$Z$4:$Z$1497,$J$3)","v":0},null,null,{"$f":"IF(L133<>\"\",IF(L133>=K133,\"مطلوب\",\"\"),\"\")","v":""},{"$f":"IFERROR(IF(B133<\"\",SUMIFS(Sheet1!$L$4:$L$997,Sheet1!$F$4:$F$997,B133,Sheet1!$Z$4:$Z$997,$H$3)+F133/SUMIFS(Sheet1!$H$4:$H$997,Sheet1!$F$4:$F$997,B133,Sheet1!$Z$4:$Z$997,$H$3),F133/D133),\"\")","v":""},{"$f":"IFERROR(SUMPRODUCT(K133*N133),\"\")","v":""}]
[null,null,null,null,null,null,null,{"$f":"SUMIFS(Sheet1!$H$4:$H$1497,Sheet1!$F$4:$F$1497,B135,Sheet1!$Z$4:$Z$1497,$H$3)","v":0},{"$f":"SUMIFS(Sheet1!$J$4:$J$15,Sheet1!$F$4:$F$15,B135,Sheet1!$Z$4:$Z$15,$H$3)","v":0},{"$f":"SUMIFS(Sheet1!$H$4:$H$1497,Sheet1!$F$4:$F$1497,B135,Sheet1!$Z$4:$Z$1497,$J$3)","v":0},null,null,"",{"$f":"IFERROR(IF(B134<\"\",SUMIFS(Sheet1!$L$4:$L$997,Sheet1!$F$4:$F$997,B134,Sheet1!$Z$4:$Z$997,$H$3)+F134/SUMIFS(Sheet1!$H$4:$H$997,Sheet1!$F$4:$F$997,B134,Sheet1!$Z$4:$Z$997,$H$3),F134/D134),\"\")","v":""},""]
[null,null,null,null,null,null,null,{"$f":"SUMIFS(Sheet1!$H$4:$H$1497,Sheet1!$F$4:$F$1497,B136,Sheet1!$Z$4:$Z$1497,$H$3)","v":0},{"$f":"SUMIFS(Sheet1!$J$4:$J$15,Sheet1!$F$4:$F$15,B136,Sheet1!$Z$4:$Z$15,$H$3)","v":0},{"$f":"SUMIFS(Sheet1!$H$4:$H$1497,Sheet1!$F$4:$F$1497,B136,Sheet1!$Z$4:$Z$1497,$J$3)","v":0},null,null,"",{"$f":"IFERROR(IF(B135<\"\",SUMIFS(Sheet1!$L$4:$L$997,Sheet1!$F$4:$F$997,B135,Sheet1!$Z$4:$Z$997,$H$3)+F135/SUMIFS(Sheet1!$H$4:$H$997,Sheet1!$F$4:$F$997,B135,Sheet1!$Z$4:$Z$997,$H$3),F135/D135),\"\")","v":""},""]
[null,null,null,null,null,null,null,{"$f":"SUMIFS(Sheet1!$H$4:$H$1497,Sheet1!$F$4:$F$1497,B137,Sheet1!$Z$4:$Z$1497,$H$3)","v":0},{"$f":"SUMIFS(Sheet1!$J$4:$J$15,Sheet1!$F$4:$F$15,B137,Sheet1!$Z$4:$Z$15,$H$3)","v":0},{"$f":"SUMIFS(Sheet1!$H$4:$H$1497,Sheet1!$F$4:$F$1497,B137,Sheet1!$Z$4:$Z$1497,$J$3)","v":0},null,null,"",{"$f":"IFERROR(IF(B136<\"\",SUMIFS(Sheet1!$L$4:$L$997,Sheet1!$F$4:$F$997,B136,Sheet1!$Z$4:$Z$997,$H$3)+F136/SUMIFS(Sheet1!$H$4:$H$997,Sheet1!$F$4:$F$997,B136,Sheet1!$Z$4:$Z$997,$H$3),F136/D136),\"\")","v":""},""]
[null,null,null,null,null,null,null,{"$f":"SUMIFS(Sheet1!$H$4:$H$1497,Sheet1!$F$4:$F$1497,B138,Sheet1!$Z$4:$Z$1497,$H$3)","v":0},{"$f":"SUMIFS(Sheet1!$J$4:$J$15,Sheet1!$F$4:$F$15,B138,Sheet1!$Z$4:$Z$15,$H$3)","v":0},{"$f":"SUMIFS(Sheet1!$H$4:$H$1497,Sheet1!$F$4:$F$1497,B138,Sheet1!$Z$4:$Z$1497,$J$3)","v":0},null,null,"",{"$f":"IFERROR(IF(B137<\"\",SUMIFS(Sheet1!$L$4:$L$997,Sheet1!$F$4:$F$997,B137,Sheet1!$Z$4:$Z$997,$H$3)+F137/SUMIFS(Sheet1!$H$4:$H$997,Sheet1!$F$4:$F$997,B137,Sheet1!$Z$4:$Z$997,$H$3),F137/D137),\"\")","v":""},""]
[null,null,null,null,null,null,null,{"$f":"SUMIFS(Sheet1!$H$4:$H$1497,Sheet1!$F$4:$F$1497,B139,Sheet1!$Z$4:$Z$1497,$H$3)","v":0},{"$f":"SUMIFS(Sheet1!$J$4:$J$15,Sheet1!$F$4:$F$15,B139,Sheet1!$Z$4:$Z$15,$H$3)","v":0},{"$f":"SUMIFS(Sheet1!$H$4:$H$1497,Sheet1!$F$4:$F$1497,B139,Sheet1!$Z$4:$Z$1497,$J$3)","v":0},null,null,"",{"$f":"IFERROR(IF(B138<\"\",SUMIFS(Sheet1!$L$4:$L$997,Sheet1!$F$4:$F$997,B138,Sheet1!$Z$4:$Z$997,$H$3)+F138/SUMIFS(Sheet1!$H$4:$H$997,Sheet1!$F$4:$F$997,B138,Sheet1!$Z$4:$Z$997,$H$3),F138/D138),\"\")","v":""},""]
[null,null,null,null,null,null,null,{"$f":"SUMIFS(Sheet1!$H$4:$H$1497,Sheet1!$F$4:$F$1497,B140,Sheet1!$Z$4:$Z$1497,$H$3)","v":0},{"$f":"SUMIFS(Sheet1!$J$4:$J$15,Sheet1!$F$4:$F$15,B140,Sheet1!$Z$4:$Z$15,$H$3)","v":0},{"$f":"SUMIFS(Sheet1!$H$4:$H$1497,Sheet1!$F$4:$F$1497,B140,Sheet1!$Z$4:$Z$1497,$J$3)","v":0},null,null,"",{"$f":"IFERROR(IF(B139<\"\",SUMIFS(Sheet1!$L$4:$L$997,Sheet1!$F$4:$F$997,B139,Sheet1!$Z$4:$Z$997,$H$3)+F139/SUMIFS(Sheet1!$H$4:$H$997,Sheet1!$F$4:$F$997,B139,Sheet1!$Z$4:$Z$997,$H$3),F139/D139),\"\")","v":""},""]
[null,null,null,null,null,null,null,{"$f":"SUMIFS(Sheet1!$H$4:$H$1497,Sheet1!$F$4:$F$1497,B141,Sheet1!$Z$4:$Z$1497,$H$3)","v":0},{"$f":"SUMIFS(Sheet1!$J$4:$J$15,Sheet1!$F$4:$F$15,B141,Sheet1!$Z$4:$Z$15,$H$3)","v":0},{"$f":"SUMIFS(Sheet1!$H$4:$H$1497,Sheet1!$F$4:$F$1497,B141,Sheet1!$Z$4:$Z$1497,$J$3)","v":0},null,null,"",{"$f":"IFERROR(IF(B140<\"\",SUMIFS(Sheet1!$L$4:$L$997,Sheet1!$F$4:$F$997,B140,Sheet1!$Z$4:$Z$997,$H$3)+F140/SUMIFS(Sheet1!$H$4:$H$997,Sheet1!$F$4:$F$997,B140,Sheet1!$Z$4:$Z$997,$H$3),F140/D140),\"\")","v":""},""]
[null,null,null,null,null,null,null,{"$f":"SUMIFS(Sheet1!$H$4:$H$1497,Sheet1!$F$4:$F$1497,B142,Sheet1!$Z$4:$Z$1497,$H$3)","v":0},{"$f":"SUMIFS(Sheet1!$J$4:$J$15,Sheet1!$F$4:$F$15,B142,Sheet1!$Z$4:$Z$15,$H$3)","v":0},{"$f":"SUMIFS(Sheet1!$H$4:$H$1497,Sheet1!$F$4:$F$1497,B142,Sheet1!$Z$4:$Z$1497,$J$3)","v":0},null,null,"",{"$f":"IFERROR(IF(B141<\"\",SUMIFS(Sheet1!$L$4:$L$997,Sheet1!$F$4:$F$997,B141,Sheet1!$Z$4:$Z$997,$H$3)+F141/SUMIFS(Sheet1!$H$4:$H$997,Sheet1!$F$4:$F$997,B141,Sheet1!$Z$4:$Z$997,$H$3),F141/D141),\"\")","v":""},""]
[null,null,null,null,null,null,null,{"$f":"SUMIFS(Sheet1!$H$4:$H$1497,Sheet1!$F$4:$F$1497,B143,Sheet1!$Z$4:$Z$1497,$H$3)","v":0},{"$f":"SUMIFS(Sheet1!$J$4:$J$15,Sheet1!$F$4:$F$15,B143,Sheet1!$Z$4:$Z$15,$H$3)","v":0},{"$f":"SUMIFS(Sheet1!$H$4:$H$1497,Sheet1!$F$4:$F$1497,B143,Sheet1!$Z$4:$Z$1497,$J$3)","v":0},null,null,"",{"$f":"IFERROR(IF(B142<\"\",SUMIFS(Sheet1!$L$4:$L$997,Sheet1!$F$4:$F$997,B142,Sheet1!$Z$4:$Z$997,$H$3)+F142/SUMIFS(Sheet1!$H$4:$H$997,Sheet1!$F$4:$F$997,B142,Sheet1!$Z$4:$Z$997,$H$3),F142/D142),\"\")","v":""},""]
[null,null,null,null,null,null,null,{"$f":"SUMIFS(Sheet1!$H$4:$H$1497,Sheet1!$F$4:$F$1497,B144,Sheet1!$Z$4:$Z$1497,$H$3)","v":0},{"$f":"SUMIFS(Sheet1!$J$4:$J$15,Sheet1!$F$4:$F$15,B144,Sheet1!$Z$4:$Z$15,$H$3)","v":0},{"$f":"SUMIFS(Sheet1!$H$4:$H$1497,Sheet1!$F$4:$F$1497,B144,Sheet1!$Z$4:$Z$1497,$J$3)","v":0},null,null,"",{"$f":"IFERROR(IF(B143<\"\",SUMIFS(Sheet1!$L$4:$L$997,Sheet1!$F$4:$F$997,B143,Sheet1!$Z$4:$Z$997,$H$3)+F143/SUMIFS(Sheet1!$H$4:$H$997,Sheet1!$F$4:$F$997,B143,Sheet1!$Z$4:$Z$997,$H$3),F143/D143),\"\")","v":""},""]
[null,null,null,null,null,null,null,{"$f":"SUMIFS(Sheet1!$H$4:$H$1497,Sheet1!$F$4:$F$1497,B145,Sheet1!$Z$4:$Z$1497,$H$3)","v":0},{"$f":"SUMIFS(Sheet1!$J$4:$J$15,Sheet1!$F$4:$F$15,B145,Sheet1!$Z$4:$Z$15,$H$3)","v":0},{"$f":"SUMIFS(Sheet1!$H$4:$H$1497,Sheet1!$F$4:$F$1497,B145,Sheet1!$Z$4:$Z$1497,$J$3)","v":0},null,null,"",{"$f":"IFERROR(IF(B144<\"\",SUMIFS(Sheet1!$L$4:$L$997,Sheet1!$F$4:$F$997,B144,Sheet1!$Z$4:$Z$997,$H$3)+F144/SUMIFS(Sheet1!$H$4:$H$997,Sheet1!$F$4:$F$997,B144,Sheet1!$Z$4:$Z$997,$H$3),F144/D144),\"\")","v":""},""]
[null,null,null,null,null,null,null,{"$f":"SUMIFS(Sheet1!$H$4:$H$1497,Sheet1!$F$4:$F$1497,B146,Sheet1!$Z$4:$Z$1497,$H$3)","v":0},{"$f":"SUMIFS(Sheet1!$J$4:$J$15,Sheet1!$F$4:$F$15,B146,Sheet1!$Z$4:$Z$15,$H$3)","v":0},{"$f":"SUMIFS(Sheet1!$H$4:$H$1497,Sheet1!$F$4:$F$1497,B146,Sheet1!$Z$4:$Z$1497,$J$3)","v":0},null,null,"",{"$f":"IFERROR(IF(B145<\"\",SUMIFS(Sheet1!$L$4:$L$997,Sheet1!$F$4:$F$997,B145,Sheet1!$Z$4:$Z$997,$H$3)+F145/SUMIFS(Sheet1!$H$4:$H$997,Sheet1!$F$4:$F$997,B145,Sheet1!$Z$4:$Z$997,$H$3),F145/D145),\"\")","v":""},""]
[null,null,null,null,null,null,null,{"$f":"SUMIFS(Sheet1!$H$4:$H$1497,Sheet1!$F$4:$F$1497,B147,Sheet1!$Z$4:$Z$1497,$H$3)","v":0},{"$f":"SUMIFS(Sheet1!$J$4:$J$15,Sheet1!$F$4:$F$15,B147,Sheet1!$Z$4:$Z$15,$H$3)","v":0},{"$f":"SUMIFS(Sheet1!$H$4:$H$1497,Sheet1!$F$4:$F$1497,B147,Sheet1!$Z$4:$Z$1497,$J$3)","v":0},null,null,"",{"$f":"IFERROR(IF(B146<\"\",SUMIFS(Sheet1!$L$4:$L$997,Sheet1!$F$4:$F$997,B146,Sheet1!$Z$4:$Z$997,$H$3)+F146/SUMIFS(Sheet1!$H$4:$H$997,Sheet1!$F$4:$F$997,B146,Sheet1!$Z$4:$Z$997,$H$3),F146/D146),\"\")","v":""},""]
[null,null,null,null,null,null,null,{"$f":"SUMIFS(Sheet1!$H$4:$H$1497,Sheet1!$F$4:$F$1497,B148,Sheet1!$Z$4:$Z$1497,$H$3)","v":0},{"$f":"SUMIFS(Sheet1!$J$4:$J$15,Sheet1!$F$4:$F$15,B148,Sheet1!$Z$4:$Z$15,$H$3)","v":0},{"$f":"SUMIFS(Sheet1!$H$4:$H$1497,Sheet1!$F$4:$F$1497,B148,Sheet1!$Z$4:$Z$1497,$J$3)","v":0},null,null,"",{"$f":"IFERROR(IF(B147<\"\",SUMIFS(Sheet1!$L$4:$L$997,Sheet1!$F$4:$F$997,B147,Sheet1!$Z$4:$Z$997,$H$3)+F147/SUMIFS(Sheet1!$H$4:$H$997,Sheet1!$F$4:$F$997,B147,Sheet1!$Z$4:$Z$997,$H$3),F147/D147),\"\")","v":""},""]
[null,null,null,null,null,null,null,{"$f":"SUMIFS(Sheet1!$H$4:$H$1497,Sheet1!$F$4:$F$1497,B149,Sheet1!$Z$4:$Z$1497,$H$3)","v":0},{"$f":"SUMIFS(Sheet1!$J$4:$J$15,Sheet1!$F$4:$F$15,B149,Sheet1!$Z$4:$Z$15,$H$3)","v":0},{"$f":"SUMIFS(Sheet1!$H$4:$H$1497,Sheet1!$F$4:$F$1497,B149,Sheet1!$Z$4:$Z$1497,$J$3)","v":0},null,null,"",{"$f":"IFERROR(IF(B148<\"\",SUMIFS(Sheet1!$L$4:$L$997,Sheet1!$F$4:$F$997,B148,Sheet1!$Z$4:$Z$997,$H$3)+F148/SUMIFS(Sheet1!$H$4:$H$997,Sheet1!$F$4:$F$997,B148,Sheet1!$Z$4:$Z$997,$H$3),F148/D148),\"\")","v":""},""]
[null,null,null,null,null,null,null,{"$f":"SUMIFS(Sheet1!$H$4:$H$1497,Sheet1!$F$4:$F$1497,B150,Sheet1!$Z$4:$Z$1497,$H$3)","v":0},{"$f":"SUMIFS(Sheet1!$J$4:$J$15,Sheet1!$F$4:$F$15,B150,Sheet1!$Z$4:$Z$15,$H$3)","v":0},{"$f":"SUMIFS(Sheet1!$H$4:$H$1497,Sheet1!$F$4:$F$1497,B150,Sheet1!$Z$4:$Z$1497,$J$3)","v":0},null,null,"",{"$f":"IFERROR(IF(B149<\"\",SUMIFS(Sheet1!$L$4:$L$997,Sheet1!$F$4:$F$997,B149,Sheet1!$Z$4:$Z$997,$H$3)+F149/SUMIFS(Sheet1!$H$4:$H$997,Sheet1!$F$4:$F$997,B149,Sheet1!$Z$4:$Z$997,$H$3),F149/D149),\"\")","v":""},""]
[null,null,null,null,null,null,null,{"$f":"SUMIFS(Sheet1!$H$4:$H$1497,Sheet1!$F$4:$F$1497,B151,Sheet1!$Z$4:$Z$1497,$H$3)","v":0},{"$f":"SUMIFS(Sheet1!$J$4:$J$15,Sheet1!$F$4:$F$15,B151,Sheet1!$Z$4:$Z$15,$H$3)","v":0},{"$f":"SUMIFS(Sheet1!$H$4:$H$1497,Sheet1!$F$4:$F$1497,B151,Sheet1!$Z$4:$Z$1497,$J$3)","v":0},null,null,"",{"$f":"IFERROR(IF(B150<\"\",SUMIFS(Sheet1!$L$4:$L$997,Sheet1!$F$4:$F$997,B150,Sheet1!$Z$4:$Z$997,$H$3)+F150/SUMIFS(Sheet1!$H$4:$H$997,Sheet1!$F$4:$F$997,B150,Sheet1!$Z$4:$Z$997,$H$3),F150/D150),\"\")","v":""},""]
[null,null,null,null,null,null,null,{"$f":"SUMIFS(Sheet1!$H$4:$H$1497,Sheet1!$F$4:$F$1497,B152,Sheet1!$Z$4:$Z$1497,$H$3)","v":0},{"$f":"SUMIFS(Sheet1!$J$4:$J$15,Sheet1!$F$4:$F$15,B152,Sheet1!$Z$4:$Z$15,$H$3)","v":0},{"$f":"SUMIFS(Sheet1!$H$4:$H$1497,Sheet1!$F$4:$F$1497,B152,Sheet1!$Z$4:$Z$1497,$J$3)","v":0},null,null,"",{"$f":"IFERROR(IF(B151<\"\",SUMIFS(Sheet1!$L$4:$L$997,Sheet1!$F$4:$F$997,B151,Sheet1!$Z$4:$Z$997,$H$3)+F151/SUMIFS(Sheet1!$H$4:$H$997,Sheet1!$F$4:$F$997,B151,Sheet1!$Z$4:$Z$997,$H$3),F151/D151),\"\")","v":""},""]
[null,null,null,null,null,null,null,{"$f":"SUMIFS(Sheet1!$H$4:$H$1497,Sheet1!$F$4:$F$1497,B153,Sheet1!$Z$4:$Z$1497,$H$3)","v":0},{"$f":"SUMIFS(Sheet1!$J$4:$J$15,Sheet1!$F$4:$F$15,B153,Sheet1!$Z$4:$Z$15,$H$3)","v":0},{"$f":"SUMIFS(Sheet1!$H$4:$H$1497,Sheet1!$F$4:$F$1497,B153,Sheet1!$Z$4:$Z$1497,$J$3)","v":0},null,null,"",{"$f":"IFERROR(IF(B152<\"\",SUMIFS(Sheet1!$L$4:$L$997,Sheet1!$F$4:$F$997,B152,Sheet1!$Z$4:$Z$997,$H$3)+F152/SUMIFS(Sheet1!$H$4:$H$997,Sheet1!$F$4:$F$997,B152,Sheet1!$Z$4:$Z$997,$H$3),F152/D152),\"\")","v":""},""]
[null,null,null,null,null,null,null,{"$f":"SUMIFS(Sheet1!$H$4:$H$1497,Sheet1!$F$4:$F$1497,B154,Sheet1!$Z$4:$Z$1497,$H$3)","v":0},{"$f":"SUMIFS(Sheet1!$J$4:$J$15,Sheet1!$F$4:$F$15,B154,Sheet1!$Z$4:$Z$15,$H$3)","v":0},{"$f":"SUMIFS(Sheet1!$H$4:$H$1497,Sheet1!$F$4:$F$1497,B154,Sheet1!$Z$4:$Z$1497,$J$3)","v":0},null,null,"",{"$f":"IFERROR(IF(B153<\"\",SUMIFS(Sheet1!$L$4:$L$997,Sheet1!$F$4:$F$997,B153,Sheet1!$Z$4:$Z$997,$H$3)+F153/SUMIFS(Sheet1!$H$4:$H$997,Sheet1!$F$4:$F$997,B153,Sheet1!$Z$4:$Z$997,$H$3),F153/D153),\"\")","v":""},""]
[null,null,null,null,null,null,null,{"$f":"SUMIFS(Sheet1!$H$4:$H$1497,Sheet1!$F$4:$F$1497,B155,Sheet1!$Z$4:$Z$1497,$H$3)","v":0},{"$f":"SUMIFS(Sheet1!$J$4:$J$15,Sheet1!$F$4:$F$15,B155,Sheet1!$Z$4:$Z$15,$H$3)","v":0},{"$f":"SUMIFS(Sheet1!$H$4:$H$1497,Sheet1!$F$4:$F$1497,B155,Sheet1!$Z$4:$Z$1497,$J$3)","v":0},null,null,"",{"$f":"IFERROR(IF(B154<\"\",SUMIFS(Sheet1!$L$4:$L$997,Sheet1!$F$4:$F$997,B154,Sheet1!$Z$4:$Z$997,$H$3)+F154/SUMIFS(Sheet1!$H$4:$H$997,Sheet1!$F$4:$F$997,B154,Sheet1!$Z$4:$Z$997,$H$3),F154/D154),\"\")","v":""},""]
[null,null,null,null,null,null,null,{"$f":"SUMIFS(Sheet1!$H$4:$H$1497,Sheet1!$F$4:$F$1497,B156,Sheet1!$Z$4:$Z$1497,$H$3)","v":0},{"$f":"SUMIFS(Sheet1!$J$4:$J$15,Sheet1!$F$4:$F$15,B156,Sheet1!$Z$4:$Z$15,$H$3)","v":0},{"$f":"SUMIFS(Sheet1!$H$4:$H$1497,Sheet1!$F$4:$F$1497,B156,Sheet1!$Z$4:$Z$1497,$J$3)","v":0},null,null,"",{"$f":"IFERROR(IF(B155<\"\",SUMIFS(Sheet1!$L$4:$L$997,Sheet1!$F$4:$F$997,B155,Sheet1!$Z$4:$Z$997,$H$3)+F155/SUMIFS(Sheet1!$H$4:$H$997,Sheet1!$F$4:$F$997,B155,Sheet1!$Z$4:$Z$997,$H$3),F155/D155),\"\")","v":""},""]
[null,null,null,null,null,null,null,{"$f":"SUMIFS(Sheet1!$H$4:$H$1497,Sheet1!$F$4:$F$1497,B157,Sheet1!$Z$4:$Z$1497,$H$3)","v":0},{"$f":"SUMIFS(Sheet1!$J$4:$J$15,Sheet1!$F$4:$F$15,B157,Sheet1!$Z$4:$Z$15,$H$3)","v":0},{"$f":"SUMIFS(Sheet1!$H$4:$H$1497,Sheet1!$F$4:$F$1497,B157,Sheet1!$Z$4:$Z$1497,$J$3)","v":0},null,null,"",{"$f":"IFERROR(IF(B156<\"\",SUMIFS(Sheet1!$L$4:$L$997,Sheet1!$F$4:$F$997,B156,Sheet1!$Z$4:$Z$997,$H$3)+F156/SUMIFS(Sheet1!$H$4:$H$997,Sheet1!$F$4:$F$997,B156,Sheet1!$Z$4:$Z$997,$H$3),F156/D156),\"\")","v":""},""]
[null,null,null,null,null,null,null,{"$f":"SUMIFS(Sheet1!$H$4:$H$1497,Sheet1!$F$4:$F$1497,B158,Sheet1!$Z$4:$Z$1497,$H$3)","v":0},{"$f":"SUMIFS(Sheet1!$J$4:$J$15,Sheet1!$F$4:$F$15,B158,Sheet1!$Z$4:$Z$15,$H$3)","v":0},{"$f":"SUMIFS(Sheet1!$H$4:$H$1497,Sheet1!$F$4:$F$1497,B158,Sheet1!$Z$4:$Z$1497,$J$3)","v":0},null,null,"",{"$f":"IFERROR(IF(B157<\"\",SUMIFS(Sheet1!$L$4:$L$997,Sheet1!$F$4:$F$997,B157,Sheet1!$Z$4:$Z$997,$H$3)+F157/SUMIFS(Sheet1!$H$4:$H$997,Sheet1!$F$4:$F$997,B157,Sheet1!$Z$4:$Z$997,$H$3),F157/D157),\"\")","v":""},""]
[null,null,null,null,null,null,null,{"$f":"SUMIFS(Sheet1!$H$4:$H$1497,Sheet1!$F$4:$F$1497,B159,Sheet1!$Z$4:$Z$1497,$H$3)","v":0},{"$f":"SUMIFS(Sheet1!$J$4:$J$15,Sheet1!$F$4:$F$15,B159,Sheet1!$Z$4:$Z$15,$H$3)","v":0},{"$f":"SUMIFS(Sheet1!$H$4:$H$1497,Sheet1!$F$4:$F$1497,B159,Sheet1!$Z$4:$Z$1497,$J$3)","v":0},null,null,"",{"$f":"IFERROR(IF(B158<\"\",SUMIFS(Sheet1!$L$4:$L$997,Sheet1!$F$4:$F$997,B158,Sheet1!$Z$4:$Z$997,$H$3)+F158/SUMIFS(Sheet1!$H$4:$H$997,Sheet1!$F$4:$F$997,B158,Sheet1!$Z$4:$Z$997,$H$3),F158/D158),\"\")","v":""},""]
[null,null,null,null,null,null,null,{"$f":"SUMIFS(Sheet1!$H$4:$H$1497,Sheet1!$F$4:$F$1497,B160,Sheet1!$Z$4:$Z$1497,$H$3)","v":0},{"$f":"SUMIFS(Sheet1!$J$4:$J$15,Sheet1!$F$4:$F$15,B160,Sheet1!$Z$4:$Z$15,$H$3)","v":0},{"$f":"SUMIFS(Sheet1!$H$4:$H$1497,Sheet1!$F$4:$F$1497,B160,Sheet1!$Z$4:$Z$1497,$J$3)","v":0},null,null,"",{"$f":"IFERROR(IF(B159<\"\",SUMIFS(Sheet1!$L$4:$L$997,Sheet1!$F$4:$F$997,B159,Sheet1!$Z$4:$Z$997,$H$3)+F159/SUMIFS(Sheet1!$H$4:$H$997,Sheet1!$F$4:$F$997,B159,Sheet1!$Z$4:$Z$997,$H$3),F159/D159),\"\")","v":""},""]
[null,null,null,null,null,null,null,{"$f":"SUMIFS(Sheet1!$H$4:$H$1497,Sheet1!$F$4:$F$1497,B161,Sheet1!$Z$4:$Z$1497,$H$3)","v":0},{"$f":"SUMIFS(Sheet1!$J$4:$J$15,Sheet1!$F$4:$F$15,B161,Sheet1!$Z$4:$Z$15,$H$3)","v":0},{"$f":"SUMIFS(Sheet1!$H$4:$H$1497,Sheet1!$F$4:$F$1497,B161,Sheet1!$Z$4:$Z$1497,$J$3)","v":0},null,null,"",{"$f":"IFERROR(IF(B160<\"\",SUMIFS(Sheet1!$L$4:$L$997,Sheet1!$F$4:$F$997,B160,Sheet1!$Z$4:$Z$997,$H$3)+F160/SUMIFS(Sheet1!$H$4:$H$997,Sheet1!$F$4:$F$997,B160,Sheet1!$Z$4:$Z$997,$H$3),F160/D160),\"\")","v":""},""]
[null,null,null,null,null,null,null,{"$f":"SUMIFS(Sheet1!$H$4:$H$1497,Sheet1!$F$4:$F$1497,B162,Sheet1!$Z$4:$Z$1497,$H$3)","v":0},{"$f":"SUMIFS(Sheet1!$J$4:$J$15,Sheet1!$F$4:$F$15,B162,Sheet1!$Z$4:$Z$15,$H$3)","v":0},{"$f":"SUMIFS(Sheet1!$H$4:$H$1497,Sheet1!$F$4:$F$1497,B162,Sheet1!$Z$4:$Z$1497,$J$3)","v":0},null,null,"",{"$f":"IFERROR(IF(B161<\"\",SUMIFS(Sheet1!$L$4:$L$997,Sheet1!$F$4:$F$997,B161,Sheet1!$Z$4:$Z$997,$H$3)+F161/SUMIFS(Sheet1!$H$4:$H$997,Sheet1!$F$4:$F$997,B161,Sheet1!$Z$4:$Z$997,$H$3),F161/D161),\"\")","v":""},""]
[null,null,null,null,null,null,null,{"$f":"SUMIFS(Sheet1!$H$4:$H$1497,Sheet1!$F$4:$F$1497,B163,Sheet1!$Z$4:$Z$1497,$H$3)","v":0},{"$f":"SUMIFS(Sheet1!$J$4:$J$15,Sheet1!$F$4:$F$15,B163,Sheet1!$Z$4:$Z$15,$H$3)","v":0},{"$f":"SUMIFS(Sheet1!$H$4:$H$1497,Sheet1!$F$4:$F$1497,B163,Sheet1!$Z$4:$Z$1497,$J$3)","v":0},null,null,"",{"$f":"IFERROR(IF(B162<\"\",SUMIFS(Sheet1!$L$4:$L$997,Sheet1!$F$4:$F$997,B162,Sheet1!$Z$4:$Z$997,$H$3)+F162/SUMIFS(Sheet1!$H$4:$H$997,Sheet1!$F$4:$F$997,B162,Sheet1!$Z$4:$Z$997,$H$3),F162/D162),\"\")","v":""},""]
[null,null,null,null,null,null,null,{"$f":"SUMIFS(Sheet1!$H$4:$H$1497,Sheet1!$F$4:$F$1497,B164,Sheet1!$Z$4:$Z$1497,$H$3)","v":0},{"$f":"SUMIFS(Sheet1!$J$4:$J$15,Sheet1!$F$4:$F$15,B164,Sheet1!$Z$4:$Z$15,$H$3)","v":0},{"$f":"SUMIFS(Sheet1!$H$4:$H$1497,Sheet1!$F$4:$F$1497,B164,Sheet1!$Z$4:$Z$1497,$J$3)","v":0},null,null,"",{"$f":"IFERROR(IF(B163<\"\",SUMIFS(Sheet1!$L$4:$L$997,Sheet1!$F$4:$F$997,B163,Sheet1!$Z$4:$Z$997,$H$3)+F163/SUMIFS(Sheet1!$H$4:$H$997,Sheet1!$F$4:$F$997,B163,Sheet1!$Z$4:$Z$997,$H$3),F163/D163),\"\")","v":""},""]
[null,null,null,null,null,null,null,{"$f":"SUMIFS(Sheet1!$H$4:$H$1497,Sheet1!$F$4:$F$1497,B165,Sheet1!$Z$4:$Z$1497,$H$3)","v":0},{"$f":"SUMIFS(Sheet1!$J$4:$J$15,Sheet1!$F$4:$F$15,B165,Sheet1!$Z$4:$Z$15,$H$3)","v":0},{"$f":"SUMIFS(Sheet1!$H$4:$H$1497,Sheet1!$F$4:$F$1497,B165,Sheet1!$Z$4:$Z$1497,$J$3)","v":0},null,null,"",{"$f":"IFERROR(IF(B164<\"\",SUMIFS(Sheet1!$L$4:$L$997,Sheet1!$F$4:$F$997,B164,Sheet1!$Z$4:$Z$997,$H$3)+F164/SUMIFS(Sheet1!$H$4:$H$997,Sheet1!$F$4:$F$997,B164,Sheet1!$Z$4:$Z$997,$H$3),F164/D164),\"\")","v":""},""]
[null,null,null,null,null,null,null,{"$f":"SUMIFS(Sheet1!$H$4:$H$1497,Sheet1!$F$4:$F$1497,B166,Sheet1!$Z$4:$Z$1497,$H$3)","v":0},{"$f":"SUMIFS(Sheet1!$J$4:$J$15,Sheet1!$F$4:$F$15,B166,Sheet1!$Z$4:$Z$15,$H$3)","v":0},{"$f":"SUMIFS(Sheet1!$H$4:$H$1497,Sheet1!$F$4:$F$1497,B166,Sheet1!$Z$4:$Z$1497,$J$3)","v":0},null,null,"",{"$f":"IFERROR(IF(B165<\"\",SUMIFS(Sheet1!$L$4:$L$997,Sheet1!$F$4:$F$997,B165,Sheet1!$Z$4:$Z$997,$H$3)+F165/SUMIFS(Sheet1!$H$4:$H$997,Sheet1!$F$4:$F$997,B165,Sheet1!$Z$4:$Z$997,$H$3),F165/D165),\"\")","v":""},""]
[null,null,null,null,null,null,null,{"$f":"SUMIFS(Sheet1!$H$4:$H$1497,Sheet1!$F$4:$F$1497,B167,Sheet1!$Z$4:$Z$1497,$H$3)","v":0},{"$f":"SUMIFS(Sheet1!$J$4:$J$15,Sheet1!$F$4:$F$15,B167,Sheet1!$Z$4:$Z$15,$H$3)","v":0},{"$f":"SUMIFS(Sheet1!$H$4:$H$1497,Sheet1!$F$4:$F$1497,B167,Sheet1!$Z$4:$Z$1497,$J$3)","v":0},null,null,"",{"$f":"IFERROR(IF(B166<\"\",SUMIFS(Sheet1!$L$4:$L$997,Sheet1!$F$4:$F$997,B166,Sheet1!$Z$4:$Z$997,$H$3)+F166/SUMIFS(Sheet1!$H$4:$H$997,Sheet1!$F$4:$F$997,B166,Sheet1!$Z$4:$Z$997,$H$3),F166/D166),\"\")","v":""},""]
[null,null,null,null,null,null,null,{"$f":"SUMIFS(Sheet1!$H$4:$H$1497,Sheet1!$F$4:$F$1497,B168,Sheet1!$Z$4:$Z$1497,$H$3)","v":0},{"$f":"SUMIFS(Sheet1!$J$4:$J$15,Sheet1!$F$4:$F$15,B168,Sheet1!$Z$4:$Z$15,$H$3)","v":0},{"$f":"SUMIFS(Sheet1!$H$4:$H$1497,Sheet1!$F$4:$F$1497,B168,Sheet1!$Z$4:$Z$1497,$J$3)","v":0},null,null,"",{"$f":"IFERROR(IF(B167<\"\",SUMIFS(Sheet1!$L$4:$L$997,Sheet1!$F$4:$F$997,B167,Sheet1!$Z$4:$Z$997,$H$3)+F167/SUMIFS(Sheet1!$H$4:$H$997,Sheet1!$F$4:$F$997,B167,Sheet1!$Z$4:$Z$997,$H$3),F167/D167),\"\")","v":""},""]
[null,null,null,null,null,null,null,{"$f":"SUMIFS(Sheet1!$H$4:$H$1497,Sheet1!$F$4:$F$1497,B169,Sheet1!$Z$4:$Z$1497,$H$3)","v":0},{"$f":"SUMIFS(Sheet1!$J$4:$J$15,Sheet1!$F$4:$F$15,B169,Sheet1!$Z$4:$Z$15,$H$3)","v":0},{"$f":"SUMIFS(Sheet1!$H$4:$H$1497,Sheet1!$F$4:$F$1497,B169,Sheet1!$Z$4:$Z$1497,$J$3)","v":0},null,null,"",{"$f":"IFERROR(IF(B168<\"\",SUMIFS(Sheet1!$L$4:$L$997,Sheet1!$F$4:$F$997,B168,Sheet1!$Z$4:$Z$997,$H$3)+F168/SUMIFS(Sheet1!$H$4:$H$997,Sheet1!$F$4:$F$997,B168,Sheet1!$Z$4:$Z$997,$H$3),F168/D168),\"\")","v":""},""]
[null,null,null,null,null,null,null,{"$f":"SUMIFS(Sheet1!$H$4:$H$1497,Sheet1!$F$4:$F$1497,B170,Sheet1!$Z$4:$Z$1497,$H$3)","v":0},{"$f":"SUMIFS(Sheet1!$J$4:$J$15,Sheet1!$F$4:$F$15,B170,Sheet1!$Z$4:$Z$15,$H$3)","v":0},{"$f":"SUMIFS(Sheet1!$H$4:$H$1497,Sheet1!$F$4:$F$1497,B170,Sheet1!$Z$4:$Z$1497,$J$3)","v":0},null,null,"",{"$f":"IFERROR(IF(B169<\"\",SUMIFS(Sheet1!$L$4:$L$997,Sheet1!$F$4:$F$997,B169,Sheet1!$Z$4:$Z$997,$H$3)+F169/SUMIFS(Sheet1!$H$4:$H$997,Sheet1!$F$4:$F$997,B169,Sheet1!$Z$4:$Z$997,$H$3),F169/D169),\"\")","v":""},""]
[null,null,null,null,null,null,null,{"$f":"SUMIFS(Sheet1!$H$4:$H$1497,Sheet1!$F$4:$F$1497,B171,Sheet1!$Z$4:$Z$1497,$H$3)","v":0},{"$f":"SUMIFS(Sheet1!$J$4:$J$15,Sheet1!$F$4:$F$15,B171,Sheet1!$Z$4:$Z$15,$H$3)","v":0},{"$f":"SUMIFS(Sheet1!$H$4:$H$1497,Sheet1!$F$4:$F$1497,B171,Sheet1!$Z$4:$Z$1497,$J$3)","v":0},null,null,"",{"$f":"IFERROR(IF(B170<\"\",SUMIFS(Sheet1!$L$4:$L$997,Sheet1!$F$4:$F$997,B170,Sheet1!$Z$4:$Z$997,$H$3)+F170/SUMIFS(Sheet1!$H$4:$H$997,Sheet1!$F$4:$F$997,B170,Sheet1!$Z$4:$Z$997,$H$3),F170/D170),\"\")","v":""},""]
[null,null,null,null,null,null,null,{"$f":"SUMIFS(Sheet1!$H$4:$H$1497,Sheet1!$F$4:$F$1497,B172,Sheet1!$Z$4:$Z$1497,$H$3)","v":0},{"$f":"SUMIFS(Sheet1!$J$4:$J$15,Sheet1!$F$4:$F$15,B172,Sheet1!$Z$4:$Z$15,$H$3)","v":0},{"$f":"SUMIFS(Sheet1!$H$4:$H$1497,Sheet1!$F$4:$F$1497,B172,Sheet1!$Z$4:$Z$1497,$J$3)","v":0},null,null,"",{"$f":"IFERROR(IF(B171<\"\",SUMIFS(Sheet1!$L$4:$L$997,Sheet1!$F$4:$F$997,B171,Sheet1!$Z$4:$Z$997,$H$3)+F171/SUMIFS(Sheet1!$H$4:$H$997,Sheet1!$F$4:$F$997,B171,Sheet1!$Z$4:$Z$997,$H$3),F171/D171),\"\")","v":""},""]
[null,null,null,null,null,null,null,{"$f":"SUMIFS(Sheet1!$H$4:$H$1497,Sheet1!$F$4:$F$1497,B173,Sheet1!$Z$4:$Z$1497,$H$3)","v":0},{"$f":"SUMIFS(Sheet1!$J$4:$J$15,Sheet1!$F$4:$F$15,B173,Sheet1!$Z$4:$Z$15,$H$3)","v":0},{"$f":"SUMIFS(Sheet1!$H$4:$H$1497,Sheet1!$F$4:$F$1497,B173,Sheet1!$Z$4:$Z$1497,$J$3)","v":0},null,null,"",{"$f":"IFERROR(IF(B172<\"\",SUMIFS(Sheet1!$L$4:$L$997,Sheet1!$F$4:$F$997,B172,Sheet1!$Z$4:$Z$997,$H$3)+F172/SUMIFS(Sheet1!$H$4:$H$997,Sheet1!$F$4:$F$997,B172,Sheet1!$Z$4:$Z$997,$H$3),F172/D172),\"\")","v":""},""]
[null,null,null,null,null,null,null,{"$f":"SUMIFS(Sheet1!$H$4:$H$1497,Sheet1!$F$4:$F$1497,B174,Sheet1!$Z$4:$Z$1497,$H$3)","v":0},{"$f":"SUMIFS(Sheet1!$J$4:$J$15,Sheet1!$F$4:$F$15,B174,Sheet1!$Z$4:$Z$15,$H$3)","v":0},{"$f":"SUMIFS(Sheet1!$H$4:$H$1497,Sheet1!$F$4:$F$1497,B174,Sheet1!$Z$4:$Z$1497,$J$3)","v":0},null,null,"",{"$f":"IFERROR(IF(B173<\"\",SUMIFS(Sheet1!$L$4:$L$997,Sheet1!$F$4:$F$997,B173,Sheet1!$Z$4:$Z$997,$H$3)+F173/SUMIFS(Sheet1!$H$4:$H$997,Sheet1!$F$4:$F$997,B173,Sheet1!$Z$4:$Z$997,$H$3),F173/D173),\"\")","v":""},""]
[null,null,null,null,null,null,null,{"$f":"SUMIFS(Sheet1!$H$4:$H$1497,Sheet1!$F$4:$F$1497,B175,Sheet1!$Z$4:$Z$1497,$H$3)","v":0},{"$f":"SUMIFS(Sheet1!$J$4:$J$15,Sheet1!$F$4:$F$15,B175,Sheet1!$Z$4:$Z$15,$H$3)","v":0},{"$f":"SUMIFS(Sheet1!$H$4:$H$1497,Sheet1!$F$4:$F$1497,B175,Sheet1!$Z$4:$Z$1497,$J$3)","v":0},null,null,"",{"$f":"IFERROR(IF(B174<\"\",SUMIFS(Sheet1!$L$4:$L$997,Sheet1!$F$4:$F$997,B174,Sheet1!$Z$4:$Z$997,$H$3)+F174/SUMIFS(Sheet1!$H$4:$H$997,Sheet1!$F$4:$F$997,B174,Sheet1!$Z$4:$Z$997,$H$3),F174/D174),\"\")","v":""},""]
[null,null,null,null,null,null,null,{"$f":"SUMIFS(Sheet1!$H$4:$H$1497,Sheet1!$F$4:$F$1497,B176,Sheet1!$Z$4:$Z$1497,$H$3)","v":0},{"$f":"SUMIFS(Sheet1!$J$4:$J$15,Sheet1!$F$4:$F$15,B176,Sheet1!$Z$4:$Z$15,$H$3)","v":0},{"$f":"SUMIFS(Sheet1!$H$4:$H$1497,Sheet1!$F$4:$F$1497,B176,Sheet1!$Z$4:$Z$1497,$J$3)","v":0},null,null,"",{"$f":"IFERROR(IF(B175<\"\",SUMIFS(Sheet1!$L$4:$L$997,Sheet1!$F$4:$F$997,B175,Sheet1!$Z$4:$Z$997,$H$3)+F175/SUMIFS(Sheet1!$H$4:$H$997,Sheet1!$F$4:$F$997,B175,Sheet1!$Z$4:$Z$997,$H$3),F175/D175),\"\")","v":""},""]
[null,null,null,null,null,null,null,{"$f":"SUMIFS(Sheet1!$H$4:$H$1497,Sheet1!$F$4:$F$1497,B177,Sheet1!$Z$4:$Z$1497,$H$3)","v":0},{"$f":"SUMIFS(Sheet1!$J$4:$J$15,Sheet1!$F$4:$F$15,B177,Sheet1!$Z$4:$Z$15,$H$3)","v":0},{"$f":"SUMIFS(Sheet1!$H$4:$H$1497,Sheet1!$F$4:$F$1497,B177,Sheet1!$Z$4:$Z$1497,$J$3)","v":0},null,null,"",{"$f":"IFERROR(IF(B176<\"\",SUMIFS(Sheet1!$L$4:$L$997,Sheet1!$F$4:$F$997,B176,Sheet1!$Z$4:$Z$997,$H$3)+F176/SUMIFS(Sheet1!$H$4:$H$997,Sheet1!$F$4:$F$997,B176,Sheet1!$Z$4:$Z$997,$H$3),F176/D176),\"\")","v":""},""]
[null,null,null,null,null,null,null,{"$f":"SUMIFS(Sheet1!$H$4:$H$1497,Sheet1!$F$4:$F$1497,B178,Sheet1!$Z$4:$Z$1497,$H$3)","v":0},{"$f":"SUMIFS(Sheet1!$J$4:$J$15,Sheet1!$F$4:$F$15,B178,Sheet1!$Z$4:$Z$15,$H$3)","v":0},{"$f":"SUMIFS(Sheet1!$H$4:$H$1497,Sheet1!$F$4:$F$1497,B178,Sheet1!$Z$4:$Z$1497,$J$3)","v":0},null,null,"",{"$f":"IFERROR(IF(B177<\"\",SUMIFS(Sheet1!$L$4:$L$997,Sheet1!$F$4:$F$997,B177,Sheet1!$Z$4:$Z$997,$H$3)+F177/SUMIFS(Sheet1!$H$4:$H$997,Sheet1!$F$4:$F$997,B177,Sheet1!$Z$4:$Z$997,$H$3),F177/D177),\"\")","v":""},""]
[null,null,null,null,null,null,null,{"$f":"SUMIFS(Sheet1!$H$4:$H$1497,Sheet1!$F$4:$F$1497,B179,Sheet1!$Z$4:$Z$1497,$H$3)","v":0},{"$f":"SUMIFS(Sheet1!$J$4:$J$15,Sheet1!$F$4:$F$15,B179,Sheet1!$Z$4:$Z$15,$H$3)","v":0},{"$f":"SUMIFS(Sheet1!$H$4:$H$1497,Sheet1!$F$4:$F$1497,B179,Sheet1!$Z$4:$Z$1497,$J$3)","v":0},null,null,"",{"$f":"IFERROR(IF(B178<\"\",SUMIFS(Sheet1!$L$4:$L$997,Sheet1!$F$4:$F$997,B178,Sheet1!$Z$4:$Z$997,$H$3)+F178/SUMIFS(Sheet1!$H$4:$H$997,Sheet1!$F$4:$F$997,B178,Sheet1!$Z$4:$Z$997,$H$3),F178/D178),\"\")","v":""},""]
[null,null,null,null,null,null,null,{"$f":"SUMIFS(Sheet1!$H$4:$H$1497,Sheet1!$F$4:$F$1497,B180,Sheet1!$Z$4:$Z$1497,$H$3)","v":0},{"$f":"SUMIFS(Sheet1!$J$4:$J$15,Sheet1!$F$4:$F$15,B180,Sheet1!$Z$4:$Z$15,$H$3)","v":0},{"$f":"SUMIFS(Sheet1!$H$4:$H$1497,Sheet1!$F$4:$F$1497,B180,Sheet1!$Z$4:$Z$1497,$J$3)","v":0},null,null,"",{"$f":"IFERROR(IF(B179<\"\",SUMIFS(Sheet1!$L$4:$L$997,Sheet1!$F$4:$F$997,B179,Sheet1!$Z$4:$Z$997,$H$3)+F179/SUMIFS(Sheet1!$H$4:$H$997,Sheet1!$F$4:$F$997,B179,Sheet1!$Z$4:$Z$997,$H$3),F179/D179),\"\")","v":""},""]
[null,null,null,null,null,null,null,{"$f":"SUMIFS(Sheet1!$H$4:$H$1497,Sheet1!$F$4:$F$1497,B181,Sheet1!$Z$4:$Z$1497,$H$3)","v":0},{"$f":"SUMIFS(Sheet1!$J$4:$J$15,Sheet1!$F$4:$F$15,B181,Sheet1!$Z$4:$Z$15,$H$3)","v":0},{"$f":"SUMIFS(Sheet1!$H$4:$H$1497,Sheet1!$F$4:$F$1497,B181,Sheet1!$Z$4:$Z$1497,$J$3)","v":0},null,null,"",{"$f":"IFERROR(IF(B180<\"\",SUMIFS(Sheet1!$L$4:$L$997,Sheet1!$F$4:$F$997,B180,Sheet1!$Z$4:$Z$997,$H$3)+F180/SUMIFS(Sheet1!$H$4:$H$997,Sheet1!$F$4:$F$997,B180,Sheet1!$Z$4:$Z$997,$H$3),F180/D180),\"\")","v":""},""]
[null,null,null,null,null,null,null,{"$f":"SUMIFS(Sheet1!$H$4:$H$1497,Sheet1!$F$4:$F$1497,B182,Sheet1!$Z$4:$Z$1497,$H$3)","v":0},{"$f":"SUMIFS(Sheet1!$J$4:$J$15,Sheet1!$F$4:$F$15,B182,Sheet1!$Z$4:$Z$15,$H$3)","v":0},{"$f":"SUMIFS(Sheet1!$H$4:$H$1497,Sheet1!$F$4:$F$1497,B182,Sheet1!$Z$4:$Z$1497,$J$3)","v":0},null,null,"",{"$f":"IFERROR(IF(B181<\"\",SUMIFS(Sheet1!$L$4:$L$997,Sheet1!$F$4:$F$997,B181,Sheet1!$Z$4:$Z$997,$H$3)+F181/SUMIFS(Sheet1!$H$4:$H$997,Sheet1!$F$4:$F$997,B181,Sheet1!$Z$4:$Z$997,$H$3),F181/D181),\"\")","v":""},""]
[null,null,null,null,null,null,null,{"$f":"SUMIFS(Sheet1!$H$4:$H$1497,Sheet1!$F$4:$F$1497,B183,Sheet1!$Z$4:$Z$1497,$H$3)","v":0},{"$f":"SUMIFS(Sheet1!$J$4:$J$15,Sheet1!$F$4:$F$15,B183,Sheet1!$Z$4:$Z$15,$H$3)","v":0},{"$f":"SUMIFS(Sheet1!$H$4:$H$1497,Sheet1!$F$4:$F$1497,B183,Sheet1!$Z$4:$Z$1497,$J$3)","v":0},null,null,"",{"$f":"IFERROR(IF(B182<\"\",SUMIFS(Sheet1!$L$4:$L$997,Sheet1!$F$4:$F$997,B182,Sheet1!$Z$4:$Z$997,$H$3)+F182/SUMIFS(Sheet1!$H$4:$H$997,Sheet1!$F$4:$F$997,B182,Sheet1!$Z$4:$Z$997,$H$3),F182/D182),\"\")","v":""},""]
[null,null,null,null,null,null,null,{"$f":"SUMIFS(Sheet1!$H$4:$H$1497,Sheet1!$F$4:$F$1497,B184,Sheet1!$Z$4:$Z$1497,$H$3)","v":0},{"$f":"SUMIFS(Sheet1!$J$4:$J$15,Sheet1!$F$4:$F$15,B184,Sheet1!$Z$4:$Z$15,$H$3)","v":0},{"$f":"SUMIFS(Sheet1!$H$4:$H$1497,Sheet1!$F$4:$F$1497,B184,Sheet1!$Z$4:$Z$1497,$J$3)","v":0},null,null,"",{"$f":"IFERROR(IF(B183<\"\",SUMIFS(Sheet1!$L$4:$L$997,Sheet1!$F$4:$F$997,B183,Sheet1!$Z$4:$Z$997,$H$3)+F183/SUMIFS(Sheet1!$H$4:$H$997,Sheet1!$F$4:$F$997,B183,Sheet1!$Z$4:$Z$997,$H$3),F183/D183),\"\")","v":""},""]
[null,null,null,null,null,null,null,{"$f":"SUMIFS(Sheet1!$H$4:$H$1497,Sheet1!$F$4:$F$1497,B185,Sheet1!$Z$4:$Z$1497,$H$3)","v":0},{"$f":"SUMIFS(Sheet1!$J$4:$J$15,Sheet1!$F$4:$F$15,B185,Sheet1!$Z$4:$Z$15,$H$3)","v":0},{"$f":"SUMIFS(Sheet1!$H$4:$H$1497,Sheet1!$F$4:$F$1497,B185,Sheet1!$Z$4:$Z$1497,$J$3)","v":0},null,null,"",{"$f":"IFERROR(IF(B184<\"\",SUMIFS(Sheet1!$L$4:$L$997,Sheet1!$F$4:$F$997,B184,Sheet1!$Z$4:$Z$997,$H$3)+F184/SUMIFS(Sheet1!$H$4:$H$997,Sheet1!$F$4:$F$997,B184,Sheet1!$Z$4:$Z$997,$H$3),F184/D184),\"\")","v":""},""]
[null,null,null,null,null,null,null,{"$f":"SUMIFS(Sheet1!$H$4:$H$1497,Sheet1!$F$4:$F$1497,B186,Sheet1!$Z$4:$Z$1497,$H$3)","v":0},{"$f":"SUMIFS(Sheet1!$J$4:$J$15,Sheet1!$F$4:$F$15,B186,Sheet1!$Z$4:$Z$15,$H$3)","v":0},{"$f":"SUMIFS(Sheet1!$H$4:$H$1497,Sheet1!$F$4:$F$1497,B186,Sheet1!$Z$4:$Z$1497,$J$3)","v":0},null,null,"",{"$f":"IFERROR(IF(B185<\"\",SUMIFS(Sheet1!$L$4:$L$997,Sheet1!$F$4:$F$997,B185,Sheet1!$Z$4:$Z$997,$H$3)+F185/SUMIFS(Sheet1!$H$4:$H$997,Sheet1!$F$4:$F$997,B185,Sheet1!$Z$4:$Z$997,$H$3),F185/D185),\"\")","v":""},""]
[null,null,null,null,null,null,null,{"$f":"SUMIFS(Sheet1!$H$4:$H$1497,Sheet1!$F$4:$F$1497,B187,Sheet1!$Z$4:$Z$1497,$H$3)","v":0},{"$f":"SUMIFS(Sheet1!$J$4:$J$15,Sheet1!$F$4:$F$15,B187,Sheet1!$Z$4:$Z$15,$H$3)","v":0},{"$f":"SUMIFS(Sheet1!$H$4:$H$1497,Sheet1!$F$4:$F$1497,B187,Sheet1!$Z$4:$Z$1497,$J$3)","v":0},null,null,"",{"$f":"IFERROR(IF(B186<\"\",SUMIFS(Sheet1!$L$4:$L$997,Sheet1!$F$4:$F$997,B186,Sheet1!$Z$4:$Z$997,$H$3)+F186/SUMIFS(Sheet1!$H$4:$H$997,Sheet1!$F$4:$F$997,B186,Sheet1!$Z$4:$Z$997,$H$3),F186/D186),\"\")","v":""},""]
[null,null,null,null,null,null,null,{"$f":"SUMIFS(Sheet1!$H$4:$H$1497,Sheet1!$F$4:$F$1497,B188,Sheet1!$Z$4:$Z$1497,$H$3)","v":0},{"$f":"SUMIFS(Sheet1!$J$4:$J$15,Sheet1!$F$4:$F$15,B188,Sheet1!$Z$4:$Z$15,$H$3)","v":0},{"$f":"SUMIFS(Sheet1!$H$4:$H$1497,Sheet1!$F$4:$F$1497,B188,Sheet1!$Z$4:$Z$1497,$J$3)","v":0},null,null,"",{"$f":"IFERROR(IF(B187<\"\",SUMIFS(Sheet1!$L$4:$L$997,Sheet1!$F$4:$F$997,B187,Sheet1!$Z$4:$Z$997,$H$3)+F187/SUMIFS(Sheet1!$H$4:$H$997,Sheet1!$F$4:$F$997,B187,Sheet1!$Z$4:$Z$997,$H$3),F187/D187),\"\")","v":""},""]
[null,null,null,null,null,null,null,{"$f":"SUMIFS(Sheet1!$H$4:$H$1497,Sheet1!$F$4:$F$1497,B189,Sheet1!$Z$4:$Z$1497,$H$3)","v":0},{"$f":"SUMIFS(Sheet1!$J$4:$J$15,Sheet1!$F$4:$F$15,B189,Sheet1!$Z$4:$Z$15,$H$3)","v":0},{"$f":"SUMIFS(Sheet1!$H$4:$H$1497,Sheet1!$F$4:$F$1497,B189,Sheet1!$Z$4:$Z$1497,$J$3)","v":0},null,null,"",{"$f":"IFERROR(IF(B188<\"\",SUMIFS(Sheet1!$L$4:$L$997,Sheet1!$F$4:$F$997,B188,Sheet1!$Z$4:$Z$997,$H$3)+F188/SUMIFS(Sheet1!$H$4:$H$997,Sheet1!$F$4:$F$997,B188,Sheet1!$Z$4:$Z$997,$H$3),F188/D188),\"\")","v":""},""]
[null,null,null,null,null,null,null,{"$f":"SUMIFS(Sheet1!$H$4:$H$1497,Sheet1!$F$4:$F$1497,B190,Sheet1!$Z$4:$Z$1497,$H$3)","v":0},{"$f":"SUMIFS(Sheet1!$J$4:$J$15,Sheet1!$F$4:$F$15,B190,Sheet1!$Z$4:$Z$15,$H$3)","v":0},{"$f":"SUMIFS(Sheet1!$H$4:$H$1497,Sheet1!$F$4:$F$1497,B190,Sheet1!$Z$4:$Z$1497,$J$3)","v":0},null,null,"",{"$f":"IFERROR(IF(B189<\"\",SUMIFS(Sheet1!$L$4:$L$997,Sheet1!$F$4:$F$997,B189,Sheet1!$Z$4:$Z$997,$H$3)+F189/SUMIFS(Sheet1!$H$4:$H$997,Sheet1!$F$4:$F$997,B189,Sheet1!$Z$4:$Z$997,$H$3),F189/D189),\"\")","v":""},""]
[null,null,null,null,null,null,null,{"$f":"SUMIFS(Sheet1!$H$4:$H$1497,Sheet1!$F$4:$F$1497,B191,Sheet1!$Z$4:$Z$1497,$H$3)","v":0},{"$f":"SUMIFS(Sheet1!$J$4:$J$15,Sheet1!$F$4:$F$15,B191,Sheet1!$Z$4:$Z$15,$H$3)","v":0},{"$f":"SUMIFS(Sheet1!$H$4:$H$1497,Sheet1!$F$4:$F$1497,B191,Sheet1!$Z$4:$Z$1497,$J$3)","v":0},null,null,"",{"$f":"IFERROR(IF(B190<\"\",SUMIFS(Sheet1!$L$4:$L$997,Sheet1!$F$4:$F$997,B190,Sheet1!$Z$4:$Z$997,$H$3)+F190/SUMIFS(Sheet1!$H$4:$H$997,Sheet1!$F$4:$F$997,B190,Sheet1!$Z$4:$Z$997,$H$3),F190/D190),\"\")","v":""},""]
[null,null,null,null,null,null,null,{"$f":"SUMIFS(Sheet1!$H$4:$H$1497,Sheet1!$F$4:$F$1497,B192,Sheet1!$Z$4:$Z$1497,$H$3)","v":0},{"$f":"SUMIFS(Sheet1!$J$4:$J$15,Sheet1!$F$4:$F$15,B192,Sheet1!$Z$4:$Z$15,$H$3)","v":0},{"$f":"SUMIFS(Sheet1!$H$4:$H$1497,Sheet1!$F$4:$F$1497,B192,Sheet1!$Z$4:$Z$1497,$J$3)","v":0},null,null,"",{"$f":"IFERROR(IF(B191<\"\",SUMIFS(Sheet1!$L$4:$L$997,Sheet1!$F$4:$F$997,B191,Sheet1!$Z$4:$Z$997,$H$3)+F191/SUMIFS(Sheet1!$H$4:$H$997,Sheet1!$F$4:$F$997,B191,Sheet1!$Z$4:$Z$997,$H$3),F191/D191),\"\")","v":""},""]
[null,null,null,null,null,null,null,{"$f":"SUMIFS(Sheet1!$H$4:$H$1497,Sheet1!$F$4:$F$1497,B193,Sheet1!$Z$4:$Z$1497,$H$3)","v":0},{"$f":"SUMIFS(Sheet1!$J$4:$J$15,Sheet1!$F$4:$F$15,B193,Sheet1!$Z$4:$Z$15,$H$3)","v":0},{"$f":"SUMIFS(Sheet1!$H$4:$H$1497,Sheet1!$F$4:$F$1497,B193,Sheet1!$Z$4:$Z$1497,$J$3)","v":0},null,null,"",{"$f":"IFERROR(IF(B192<\"\",SUMIFS(Sheet1!$L$4:$L$997,Sheet1!$F$4:$F$997,B192,Sheet1!$Z$4:$Z$997,$H$3)+F192/SUMIFS(Sheet1!$H$4:$H$997,Sheet1!$F$4:$F$997,B192,Sheet1!$Z$4:$Z$997,$H$3),F192/D192),\"\")","v":""},""]
[null,null,null,null,null,null,null,{"$f":"SUMIFS(Sheet1!$H$4:$H$1497,Sheet1!$F$4:$F$1497,B194,Sheet1!$Z$4:$Z$1497,$H$3)","v":0},{"$f":"SUMIFS(Sheet1!$J$4:$J$15,Sheet1!$F$4:$F$15,B194,Sheet1!$Z$4:$Z$15,$H$3)","v":0},{"$f":"SUMIFS(Sheet1!$H$4:$H$1497,Sheet1!$F$4:$F$1497,B194,Sheet1!$Z$4:$Z$1497,$J$3)","v":0},null,null,"",{"$f":"IFERROR(IF(B193<\"\",SUMIFS(Sheet1!$L$4:$L$997,Sheet1!$F$4:$F$997,B193,Sheet1!$Z$4:$Z$997,$H$3)+F193/SUMIFS(Sheet1!$H$4:$H$997,Sheet1!$F$4:$F$997,B193,Sheet1!$Z$4:$Z$997,$H$3),F193/D193),\"\")","v":""},""]
[null,null,null,null,null,null,null,{"$f":"SUMIFS(Sheet1!$H$4:$H$1497,Sheet1!$F$4:$F$1497,B195,Sheet1!$Z$4:$Z$1497,$H$3)","v":0},{"$f":"SUMIFS(Sheet1!$J$4:$J$15,Sheet1!$F$4:$F$15,B195,Sheet1!$Z$4:$Z$15,$H$3)","v":0},{"$f":"SUMIFS(Sheet1!$H$4:$H$1497,Sheet1!$F$4:$F$1497,B195,Sheet1!$Z$4:$Z$1497,$J$3)","v":0},null,null,"",{"$f":"IFERROR(IF(B194<\"\",SUMIFS(Sheet1!$L$4:$L$997,Sheet1!$F$4:$F$997,B194,Sheet1!$Z$4:$Z$997,$H$3)+F194/SUMIFS(Sheet1!$H$4:$H$997,Sheet1!$F$4:$F$997,B194,Sheet1!$Z$4:$Z$997,$H$3),F194/D194),\"\")","v":""},""]
[null,null,null,null,null,null,null,{"$f":"SUMIFS(Sheet1!$H$4:$H$1497,Sheet1!$F$4:$F$1497,B196,Sheet1!$Z$4:$Z$1497,$H$3)","v":0},{"$f":"SUMIFS(Sheet1!$J$4:$J$15,Sheet1!$F$4:$F$15,B196,Sheet1!$Z$4:$Z$15,$H$3)","v":0},{"$f":"SUMIFS(Sheet1!$H$4:$H$1497,Sheet1!$F$4:$F$1497,B196,Sheet1!$Z$4:$Z$1497,$J$3)","v":0},null,null,"",{"$f":"IFERROR(IF(B195<\"\",SUMIFS(Sheet1!$L$4:$L$997,Sheet1!$F$4:$F$997,B195,Sheet1!$Z$4:$Z$997,$H$3)+F195/SUMIFS(Sheet1!$H$4:$H$997,Sheet1!$F$4:$F$997,B195,Sheet1!$Z$4:$Z$997,$H$3),F195/D195),\"\")","v":""},""]
[null,null,null,null,null,null,null,{"$f":"SUMIFS(Sheet1!$H$4:$H$1497,Sheet1!$F$4:$F$1497,B197,Sheet1!$Z$4:$Z$1497,$H$3)","v":0},{"$f":"SUMIFS(Sheet1!$J$4:$J$15,Sheet1!$F$4:$F$15,B197,Sheet1!$Z$4:$Z$15,$H$3)","v":0},{"$f":"SUMIFS(Sheet1!$H$4:$H$1497,Sheet1!$F$4:$F$1497,B197,Sheet1!$Z$4:$Z$1497,$J$3)","v":0},null,null,"",{"$f":"IFERROR(IF(B196<\"\",SUMIFS(Sheet1!$L$4:$L$997,Sheet1!$F$4:$F$997,B196,Sheet1!$Z$4:$Z$997,$H$3)+F196/SUMIFS(Sheet1!$H$4:$H$997,Sheet1!$F$4:$F$997,B196,Sheet1!$Z$4:$Z$997,$H$3),F196/D196),\"\")","v":""},""]
[null,null,null,null,null,null,null,{"$f":"SUMIFS(Sheet1!$H$4:$H$1497,Sheet1!$F$4:$F$1497,B198,Sheet1!$Z$4:$Z$1497,$H$3)","v":0},{"$f":"SUMIFS(Sheet1!$J$4:$J$15,Sheet1!$F$4:$F$15,B198,Sheet1!$Z$4:$Z$15,$H$3)","v":0},{"$f":"SUMIFS(Sheet1!$H$4:$H$1497,Sheet1!$F$4:$F$1497,B198,Sheet1!$Z$4:$Z$1497,$J$3)","v":0},null,null,{"$f":"IF(L197<>\"\",IF(L197>=K197,\"مطلوب\",\"\"),\"\")","v":""},{"$f":"IFERROR(IF(B197<\"\",SUMIFS(Sheet1!$L$4:$L$997,Sheet1!$F$4:$F$997,B197,Sheet1!$Z$4:$Z$997,$H$3)+F197/SUMIFS(Sheet1!$H$4:$H$997,Sheet1!$F$4:$F$997,B197,Sheet1!$Z$4:$Z$997,$H$3),F197/D197),\"\")","v":""},{"$f":"IFERROR(SUMPRODUCT(K197*N197),\"\")","v":""}]
[null,null,null,null,null,null,null,{"$f":"SUMIFS(Sheet1!$H$4:$H$1497,Sheet1!$F$4:$F$1497,B199,Sheet1!$Z$4:$Z$1497,$H$3)","v":0},{"$f":"SUMIFS(Sheet1!$J$4:$J$15,Sheet1!$F$4:$F$15,B199,Sheet1!$Z$4:$Z$15,$H$3)","v":0},{"$f":"SUMIFS(Sheet1!$H$4:$H$1497,Sheet1!$F$4:$F$1497,B199,Sheet1!$Z$4:$Z$1497,$J$3)","v":0},null,null,"",{"$f":"IFERROR(IF(B198<\"\",SUMIFS(Sheet1!$L$4:$L$997,Sheet1!$F$4:$F$997,B198,Sheet1!$Z$4:$Z$997,$H$3)+F198/SUMIFS(Sheet1!$H$4:$H$997,Sheet1!$F$4:$F$997,B198,Sheet1!$Z$4:$Z$997,$H$3),F198/D198),\"\")","v":""},""]
[null,null,null,null,null,null,null,{"$f":"SUMIFS(Sheet1!$H$4:$H$1497,Sheet1!$F$4:$F$1497,B200,Sheet1!$Z$4:$Z$1497,$H$3)","v":0},{"$f":"SUMIFS(Sheet1!$J$4:$J$15,Sheet1!$F$4:$F$15,B200,Sheet1!$Z$4:$Z$15,$H$3)","v":0},{"$f":"SUMIFS(Sheet1!$H$4:$H$1497,Sheet1!$F$4:$F$1497,B200,Sheet1!$Z$4:$Z$1497,$J$3)","v":0},null,null,"",{"$f":"IFERROR(IF(B199<\"\",SUMIFS(Sheet1!$L$4:$L$997,Sheet1!$F$4:$F$997,B199,Sheet1!$Z$4:$Z$997,$H$3)+F199/SUMIFS(Sheet1!$H$4:$H$997,Sheet1!$F$4:$F$997,B199,Sheet1!$Z$4:$Z$997,$H$3),F199/D199),\"\")","v":""},""]
[null,null,null,null,null,null,null,{"$f":"SUMIFS(Sheet1!$H$4:$H$1497,Sheet1!$F$4:$F$1497,B201,Sheet1!$Z$4:$Z$1497,$H$3)","v":0},{"$f":"SUMIFS(Sheet1!$J$4:$J$15,Sheet1!$F$4:$F$15,B201,Sheet1!$Z$4:$Z$15,$H$3)","v":0},{"$f":"SUMIFS(Sheet1!$H$4:$H$1497,Sheet1!$F$4:$F$1497,B201,Sheet1!$Z$4:$Z$1497,$J$3)","v":0},null,null,"",{"$f":"IFERROR(IF(B200<\"\",SUMIFS(Sheet1!$L$4:$L$997,Sheet1!$F$4:$F$997,B200,Sheet1!$Z$4:$Z$997,$H$3)+F200/SUMIFS(Sheet1!$H$4:$H$997,Sheet1!$F$4:$F$997,B200,Sheet1!$Z$4:$Z$997,$H$3),F200/D200),\"\")","v":""},""]
[null,null,null,null,null,null,null,{"$f":"SUMIFS(Sheet1!$H$4:$H$1497,Sheet1!$F$4:$F$1497,B202,Sheet1!$Z$4:$Z$1497,$H$3)","v":0},{"$f":"SUMIFS(Sheet1!$J$4:$J$15,Sheet1!$F$4:$F$15,B202,Sheet1!$Z$4:$Z$15,$H$3)","v":0},{"$f":"SUMIFS(Sheet1!$H$4:$H$1497,Sheet1!$F$4:$F$1497,B202,Sheet1!$Z$4:$Z$1497,$J$3)","v":0},null,null,"",{"$f":"IFERROR(IF(B201<\"\",SUMIFS(Sheet1!$L$4:$L$997,Sheet1!$F$4:$F$997,B201,Sheet1!$Z$4:$Z$997,$H$3)+F201/SUMIFS(Sheet1!$H$4:$H$997,Sheet1!$F$4:$F$997,B201,Sheet1!$Z$4:$Z$997,$H$3),F201/D201),\"\")","v":""},""]
[null,null,null,null,null,null,null,{"$f":"SUMIFS(Sheet1!$H$4:$H$1497,Sheet1!$F$4:$F$1497,B203,Sheet1!$Z$4:$Z$1497,$H$3)","v":0},{"$f":"SUMIFS(Sheet1!$J$4:$J$15,Sheet1!$F$4:$F$15,B203,Sheet1!$Z$4:$Z$15,$H$3)","v":0},{"$f":"SUMIFS(Sheet1!$H$4:$H$1497,Sheet1!$F$4:$F$1497,B203,Sheet1!$Z$4:$Z$1497,$J$3)","v":0},null,null,"",{"$f":"IFERROR(IF(B202<\"\",SUMIFS(Sheet1!$L$4:$L$997,Sheet1!$F$4:$F$997,B202,Sheet1!$Z$4:$Z$997,$H$3)+F202/SUMIFS(Sheet1!$H$4:$H$997,Sheet1!$F$4:$F$997,B202,Sheet1!$Z$4:$Z$997,$H$3),F202/D202),\"\")","v":""},""]
[null,null,null,null,null,null,null,{"$f":"SUMIFS(Sheet1!$H$4:$H$1497,Sheet1!$F$4:$F$1497,B204,Sheet1!$Z$4:$Z$1497,$H$3)","v":0},{"$f":"SUMIFS(Sheet1!$J$4:$J$15,Sheet1!$F$4:$F$15,B204,Sheet1!$Z$4:$Z$15,$H$3)","v":0},{"$f":"SUMIFS(Sheet1!$H$4:$H$1497,Sheet1!$F$4:$F$1497,B204,Sheet1!$Z$4:$Z$1497,$J$3)","v":0},null,null,"",{"$f":"IFERROR(IF(B203<\"\",SUMIFS(Sheet1!$L$4:$L$997,Sheet1!$F$4:$F$997,B203,Sheet1!$Z$4:$Z$997,$H$3)+F203/SUMIFS(Sheet1!$H$4:$H$997,Sheet1!$F$4:$F$997,B203,Sheet1!$Z$4:$Z$997,$H$3),F203/D203),\"\")","v":""},""]
[null,null,null,null,null,null,null,{"$f":"SUMIFS(Sheet1!$H$4:$H$1497,Sheet1!$F$4:$F$1497,B205,Sheet1!$Z$4:$Z$1497,$H$3)","v":0},{"$f":"SUMIFS(Sheet1!$J$4:$J$15,Sheet1!$F$4:$F$15,B205,Sheet1!$Z$4:$Z$15,$H$3)","v":0},{"$f":"SUMIFS(Sheet1!$H$4:$H$1497,Sheet1!$F$4:$F$1497,B205,Sheet1!$Z$4:$Z$1497,$J$3)","v":0},null,null,"",{"$f":"IFERROR(IF(B204<\"\",SUMIFS(Sheet1!$L$4:$L$997,Sheet1!$F$4:$F$997,B204,Sheet1!$Z$4:$Z$997,$H$3)+F204/SUMIFS(Sheet1!$H$4:$H$997,Sheet1!$F$4:$F$997,B204,Sheet1!$Z$4:$Z$997,$H$3),F204/D204),\"\")","v":""},""]
[null,null,null,null,null,null,null,{"$f":"SUMIFS(Sheet1!$H$4:$H$1497,Sheet1!$F$4:$F$1497,B206,Sheet1!$Z$4:$Z$1497,$H$3)","v":0},{"$f":"SUMIFS(Sheet1!$J$4:$J$15,Sheet1!$F$4:$F$15,B206,Sheet1!$Z$4:$Z$15,$H$3)","v":0},{"$f":"SUMIFS(Sheet1!$H$4:$H$1497,Sheet1!$F$4:$F$1497,B206,Sheet1!$Z$4:$Z$1497,$J$3)","v":0},null,null,"",{"$f":"IFERROR(IF(B205<\"\",SUMIFS(Sheet1!$L$4:$L$997,Sheet1!$F$4:$F$997,B205,Sheet1!$Z$4:$Z$997,$H$3)+F205/SUMIFS(Sheet1!$H$4:$H$997,Sheet1!$F$4:$F$997,B205,Sheet1!$Z$4:$Z$997,$H$3),F205/D205),\"\")","v":""},""]
[null,null,null,null,null,null,null,{"$f":"SUMIFS(Sheet1!$H$4:$H$1497,Sheet1!$F$4:$F$1497,B207,Sheet1!$Z$4:$Z$1497,$H$3)","v":0},{"$f":"SUMIFS(Sheet1!$J$4:$J$15,Sheet1!$F$4:$F$15,B207,Sheet1!$Z$4:$Z$15,$H$3)","v":0},{"$f":"SUMIFS(Sheet1!$H$4:$H$1497,Sheet1!$F$4:$F$1497,B207,Sheet1!$Z$4:$Z$1497,$J$3)","v":0},null,null,"",{"$f":"IFERROR(IF(B206<\"\",SUMIFS(Sheet1!$L$4:$L$997,Sheet1!$F$4:$F$997,B206,Sheet1!$Z$4:$Z$997,$H$3)+F206/SUMIFS(Sheet1!$H$4:$H$997,Sheet1!$F$4:$F$997,B206,Sheet1!$Z$4:$Z$997,$H$3),F206/D206),\"\")","v":""},""]
[null,null,null,null,null,null,null,{"$f":"SUMIFS(Sheet1!$H$4:$H$1497,Sheet1!$F$4:$F$1497,B208,Sheet1!$Z$4:$Z$1497,$H$3)","v":0},{"$f":"SUMIFS(Sheet1!$J$4:$J$15,Sheet1!$F$4:$F$15,B208,Sheet1!$Z$4:$Z$15,$H$3)","v":0},{"$f":"SUMIFS(Sheet1!$H$4:$H$1497,Sheet1!$F$4:$F$1497,B208,Sheet1!$Z$4:$Z$1497,$J$3)","v":0},null,null,"",{"$f":"IFERROR(IF(B207<\"\",SUMIFS(Sheet1!$L$4:$L$997,Sheet1!$F$4:$F$997,B207,Sheet1!$Z$4:$Z$997,$H$3)+F207/SUMIFS(Sheet1!$H$4:$H$997,Sheet1!$F$4:$F$997,B207,Sheet1!$Z$4:$Z$997,$H$3),F207/D207),\"\")","v":""},""]
[null,null,null,null,null,null,null,{"$f":"SUMIFS(Sheet1!$H$4:$H$1497,Sheet1!$F$4:$F$1497,B209,Sheet1!$Z$4:$Z$1497,$H$3)","v":0},{"$f":"SUMIFS(Sheet1!$J$4:$J$15,Sheet1!$F$4:$F$15,B209,Sheet1!$Z$4:$Z$15,$H$3)","v":0},{"$f":"SUMIFS(Sheet1!$H$4:$H$1497,Sheet1!$F$4:$F$1497,B209,Sheet1!$Z$4:$Z$1497,$J$3)","v":0},null,null,"",{"$f":"IFERROR(IF(B208<\"\",SUMIFS(Sheet1!$L$4:$L$997,Sheet1!$F$4:$F$997,B208,Sheet1!$Z$4:$Z$997,$H$3)+F208/SUMIFS(Sheet1!$H$4:$H$997,Sheet1!$F$4:$F$997,B208,Sheet1!$Z$4:$Z$997,$H$3),F208/D208),\"\")","v":""},""]
[null,null,null,null,null,null,null,{"$f":"SUMIFS(Sheet1!$H$4:$H$1497,Sheet1!$F$4:$F$1497,B210,Sheet1!$Z$4:$Z$1497,$H$3)","v":0},{"$f":"SUMIFS(Sheet1!$J$4:$J$15,Sheet1!$F$4:$F$15,B210,Sheet1!$Z$4:$Z$15,$H$3)","v":0},{"$f":"SUMIFS(Sheet1!$H$4:$H$1497,Sheet1!$F$4:$F$1497,B210,Sheet1!$Z$4:$Z$1497,$J$3)","v":0},null,null,"",{"$f":"IFERROR(IF(B209<\"\",SUMIFS(Sheet1!$L$4:$L$997,Sheet1!$F$4:$F$997,B209,Sheet1!$Z$4:$Z$997,$H$3)+F209/SUMIFS(Sheet1!$H$4:$H$997,Sheet1!$F$4:$F$997,B209,Sheet1!$Z$4:$Z$997,$H$3),F209/D209),\"\")","v":""},""]
[null,null,null,null,null,null,null,{"$f":"SUMIFS(Sheet1!$H$4:$H$1497,Sheet1!$F$4:$F$1497,B211,Sheet1!$Z$4:$Z$1497,$H$3)","v":0},{"$f":"SUMIFS(Sheet1!$J$4:$J$15,Sheet1!$F$4:$F$15,B211,Sheet1!$Z$4:$Z$15,$H$3)","v":0},{"$f":"SUMIFS(Sheet1!$H$4:$H$1497,Sheet1!$F$4:$F$1497,B211,Sheet1!$Z$4:$Z$1497,$J$3)","v":0},null,null,"",{"$f":"IFERROR(IF(B210<\"\",SUMIFS(Sheet1!$L$4:$L$997,Sheet1!$F$4:$F$997,B210,Sheet1!$Z$4:$Z$997,$H$3)+F210/SUMIFS(Sheet1!$H$4:$H$997,Sheet1!$F$4:$F$997,B210,Sheet1!$Z$4:$Z$997,$H$3),F210/D210),\"\")","v":""},""]
[null,null,null,null,null,null,null,{"$f":"SUMIFS(Sheet1!$H$4:$H$1497,Sheet1!$F$4:$F$1497,B212,Sheet1!$Z$4:$Z$1497,$H$3)","v":0},{"$f":"SUMIFS(Sheet1!$J$4:$J$15,Sheet1!$F$4:$F$15,B212,Sheet1!$Z$4:$Z$15,$H$3)","v":0},{"$f":"SUMIFS(Sheet1!$H$4:$H$1497,Sheet1!$F$4:$F$1497,B212,Sheet1!$Z$4:$Z$1497,$J$3)","v":0},null,null,"",{"$f":"IFERROR(IF(B211<\"\",SUMIFS(Sheet1!$L$4:$L$997,Sheet1!$F$4:$F$997,B211,Sheet1!$Z$4:$Z$997,$H$3)+F211/SUMIFS(Sheet1!$H$4:$H$997,Sheet1!$F$4:$F$997,B211,Sheet1!$Z$4:$Z$997,$H$3),F211/D211),\"\")","v":""},""]
[null,null,null,null,null,null,null,{"$f":"SUMIFS(Sheet1!$H$4:$H$1497,Sheet1!$F$4:$F$1497,B213,Sheet1!$Z$4:$Z$1497,$H$3)","v":0},{"$f":"SUMIFS(Sheet1!$J$4:$J$15,Sheet1!$F$4:$F$15,B213,Sheet1!$Z$4:$Z$15,$H$3)","v":0},{"$f":"SUMIFS(Sheet1!$H$4:$H$1497,Sheet1!$F$4:$F$1497,B213,Sheet1!$Z$4:$Z$1497,$J$3)","v":0},null,null,"",{"$f":"IFERROR(IF(B212<\"\",SUMIFS(Sheet1!$L$4:$L$997,Sheet1!$F$4:$F$997,B212,Sheet1!$Z$4:$Z$997,$H$3)+F212/SUMIFS(Sheet1!$H$4:$H$997,Sheet1!$F$4:$F$997,B212,Sheet1!$Z$4:$Z$997,$H$3),F212/D212),\"\")","v":""},""]
[null,null,null,null,null,null,null,{"$f":"SUMIFS(Sheet1!$H$4:$H$1497,Sheet1!$F$4:$F$1497,B214,Sheet1!$Z$4:$Z$1497,$H$3)","v":0},{"$f":"SUMIFS(Sheet1!$J$4:$J$15,Sheet1!$F$4:$F$15,B214,Sheet1!$Z$4:$Z$15,$H$3)","v":0},{"$f":"SUMIFS(Sheet1!$H$4:$H$1497,Sheet1!$F$4:$F$1497,B214,Sheet1!$Z$4:$Z$1497,$J$3)","v":0},null,null,"",{"$f":"IFERROR(IF(B213<\"\",SUMIFS(Sheet1!$L$4:$L$997,Sheet1!$F$4:$F$997,B213,Sheet1!$Z$4:$Z$997,$H$3)+F213/SUMIFS(Sheet1!$H$4:$H$997,Sheet1!$F$4:$F$997,B213,Sheet1!$Z$4:$Z$997,$H$3),F213/D213),\"\")","v":""},""]
[null,null,null,null,null,null,null,{"$f":"SUMIFS(Sheet1!$H$4:$H$1497,Sheet1!$F$4:$F$1497,B215,Sheet1!$Z$4:$Z$1497,$H$3)","v":0},{"$f":"SUMIFS(Sheet1!$J$4:$J$15,Sheet1!$F$4:$F$15,B215,Sheet1!$Z$4:$Z$15,$H$3)","v":0},{"$f":"SUMIFS(Sheet1!$H$4:$H$1497,Sheet1!$F$4:$F$1497,B215,Sheet1!$Z$4:$Z$1497,$J$3)","v":0},null,null,"",{"$f":"IFERROR(IF(B214<\"\",SUMIFS(Sheet1!$L$4:$L$997,Sheet1!$F$4:$F$997,B214,Sheet1!$Z$4:$Z$997,$H$3)+F214/SUMIFS(Sheet1!$H$4:$H$997,Sheet1!$F$4:$F$997,B214,Sheet1!$Z$4:$Z$997,$H$3),F214/D214),\"\")","v":""},""]
[null,null,null,null,null,null,null,{"$f":"SUMIFS(Sheet1!$H$4:$H$1497,Sheet1!$F$4:$F$1497,B216,Sheet1!$Z$4:$Z$1497,$H$3)","v":0},{"$f":"SUMIFS(Sheet1!$J$4:$J$15,Sheet1!$F$4:$F$15,B216,Sheet1!$Z$4:$Z$15,$H$3)","v":0},{"$f":"SUMIFS(Sheet1!$H$4:$H$1497,Sheet1!$F$4:$F$1497,B216,Sheet1!$Z$4:$Z$1497,$J$3)","v":0},null,null,"",{"$f":"IFERROR(IF(B215<\"\",SUMIFS(Sheet1!$L$4:$L$997,Sheet1!$F$4:$F$997,B215,Sheet1!$Z$4:$Z$997,$H$3)+F215/SUMIFS(Sheet1!$H$4:$H$997,Sheet1!$F$4:$F$997,B215,Sheet1!$Z$4:$Z$997,$H$3),F215/D215),\"\")","v":""},""]
[null,null,null,null,null,null,null,{"$f":"SUMIFS(Sheet1!$H$4:$H$1497,Sheet1!$F$4:$F$1497,B217,Sheet1!$Z$4:$Z$1497,$H$3)","v":0},{"$f":"SUMIFS(Sheet1!$J$4:$J$15,Sheet1!$F$4:$F$15,B217,Sheet1!$Z$4:$Z$15,$H$3)","v":0},{"$f":"SUMIFS(Sheet1!$H$4:$H$1497,Sheet1!$F$4:$F$1497,B217,Sheet1!$Z$4:$Z$1497,$J$3)","v":0},null,null,"",{"$f":"IFERROR(IF(B216<\"\",SUMIFS(Sheet1!$L$4:$L$997,Sheet1!$F$4:$F$997,B216,Sheet1!$Z$4:$Z$997,$H$3)+F216/SUMIFS(Sheet1!$H$4:$H$997,Sheet1!$F$4:$F$997,B216,Sheet1!$Z$4:$Z$997,$H$3),F216/D216),\"\")","v":""},""]
[null,null,null,null,null,null,null,{"$f":"SUMIFS(Sheet1!$H$4:$H$1497,Sheet1!$F$4:$F$1497,B218,Sheet1!$Z$4:$Z$1497,$H$3)","v":0},{"$f":"SUMIFS(Sheet1!$J$4:$J$15,Sheet1!$F$4:$F$15,B218,Sheet1!$Z$4:$Z$15,$H$3)","v":0},{"$f":"SUMIFS(Sheet1!$H$4:$H$1497,Sheet1!$F$4:$F$1497,B218,Sheet1!$Z$4:$Z$1497,$J$3)","v":0},null,null,"",{"$f":"IFERROR(IF(B217<\"\",SUMIFS(Sheet1!$L$4:$L$997,Sheet1!$F$4:$F$997,B217,Sheet1!$Z$4:$Z$997,$H$3)+F217/SUMIFS(Sheet1!$H$4:$H$997,Sheet1!$F$4:$F$997,B217,Sheet1!$Z$4:$Z$997,$H$3),F217/D217),\"\")","v":""},""]
[null,null,null,null,null,null,null,{"$f":"SUMIFS(Sheet1!$H$4:$H$1497,Sheet1!$F$4:$F$1497,B219,Sheet1!$Z$4:$Z$1497,$H$3)","v":0},{"$f":"SUMIFS(Sheet1!$J$4:$J$15,Sheet1!$F$4:$F$15,B219,Sheet1!$Z$4:$Z$15,$H$3)","v":0},{"$f":"SUMIFS(Sheet1!$H$4:$H$1497,Sheet1!$F$4:$F$1497,B219,Sheet1!$Z$4:$Z$1497,$J$3)","v":0},null,null,"",{"$f":"IFERROR(IF(B218<\"\",SUMIFS(Sheet1!$L$4:$L$997,Sheet1!$F$4:$F$997,B218,Sheet1!$Z$4:$Z$997,$H$3)+F218/SUMIFS(Sheet1!$H$4:$H$997,Sheet1!$F$4:$F$997,B218,Sheet1!$Z$4:$Z$997,$H$3),F218/D218),\"\")","v":""},""]
[null,null,null,null,null,null,null,{"$f":"SUMIFS(Sheet1!$H$4:$H$1497,Sheet1!$F$4:$F$1497,B220,Sheet1!$Z$4:$Z$1497,$H$3)","v":0},{"$f":"SUMIFS(Sheet1!$J$4:$J$15,Sheet1!$F$4:$F$15,B220,Sheet1!$Z$4:$Z$15,$H$3)","v":0},{"$f":"SUMIFS(Sheet1!$H$4:$H$1497,Sheet1!$F$4:$F$1497,B220,Sheet1!$Z$4:$Z$1497,$J$3)","v":0},null,null,"",{"$f":"IFERROR(IF(B219<\"\",SUMIFS(Sheet1!$L$4:$L$997,Sheet1!$F$4:$F$997,B219,Sheet1!$Z$4:$Z$997,$H$3)+F219/SUMIFS(Sheet1!$H$4:$H$997,Sheet1!$F$4:$F$997,B219,Sheet1!$Z$4:$Z$997,$H$3),F219/D219),\"\")","v":""},""]
[null,null,null,null,null,null,null,{"$f":"SUMIFS(Sheet1!$H$4:$H$1497,Sheet1!$F$4:$F$1497,B221,Sheet1!$Z$4:$Z$1497,$H$3)","v":0},{"$f":"SUMIFS(Sheet1!$J$4:$J$15,Sheet1!$F$4:$F$15,B221,Sheet1!$Z$4:$Z$15,$H$3)","v":0},{"$f":"SUMIFS(Sheet1!$H$4:$H$1497,Sheet1!$F$4:$F$1497,B221,Sheet1!$Z$4:$Z$1497,$J$3)","v":0},null,null,"",{"$f":"IFERROR(IF(B220<\"\",SUMIFS(Sheet1!$L$4:$L$997,Sheet1!$F$4:$F$997,B220,Sheet1!$Z$4:$Z$997,$H$3)+F220/SUMIFS(Sheet1!$H$4:$H$997,Sheet1!$F$4:$F$997,B220,Sheet1!$Z$4:$Z$997,$H$3),F220/D220),\"\")","v":""},""]
[null,null,null,null,null,null,null,{"$f":"SUMIFS(Sheet1!$H$4:$H$1497,Sheet1!$F$4:$F$1497,B222,Sheet1!$Z$4:$Z$1497,$H$3)","v":0},{"$f":"SUMIFS(Sheet1!$J$4:$J$15,Sheet1!$F$4:$F$15,B222,Sheet1!$Z$4:$Z$15,$H$3)","v":0},{"$f":"SUMIFS(Sheet1!$H$4:$H$1497,Sheet1!$F$4:$F$1497,B222,Sheet1!$Z$4:$Z$1497,$J$3)","v":0},null,null,"",{"$f":"IFERROR(IF(B221<\"\",SUMIFS(Sheet1!$L$4:$L$997,Sheet1!$F$4:$F$997,B221,Sheet1!$Z$4:$Z$997,$H$3)+F221/SUMIFS(Sheet1!$H$4:$H$997,Sheet1!$F$4:$F$997,B221,Sheet1!$Z$4:$Z$997,$H$3),F221/D221),\"\")","v":""},""]
[null,null,null,null,null,null,null,{"$f":"SUMIFS(Sheet1!$H$4:$H$1497,Sheet1!$F$4:$F$1497,B223,Sheet1!$Z$4:$Z$1497,$H$3)","v":0},{"$f":"SUMIFS(Sheet1!$J$4:$J$15,Sheet1!$F$4:$F$15,B223,Sheet1!$Z$4:$Z$15,$H$3)","v":0},{"$f":"SUMIFS(Sheet1!$H$4:$H$1497,Sheet1!$F$4:$F$1497,B223,Sheet1!$Z$4:$Z$1497,$J$3)","v":0},null,null,"",{"$f":"IFERROR(IF(B222<\"\",SUMIFS(Sheet1!$L$4:$L$997,Sheet1!$F$4:$F$997,B222,Sheet1!$Z$4:$Z$997,$H$3)+F222/SUMIFS(Sheet1!$H$4:$H$997,Sheet1!$F$4:$F$997,B222,Sheet1!$Z$4:$Z$997,$H$3),F222/D222),\"\")","v":""},""]
[null,null,null,null,null,null,null,{"$f":"SUMIFS(Sheet1!$H$4:$H$1497,Sheet1!$F$4:$F$1497,B224,Sheet1!$Z$4:$Z$1497,$H$3)","v":0},{"$f":"SUMIFS(Sheet1!$J$4:$J$15,Sheet1!$F$4:$F$15,B224,Sheet1!$Z$4:$Z$15,$H$3)","v":0},{"$f":"SUMIFS(Sheet1!$H$4:$H$1497,Sheet1!$F$4:$F$1497,B224,Sheet1!$Z$4:$Z$1497,$J$3)","v":0},null,null,"",{"$f":"IFERROR(IF(B223<\"\",SUMIFS(Sheet1!$L$4:$L$997,Sheet1!$F$4:$F$997,B223,Sheet1!$Z$4:$Z$997,$H$3)+F223/SUMIFS(Sheet1!$H$4:$H$997,Sheet1!$F$4:$F$997,B223,Sheet1!$Z$4:$Z$997,$H$3),F223/D223),\"\")","v":""},""]
[null,null,null,null,null,null,null,{"$f":"SUMIFS(Sheet1!$H$4:$H$1497,Sheet1!$F$4:$F$1497,B225,Sheet1!$Z$4:$Z$1497,$H$3)","v":0},{"$f":"SUMIFS(Sheet1!$J$4:$J$15,Sheet1!$F$4:$F$15,B225,Sheet1!$Z$4:$Z$15,$H$3)","v":0},{"$f":"SUMIFS(Sheet1!$H$4:$H$1497,Sheet1!$F$4:$F$1497,B225,Sheet1!$Z$4:$Z$1497,$J$3)","v":0},null,null,"",{"$f":"IFERROR(IF(B224<\"\",SUMIFS(Sheet1!$L$4:$L$997,Sheet1!$F$4:$F$997,B224,Sheet1!$Z$4:$Z$997,$H$3)+F224/SUMIFS(Sheet1!$H$4:$H$997,Sheet1!$F$4:$F$997,B224,Sheet1!$Z$4:$Z$997,$H$3),F224/D224),\"\")","v":""},""]
[null,null,null,null,null,null,null,{"$f":"SUMIFS(Sheet1!$H$4:$H$1497,Sheet1!$F$4:$F$1497,B226,Sheet1!$Z$4:$Z$1497,$H$3)","v":0},{"$f":"SUMIFS(Sheet1!$J$4:$J$15,Sheet1!$F$4:$F$15,B226,Sheet1!$Z$4:$Z$15,$H$3)","v":0},{"$f":"SUMIFS(Sheet1!$H$4:$H$1497,Sheet1!$F$4:$F$1497,B226,Sheet1!$Z$4:$Z$1497,$J$3)","v":0},null,null,"",{"$f":"IFERROR(IF(B225<\"\",SUMIFS(Sheet1!$L$4:$L$997,Sheet1!$F$4:$F$997,B225,Sheet1!$Z$4:$Z$997,$H$3)+F225/SUMIFS(Sheet1!$H$4:$H$997,Sheet1!$F$4:$F$997,B225,Sheet1!$Z$4:$Z$997,$H$3),F225/D225),\"\")","v":""},""]
[null,null,null,null,null,null,null,{"$f":"SUMIFS(Sheet1!$H$4:$H$1497,Sheet1!$F$4:$F$1497,B227,Sheet1!$Z$4:$Z$1497,$H$3)","v":0},{"$f":"SUMIFS(Sheet1!$J$4:$J$15,Sheet1!$F$4:$F$15,B227,Sheet1!$Z$4:$Z$15,$H$3)","v":0},{"$f":"SUMIFS(Sheet1!$H$4:$H$1497,Sheet1!$F$4:$F$1497,B227,Sheet1!$Z$4:$Z$1497,$J$3)","v":0},null,null,"",{"$f":"IFERROR(IF(B226<\"\",SUMIFS(Sheet1!$L$4:$L$997,Sheet1!$F$4:$F$997,B226,Sheet1!$Z$4:$Z$997,$H$3)+F226/SUMIFS(Sheet1!$H$4:$H$997,Sheet1!$F$4:$F$997,B226,Sheet1!$Z$4:$Z$997,$H$3),F226/D226),\"\")","v":""},""]
[null,null,null,null,null,null,null,{"$f":"SUMIFS(Sheet1!$H$4:$H$1497,Sheet1!$F$4:$F$1497,B228,Sheet1!$Z$4:$Z$1497,$H$3)","v":0},{"$f":"SUMIFS(Sheet1!$J$4:$J$15,Sheet1!$F$4:$F$15,B228,Sheet1!$Z$4:$Z$15,$H$3)","v":0},{"$f":"SUMIFS(Sheet1!$H$4:$H$1497,Sheet1!$F$4:$F$1497,B228,Sheet1!$Z$4:$Z$1497,$J$3)","v":0},null,null,"",{"$f":"IFERROR(IF(B227<\"\",SUMIFS(Sheet1!$L$4:$L$997,Sheet1!$F$4:$F$997,B227,Sheet1!$Z$4:$Z$997,$H$3)+F227/SUMIFS(Sheet1!$H$4:$H$997,Sheet1!$F$4:$F$997,B227,Sheet1!$Z$4:$Z$997,$H$3),F227/D227),\"\")","v":""},""]
[null,null,null,null,null,null,null,{"$f":"SUMIFS(Sheet1!$H$4:$H$1497,Sheet1!$F$4:$F$1497,B229,Sheet1!$Z$4:$Z$1497,$H$3)","v":0},{"$f":"SUMIFS(Sheet1!$J$4:$J$15,Sheet1!$F$4:$F$15,B229,Sheet1!$Z$4:$Z$15,$H$3)","v":0},{"$f":"SUMIFS(Sheet1!$H$4:$H$1497,Sheet1!$F$4:$F$1497,B229,Sheet1!$Z$4:$Z$1497,$J$3)","v":0},null,null,"",{"$f":"IFERROR(IF(B228<\"\",SUMIFS(Sheet1!$L$4:$L$997,Sheet1!$F$4:$F$997,B228,Sheet1!$Z$4:$Z$997,$H$3)+F228/SUMIFS(Sheet1!$H$4:$H$997,Sheet1!$F$4:$F$997,B228,Sheet1!$Z$4:$Z$997,$H$3),F228/D228),\"\")","v":""},""]
[null,null,null,null,null,null,null,{"$f":"SUMIFS(Sheet1!$H$4:$H$1497,Sheet1!$F$4:$F$1497,B230,Sheet1!$Z$4:$Z$1497,$H$3)","v":0},{"$f":"SUMIFS(Sheet1!$J$4:$J$15,Sheet1!$F$4:$F$15,B230,Sheet1!$Z$4:$Z$15,$H$3)","v":0},{"$f":"SUMIFS(Sheet1!$H$4:$H$1497,Sheet1!$F$4:$F$1497,B230,Sheet1!$Z$4:$Z$1497,$J$3)","v":0},null,null,"",{"$f":"IFERROR(IF(B229<\"\",SUMIFS(Sheet1!$L$4:$L$997,Sheet1!$F$4:$F$997,B229,Sheet1!$Z$4:$Z$997,$H$3)+F229/SUMIFS(Sheet1!$H$4:$H$997,Sheet1!$F$4:$F$997,B229,Sheet1!$Z$4:$Z$997,$H$3),F229/D229),\"\")","v":""},""]
[null,null,null,null,null,null,null,{"$f":"SUMIFS(Sheet1!$H$4:$H$1497,Sheet1!$F$4:$F$1497,B231,Sheet1!$Z$4:$Z$1497,$H$3)","v":0},{"$f":"SUMIFS(Sheet1!$J$4:$J$15,Sheet1!$F$4:$F$15,B231,Sheet1!$Z$4:$Z$15,$H$3)","v":0},{"$f":"SUMIFS(Sheet1!$H$4:$H$1497,Sheet1!$F$4:$F$1497,B231,Sheet1!$Z$4:$Z$1497,$J$3)","v":0},null,null,"",{"$f":"IFERROR(IF(B230<\"\",SUMIFS(Sheet1!$L$4:$L$997,Sheet1!$F$4:$F$997,B230,Sheet1!$Z$4:$Z$997,$H$3)+F230/SUMIFS(Sheet1!$H$4:$H$997,Sheet1!$F$4:$F$997,B230,Sheet1!$Z$4:$Z$997,$H$3),F230/D230),\"\")","v":""},""]
[null,null,null,null,null,null,null,{"$f":"SUMIFS(Sheet1!$H$4:$H$1497,Sheet1!$F$4:$F$1497,B232,Sheet1!$Z$4:$Z$1497,$H$3)","v":0},{"$f":"SUMIFS(Sheet1!$J$4:$J$15,Sheet1!$F$4:$F$15,B232,Sheet1!$Z$4:$Z$15,$H$3)","v":0},{"$f":"SUMIFS(Sheet1!$H$4:$H$1497,Sheet1!$F$4:$F$1497,B232,Sheet1!$Z$4:$Z$1497,$J$3)","v":0},null,null,"",{"$f":"IFERROR(IF(B231<\"\",SUMIFS(Sheet1!$L$4:$L$997,Sheet1!$F$4:$F$997,B231,Sheet1!$Z$4:$Z$997,$H$3)+F231/SUMIFS(Sheet1!$H$4:$H$997,Sheet1!$F$4:$F$997,B231,Sheet1!$Z$4:$Z$997,$H$3),F231/D231),\"\")","v":""},""]
[null,null,null,null,null,null,null,{"$f":"SUMIFS(Sheet1!$H$4:$H$1497,Sheet1!$F$4:$F$1497,B233,Sheet1!$Z$4:$Z$1497,$H$3)","v":0},{"$f":"SUMIFS(Sheet1!$J$4:$J$15,Sheet1!$F$4:$F$15,B233,Sheet1!$Z$4:$Z$15,$H$3)","v":0},{"$f":"SUMIFS(Sheet1!$H$4:$H$1497,Sheet1!$F$4:$F$1497,B233,Sheet1!$Z$4:$Z$1497,$J$3)","v":0},null,null,"",{"$f":"IFERROR(IF(B232<\"\",SUMIFS(Sheet1!$L$4:$L$997,Sheet1!$F$4:$F$997,B232,Sheet1!$Z$4:$Z$997,$H$3)+F232/SUMIFS(Sheet1!$H$4:$H$997,Sheet1!$F$4:$F$997,B232,Sheet1!$Z$4:$Z$997,$H$3),F232/D232),\"\")","v":""},""]
[null,null,null,null,null,null,null,{"$f":"SUMIFS(Sheet1!$H$4:$H$1497,Sheet1!$F$4:$F$1497,B234,Sheet1!$Z$4:$Z$1497,$H$3)","v":0},{"$f":"SUMIFS(Sheet1!$J$4:$J$15,Sheet1!$F$4:$F$15,B234,Sheet1!$Z$4:$Z$15,$H$3)","v":0},{"$f":"SUMIFS(Sheet1!$H$4:$H$1497,Sheet1!$F$4:$F$1497,B234,Sheet1!$Z$4:$Z$1497,$J$3)","v":0},null,null,"",{"$f":"IFERROR(IF(B233<\"\",SUMIFS(Sheet1!$L$4:$L$997,Sheet1!$F$4:$F$997,B233,Sheet1!$Z$4:$Z$997,$H$3)+F233/SUMIFS(Sheet1!$H$4:$H$997,Sheet1!$F$4:$F$997,B233,Sheet1!$Z$4:$Z$997,$H$3),F233/D233),\"\")","v":""},""]
[null,null,null,null,null,null,null,{"$f":"SUMIFS(Sheet1!$H$4:$H$1497,Sheet1!$F$4:$F$1497,B235,Sheet1!$Z$4:$Z$1497,$H$3)","v":0},{"$f":"SUMIFS(Sheet1!$J$4:$J$15,Sheet1!$F$4:$F$15,B235,Sheet1!$Z$4:$Z$15,$H$3)","v":0},{"$f":"SUMIFS(Sheet1!$H$4:$H$1497,Sheet1!$F$4:$F$1497,B235,Sheet1!$Z$4:$Z$1497,$J$3)","v":0},null,null,"",{"$f":"IFERROR(IF(B234<\"\",SUMIFS(Sheet1!$L$4:$L$997,Sheet1!$F$4:$F$997,B234,Sheet1!$Z$4:$Z$997,$H$3)+F234/SUMIFS(Sheet1!$H$4:$H$997,Sheet1!$F$4:$F$997,B234,Sheet1!$Z$4:$Z$997,$H$3),F234/D234),\"\")","v":""},""]
[null,null,null,null,null,null,null,{"$f":"SUMIFS(Sheet1!$H$4:$H$1497,Sheet1!$F$4:$F$1497,B236,Sheet1!$Z$4:$Z$1497,$H$3)","v":0},{"$f":"SUMIFS(Sheet1!$J$4:$J$15,Sheet1!$F$4:$F$15,B236,Sheet1!$Z$4:$Z$15,$H$3)","v":0},{"$f":"SUMIFS(Sheet1!$H$4:$H$1497,Sheet1!$F$4:$F$1497,B236,Sheet1!$Z$4:$Z$1497,$J$3)","v":0},null,null,"",{"$f":"IFERROR(IF(B235<\"\",SUMIFS(Sheet1!$L$4:$L$997,Sheet1!$F$4:$F$997,B235,Sheet1!$Z$4:$Z$997,$H$3)+F235/SUMIFS(Sheet1!$H$4:$H$997,Sheet1!$F$4:$F$997,B235,Sheet1!$Z$4:$Z$997,$H$3),F235/D235),\"\")","v":""},""]
[null,null,null,null,null,null,null,{"$f":"SUMIFS(Sheet1!$H$4:$H$1497,Sheet1!$F$4:$F$1497,B237,Sheet1!$Z$4:$Z$1497,$H$3)","v":0},{"$f":"SUMIFS(Sheet1!$J$4:$J$15,Sheet1!$F$4:$F$15,B237,Sheet1!$Z$4:$Z$15,$H$3)","v":0},{"$f":"SUMIFS(Sheet1!$H$4:$H$1497,Sheet1!$F$4:$F$1497,B237,Sheet1!$Z$4:$Z$1497,$J$3)","v":0},null,null,"",{"$f":"IFERROR(IF(B236<\"\",SUMIFS(Sheet1!$L$4:$L$997,Sheet1!$F$4:$F$997,B236,Sheet1!$Z$4:$Z$997,$H$3)+F236/SUMIFS(Sheet1!$H$4:$H$997,Sheet1!$F$4:$F$997,B236,Sheet1!$Z$4:$Z$997,$H$3),F236/D236),\"\")","v":""},""]
[null,null,null,null,null,null,null,{"$f":"SUMIFS(Sheet1!$H$4:$H$1497,Sheet1!$F$4:$F$1497,B238,Sheet1!$Z$4:$Z$1497,$H$3)","v":0},{"$f":"SUMIFS(Sheet1!$J$4:$J$15,Sheet1!$F$4:$F$15,B238,Sheet1!$Z$4:$Z$15,$H$3)","v":0},{"$f":"SUMIFS(Sheet1!$H$4:$H$1497,Sheet1!$F$4:$F$1497,B238,Sheet1!$Z$4:$Z$1497,$J$3)","v":0},null,null,"",{"$f":"IFERROR(IF(B237<\"\",SUMIFS(Sheet1!$L$4:$L$997,Sheet1!$F$4:$F$997,B237,Sheet1!$Z$4:$Z$997,$H$3)+F237/SUMIFS(Sheet1!$H$4:$H$997,Sheet1!$F$4:$F$997,B237,Sheet1!$Z$4:$Z$997,$H$3),F237/D237),\"\")","v":""},""]
[null,null,null,null,null,null,null,{"$f":"SUMIFS(Sheet1!$H$4:$H$1497,Sheet1!$F$4:$F$1497,B239,Sheet1!$Z$4:$Z$1497,$H$3)","v":0},{"$f":"SUMIFS(Sheet1!$J$4:$J$15,Sheet1!$F$4:$F$15,B239,Sheet1!$Z$4:$Z$15,$H$3)","v":0},{"$f":"SUMIFS(Sheet1!$H$4:$H$1497,Sheet1!$F$4:$F$1497,B239,Sheet1!$Z$4:$Z$1497,$J$3)","v":0},null,null,"",{"$f":"IFERROR(IF(B238<\"\",SUMIFS(Sheet1!$L$4:$L$997,Sheet1!$F$4:$F$997,B238,Sheet1!$Z$4:$Z$997,$H$3)+F238/SUMIFS(Sheet1!$H$4:$H$997,Sheet1!$F$4:$F$997,B238,Sheet1!$Z$4:$Z$997,$H$3),F238/D238),\"\")","v":""},""]
[null,null,null,null,null,null,null,{"$f":"SUMIFS(Sheet1!$H$4:$H$1497,Sheet1!$F$4:$F$1497,B240,Sheet1!$Z$4:$Z$1497,$H$3)","v":0},{"$f":"SUMIFS(Sheet1!$J$4:$J$15,Sheet1!$F$4:$F$15,B240,Sheet1!$Z$4:$Z$15,$H$3)","v":0},{"$f":"SUMIFS(Sheet1!$H$4:$H$1497,Sheet1!$F$4:$F$1497,B240,Sheet1!$Z$4:$Z$1497,$J$3)","v":0},null,null,"",{"$f":"IFERROR(IF(B239<\"\",SUMIFS(Sheet1!$L$4:$L$997,Sheet1!$F$4:$F$997,B239,Sheet1!$Z$4:$Z$997,$H$3)+F239/SUMIFS(Sheet1!$H$4:$H$997,Sheet1!$F$4:$F$997,B239,Sheet1!$Z$4:$Z$997,$H$3),F239/D239),\"\")","v":""},""]
[null,null,null,null,null,null,null,{"$f":"SUMIFS(Sheet1!$H$4:$H$1497,Sheet1!$F$4:$F$1497,B241,Sheet1!$Z$4:$Z$1497,$H$3)","v":0},{"$f":"SUMIFS(Sheet1!$J$4:$J$15,Sheet1!$F$4:$F$15,B241,Sheet1!$Z$4:$Z$15,$H$3)","v":0},{"$f":"SUMIFS(Sheet1!$H$4:$H$1497,Sheet1!$F$4:$F$1497,B241,Sheet1!$Z$4:$Z$1497,$J$3)","v":0},null,null,"",{"$f":"IFERROR(IF(B240<\"\",SUMIFS(Sheet1!$L$4:$L$997,Sheet1!$F$4:$F$997,B240,Sheet1!$Z$4:$Z$997,$H$3)+F240/SUMIFS(Sheet1!$H$4:$H$997,Sheet1!$F$4:$F$997,B240,Sheet1!$Z$4:$Z$997,$H$3),F240/D240),\"\")","v":""},""]
[null,null,null,null,null,null,null,{"$f":"SUMIFS(Sheet1!$H$4:$H$1497,Sheet1!$F$4:$F$1497,B242,Sheet1!$Z$4:$Z$1497,$H$3)","v":0},{"$f":"SUMIFS(Sheet1!$J$4:$J$15,Sheet1!$F$4:$F$15,B242,Sheet1!$Z$4:$Z$15,$H$3)","v":0},{"$f":"SUMIFS(Sheet1!$H$4:$H$1497,Sheet1!$F$4:$F$1497,B242,Sheet1!$Z$4:$Z$1497,$J$3)","v":0},null,null,"",{"$f":"IFERROR(IF(B241<\"\",SUMIFS(Sheet1!$L$4:$L$997,Sheet1!$F$4:$F$997,B241,Sheet1!$Z$4:$Z$997,$H$3)+F241/SUMIFS(Sheet1!$H$4:$H$997,Sheet1!$F$4:$F$997,B241,Sheet1!$Z$4:$Z$997,$H$3),F241/D241),\"\")","v":""},""]
[null,null,null,null,null,null,null,{"$f":"SUMIFS(Sheet1!$H$4:$H$1497,Sheet1!$F$4:$F$1497,B243,Sheet1!$Z$4:$Z$1497,$H$3)","v":0},{"$f":"SUMIFS(Sheet1!$J$4:$J$15,Sheet1!$F$4:$F$15,B243,Sheet1!$Z$4:$Z$15,$H$3)","v":0},{"$f":"SUMIFS(Sheet1!$H$4:$H$1497,Sheet1!$F$4:$F$1497,B243,Sheet1!$Z$4:$Z$1497,$J$3)","v":0},null,null,"",{"$f":"IFERROR(IF(B242<\"\",SUMIFS(Sheet1!$L$4:$L$997,Sheet1!$F$4:$F$997,B242,Sheet1!$Z$4:$Z$997,$H$3)+F242/SUMIFS(Sheet1!$H$4:$H$997,Sheet1!$F$4:$F$997,B242,Sheet1!$Z$4:$Z$997,$H$3),F242/D242),\"\")","v":""},""]
[null,null,null,null,null,null,null,{"$f":"SUMIFS(Sheet1!$H$4:$H$1497,Sheet1!$F$4:$F$1497,B244,Sheet1!$Z$4:$Z$1497,$H$3)","v":0},{"$f":"SUMIFS(Sheet1!$J$4:$J$15,Sheet1!$F$4:$F$15,B244,Sheet1!$Z$4:$Z$15,$H$3)","v":0},{"$f":"SUMIFS(Sheet1!$H$4:$H$1497,Sheet1!$F$4:$F$1497,B244,Sheet1!$Z$4:$Z$1497,$J$3)","v":0},null,null,"",{"$f":"IFERROR(IF(B243<\"\",SUMIFS(Sheet1!$L$4:$L$997,Sheet1!$F$4:$F$997,B243,Sheet1!$Z$4:$Z$997,$H$3)+F243/SUMIFS(Sheet1!$H$4:$H$997,Sheet1!$F$4:$F$997,B243,Sheet1!$Z$4:$Z$997,$H$3),F243/D243),\"\")","v":""},""]
[null,null,null,null,null,null,null,{"$f":"SUMIFS(Sheet1!$H$4:$H$1497,Sheet1!$F$4:$F$1497,B245,Sheet1!$Z$4:$Z$1497,$H$3)","v":0},{"$f":"SUMIFS(Sheet1!$J$4:$J$15,Sheet1!$F$4:$F$15,B245,Sheet1!$Z$4:$Z$15,$H$3)","v":0},{"$f":"SUMIFS(Sheet1!$H$4:$H$1497,Sheet1!$F$4:$F$1497,B245,Sheet1!$Z$4:$Z$1497,$J$3)","v":0},null,null,"",{"$f":"IFERROR(IF(B244<\"\",SUMIFS(Sheet1!$L$4:$L$997,Sheet1!$F$4:$F$997,B244,Sheet1!$Z$4:$Z$997,$H$3)+F244/SUMIFS(Sheet1!$H$4:$H$997,Sheet1!$F$4:$F$997,B244,Sheet1!$Z$4:$Z$997,$H$3),F244/D244),\"\")","v":""},""]
[null,null,null,null,null,null,null,{"$f":"SUMIFS(Sheet1!$H$4:$H$1497,Sheet1!$F$4:$F$1497,B246,Sheet1!$Z$4:$Z$1497,$H$3)","v":0},{"$f":"SUMIFS(Sheet1!$J$4:$J$15,Sheet1!$F$4:$F$15,B246,Sheet1!$Z$4:$Z$15,$H$3)","v":0},{"$f":"SUMIFS(Sheet1!$H$4:$H$1497,Sheet1!$F$4:$F$1497,B246,Sheet1!$Z$4:$Z$1497,$J$3)","v":0},null,null,"",{"$f":"IFERROR(IF(B245<\"\",SUMIFS(Sheet1!$L$4:$L$997,Sheet1!$F$4:$F$997,B245,Sheet1!$Z$4:$Z$997,$H$3)+F245/SUMIFS(Sheet1!$H$4:$H$997,Sheet1!$F$4:$F$997,B245,Sheet1!$Z$4:$Z$997,$H$3),F245/D245),\"\")","v":""},""]
[null,null,null,null,null,null,null,{"$f":"SUMIFS(Sheet1!$H$4:$H$1497,Sheet1!$F$4:$F$1497,B247,Sheet1!$Z$4:$Z$1497,$H$3)","v":0},{"$f":"SUMIFS(Sheet1!$J$4:$J$15,Sheet1!$F$4:$F$15,B247,Sheet1!$Z$4:$Z$15,$H$3)","v":0},{"$f":"SUMIFS(Sheet1!$H$4:$H$1497,Sheet1!$F$4:$F$1497,B247,Sheet1!$Z$4:$Z$1497,$J$3)","v":0},null,null,"",{"$f":"IFERROR(IF(B246<\"\",SUMIFS(Sheet1!$L$4:$L$997,Sheet1!$F$4:$F$997,B246,Sheet1!$Z$4:$Z$997,$H$3)+F246/SUMIFS(Sheet1!$H$4:$H$997,Sheet1!$F$4:$F$997,B246,Sheet1!$Z$4:$Z$997,$H$3),F246/D246),\"\")","v":""},""]
[null,null,null,null,null,null,null,{"$f":"SUMIFS(Sheet1!$H$4:$H$1497,Sheet1!$F$4:$F$1497,B248,Sheet1!$Z$4:$Z$1497,$H$3)","v":0},{"$f":"SUMIFS(Sheet1!$J$4:$J$15,Sheet1!$F$4:$F$15,B248,Sheet1!$Z$4:$Z$15,$H$3)","v":0},{"$f":"SUMIFS(Sheet1!$H$4:$H$1497,Sheet1!$F$4:$F$1497,B248,Sheet1!$Z$4:$Z$1497,$J$3)","v":0},null,null,"",{"$f":"IFERROR(IF(B247<\"\",SUMIFS(Sheet1!$L$4:$L$997,Sheet1!$F$4:$F$997,B247,Sheet1!$Z$4:$Z$997,$H$3)+F247/SUMIFS(Sheet1!$H$4:$H$997,Sheet1!$F$4:$F$997,B247,Sheet1!$Z$4:$Z$997,$H$3),F247/D247),\"\")","v":""},""]
[null,null,null,null,null,null,null,{"$f":"SUMIFS(Sheet1!$H$4:$H$1497,Sheet1!$F$4:$F$1497,B249,Sheet1!$Z$4:$Z$1497,$H$3)","v":0},{"$f":"SUMIFS(Sheet1!$J$4:$J$15,Sheet1!$F$4:$F$15,B249,Sheet1!$Z$4:$Z$15,$H$3)","v":0},{"$f":"SUMIFS(Sheet1!$H$4:$H$1497,Sheet1!$F$4:$F$1497,B249,Sheet1!$Z$4:$Z$1497,$J$3)","v":0},null,null,"",{"$f":"IFERROR(IF(B248<\"\",SUMIFS(Sheet1!$L$4:$L$997,Sheet1!$F$4:$F$997,B248,Sheet1!$Z$4:$Z$997,$H$3)+F248/SUMIFS(Sheet1!$H$4:$H$997,Sheet1!$F$4:$F$997,B248,Sheet1!$Z$4:$Z$997,$H$3),F248/D248),\"\")","v":""},""]
[null,null,null,null,null,null,null,{"$f":"SUMIFS(Sheet1!$H$4:$H$1497,Sheet1!$F$4:$F$1497,B250,Sheet1!$Z$4:$Z$1497,$H$3)","v":0},{"$f":"SUMIFS(Sheet1!$J$4:$J$15,Sheet1!$F$4:$F$15,B250,Sheet1!$Z$4:$Z$15,$H$3)","v":0},{"$f":"SUMIFS(Sheet1!$H$4:$H$1497,Sheet1!$F$4:$F$1497,B250,Sheet1!$Z$4:$Z$1497,$J$3)","v":0},null,null,"",{"$f":"IFERROR(IF(B249<\"\",SUMIFS(Sheet1!$L$4:$L$997,Sheet1!$F$4:$F$997,B249,Sheet1!$Z$4:$Z$997,$H$3)+F249/SUMIFS(Sheet1!$H$4:$H$997,Sheet1!$F$4:$F$997,B249,Sheet1!$Z$4:$Z$997,$H$3),F249/D249),\"\")","v":""},""]
[null,null,null,null,null,null,null,{"$f":"SUMIFS(Sheet1!$H$4:$H$1497,Sheet1!$F$4:$F$1497,B251,Sheet1!$Z$4:$Z$1497,$H$3)","v":0},{"$f":"SUMIFS(Sheet1!$J$4:$J$15,Sheet1!$F$4:$F$15,B251,Sheet1!$Z$4:$Z$15,$H$3)","v":0},{"$f":"SUMIFS(Sheet1!$H$4:$H$1497,Sheet1!$F$4:$F$1497,B251,Sheet1!$Z$4:$Z$1497,$J$3)","v":0},null,null,"",{"$f":"IFERROR(IF(B250<\"\",SUMIFS(Sheet1!$L$4:$L$997,Sheet1!$F$4:$F$997,B250,Sheet1!$Z$4:$Z$997,$H$3)+F250/SUMIFS(Sheet1!$H$4:$H$997,Sheet1!$F$4:$F$997,B250,Sheet1!$Z$4:$Z$997,$H$3),F250/D250),\"\")","v":""},""]
[null,null,null,null,null,null,null,{"$f":"SUMIFS(Sheet1!$H$4:$H$1497,Sheet1!$F$4:$F$1497,B252,Sheet1!$Z$4:$Z$1497,$H$3)","v":0},{"$f":"SUMIFS(Sheet1!$J$4:$J$15,Sheet1!$F$4:$F$15,B252,Sheet1!$Z$4:$Z$15,$H$3)","v":0},{"$f":"SUMIFS(Sheet1!$H$4:$H$1497,Sheet1!$F$4:$F$1497,B252,Sheet1!$Z$4:$Z$1497,$J$3)","v":0},null,null,"",{"$f":"IFERROR(IF(B251<\"\",SUMIFS(Sheet1!$L$4:$L$997,Sheet1!$F$4:$F$997,B251,Sheet1!$Z$4:$Z$997,$H$3)+F251/SUMIFS(Sheet1!$H$4:$H$997,Sheet1!$F$4:$F$997,B251,Sheet1!$Z$4:$Z$997,$H$3),F251/D251),\"\")","v":""},""]
[null,null,null,null,null,null,null,{"$f":"SUMIFS(Sheet1!$H$4:$H$1497,Sheet1!$F$4:$F$1497,B253,Sheet1!$Z$4:$Z$1497,$H$3)","v":0},{"$f":"SUMIFS(Sheet1!$J$4:$J$15,Sheet1!$F$4:$F$15,B253,Sheet1!$Z$4:$Z$15,$H$3)","v":0},{"$f":"SUMIFS(Sheet1!$H$4:$H$1497,Sheet1!$F$4:$F$1497,B253,Sheet1!$Z$4:$Z$1497,$J$3)","v":0},null,null,"",{"$f":"IFERROR(IF(B252<\"\",SUMIFS(Sheet1!$L$4:$L$997,Sheet1!$F$4:$F$997,B252,Sheet1!$Z$4:$Z$997,$H$3)+F252/SUMIFS(Sheet1!$H$4:$H$997,Sheet1!$F$4:$F$997,B252,Sheet1!$Z$4:$Z$997,$H$3),F252/D252),\"\")","v":""},""]
[null,null,null,null,null,null,null,{"$f":"SUMIFS(Sheet1!$H$4:$H$1497,Sheet1!$F$4:$F$1497,B254,Sheet1!$Z$4:$Z$1497,$H$3)","v":0},{"$f":"SUMIFS(Sheet1!$J$4:$J$15,Sheet1!$F$4:$F$15,B254,Sheet1!$Z$4:$Z$15,$H$3)","v":0},{"$f":"SUMIFS(Sheet1!$H$4:$H$1497,Sheet1!$F$4:$F$1497,B254,Sheet1!$Z$4:$Z$1497,$J$3)","v":0},null,null,"",{"$f":"IFERROR(IF(B253<\"\",SUMIFS(Sheet1!$L$4:$L$997,Sheet1!$F$4:$F$997,B253,Sheet1!$Z$4:$Z$997,$H$3)+F253/SUMIFS(Sheet1!$H$4:$H$997,Sheet1!$F$4:$F$997,B253,Sheet1!$Z$4:$Z$997,$H$3),F253/D253),\"\")","v":""},""]
[null,null,null,null,null,null,null,{"$f":"SUMIFS(Sheet1!$H$4:$H$1497,Sheet1!$F$4:$F$1497,B255,Sheet1!$Z$4:$Z$1497,$H$3)","v":0},{"$f":"SUMIFS(Sheet1!$J$4:$J$15,Sheet1!$F$4:$F$15,B255,Sheet1!$Z$4:$Z$15,$H$3)","v":0},{"$f":"SUMIFS(Sheet1!$H$4:$H$1497,Sheet1!$F$4:$F$1497,B255,Sheet1!$Z$4:$Z$1497,$J$3)","v":0},null,null,"",{"$f":"IFERROR(IF(B254<\"\",SUMIFS(Sheet1!$L$4:$L$997,Sheet1!$F$4:$F$997,B254,Sheet1!$Z$4:$Z$997,$H$3)+F254/SUMIFS(Sheet1!$H$4:$H$997,Sheet1!$F$4:$F$997,B254,Sheet1!$Z$4:$Z$997,$H$3),F254/D254),\"\")","v":""},""]
[null,null,null,null,null,null,null,{"$f":"SUMIFS(Sheet1!$H$4:$H$1497,Sheet1!$F$4:$F$1497,B256,Sheet1!$Z$4:$Z$1497,$H$3)","v":0},{"$f":"SUMIFS(Sheet1!$J$4:$J$15,Sheet1!$F$4:$F$15,B256,Sheet1!$Z$4:$Z$15,$H$3)","v":0},{"$f":"SUMIFS(Sheet1!$H$4:$H$1497,Sheet1!$F$4:$F$1497,B256,Sheet1!$Z$4:$Z$1497,$J$3)","v":0},null,null,"",{"$f":"IFERROR(IF(B255<\"\",SUMIFS(Sheet1!$L$4:$L$997,Sheet1!$F$4:$F$997,B255,Sheet1!$Z$4:$Z$997,$H$3)+F255/SUMIFS(Sheet1!$H$4:$H$997,Sheet1!$F$4:$F$997,B255,Sheet1!$Z$4:$Z$997,$H$3),F255/D255),\"\")","v":""},""]
[null,null,null,null,null,null,null,{"$f":"SUMIFS(Sheet1!$H$4:$H$1497,Sheet1!$F$4:$F$1497,B257,Sheet1!$Z$4:$Z$1497,$H$3)","v":0},{"$f":"SUMIFS(Sheet1!$J$4:$J$15,Sheet1!$F$4:$F$15,B257,Sheet1!$Z$4:$Z$15,$H$3)","v":0},{"$f":"SUMIFS(Sheet1!$H$4:$H$1497,Sheet1!$F$4:$F$1497,B257,Sheet1!$Z$4:$Z$1497,$J$3)","v":0},null,null,"",{"$f":"IFERROR(IF(B256<\"\",SUMIFS(Sheet1!$L$4:$L$997,Sheet1!$F$4:$F$997,B256,Sheet1!$Z$4:$Z$997,$H$3)+F256/SUMIFS(Sheet1!$H$4:$H$997,Sheet1!$F$4:$F$997,B256,Sheet1!$Z$4:$Z$997,$H$3),F256/D256),\"\")","v":""},""]
[null,null,null,null,null,null,null,{"$f":"SUMIFS(Sheet1!$H$4:$H$1497,Sheet1!$F$4:$F$1497,B258,Sheet1!$Z$4:$Z$1497,$H$3)","v":0},{"$f":"SUMIFS(Sheet1!$J$4:$J$15,Sheet1!$F$4:$F$15,B258,Sheet1!$Z$4:$Z$15,$H$3)","v":0},{"$f":"SUMIFS(Sheet1!$H$4:$H$1497,Sheet1!$F$4:$F$1497,B258,Sheet1!$Z$4:$Z$1497,$J$3)","v":0},null,null,"",{"$f":"IFERROR(IF(B257<\"\",SUMIFS(Sheet1!$L$4:$L$997,Sheet1!$F$4:$F$997,B257,Sheet1!$Z$4:$Z$997,$H$3)+F257/SUMIFS(Sheet1!$H$4:$H$997,Sheet1!$F$4:$F$997,B257,Sheet1!$Z$4:$Z$997,$H$3),F257/D257),\"\")","v":""},""]
[null,null,null,null,null,null,null,{"$f":"SUMIFS(Sheet1!$H$4:$H$1497,Sheet1!$F$4:$F$1497,B259,Sheet1!$Z$4:$Z$1497,$H$3)","v":0},{"$f":"SUMIFS(Sheet1!$J$4:$J$15,Sheet1!$F$4:$F$15,B259,Sheet1!$Z$4:$Z$15,$H$3)","v":0},{"$f":"SUMIFS(Sheet1!$H$4:$H$1497,Sheet1!$F$4:$F$1497,B259,Sheet1!$Z$4:$Z$1497,$J$3)","v":0},null,null,"",{"$f":"IFERROR(IF(B258<\"\",SUMIFS(Sheet1!$L$4:$L$997,Sheet1!$F$4:$F$997,B258,Sheet1!$Z$4:$Z$997,$H$3)+F258/SUMIFS(Sheet1!$H$4:$H$997,Sheet1!$F$4:$F$997,B258,Sheet1!$Z$4:$Z$997,$H$3),F258/D258),\"\")","v":""},""]
[null,null,null,null,null,null,null,{"$f":"SUMIFS(Sheet1!$H$4:$H$1497,Sheet1!$F$4:$F$1497,B260,Sheet1!$Z$4:$Z$1497,$H$3)","v":0},{"$f":"SUMIFS(Sheet1!$J$4:$J$15,Sheet1!$F$4:$F$15,B260,Sheet1!$Z$4:$Z$15,$H$3)","v":0},{"$f":"SUMIFS(Sheet1!$H$4:$H$1497,Sheet1!$F$4:$F$1497,B260,Sheet1!$Z$4:$Z$1497,$J$3)","v":0},null,null,"",{"$f":"IFERROR(IF(B259<\"\",SUMIFS(Sheet1!$L$4:$L$997,Sheet1!$F$4:$F$997,B259,Sheet1!$Z$4:$Z$997,$H$3)+F259/SUMIFS(Sheet1!$H$4:$H$997,Sheet1!$F$4:$F$997,B259,Sheet1!$Z$4:$Z$997,$H$3),F259/D259),\"\")","v":""},""]
[null,null,null,null,null,null,null,{"$f":"SUMIFS(Sheet1!$H$4:$H$1497,Sheet1!$F$4:$F$1497,B261,Sheet1!$Z$4:$Z$1497,$H$3)","v":0},{"$f":"SUMIFS(Sheet1!$J$4:$J$15,Sheet1!$F$4:$F$15,B261,Sheet1!$Z$4:$Z$15,$H$3)","v":0},{"$f":"SUMIFS(Sheet1!$H$4:$H$1497,Sheet1!$F$4:$F$1497,B261,Sheet1!$Z$4:$Z$1497,$J$3)","v":0},null,null,"",{"$f":"IFERROR(IF(B260<\"\",SUMIFS(Sheet1!$L$4:$L$997,Sheet1!$F$4:$F$997,B260,Sheet1!$Z$4:$Z$997,$H$3)+F260/SUMIFS(Sheet1!$H$4:$H$997,Sheet1!$F$4:$F$997,B260,Sheet1!$Z$4:$Z$997,$H$3),F260/D260),\"\")","v":""},""]
[null,null,null,null,null,null,null,{"$f":"SUMIFS(Sheet1!$H$4:$H$1497,Sheet1!$F$4:$F$1497,B262,Sheet1!$Z$4:$Z$1497,$H$3)","v":0},{"$f":"SUMIFS(Sheet1!$J$4:$J$15,Sheet1!$F$4:$F$15,B262,Sheet1!$Z$4:$Z$15,$H$3)","v":0},{"$f":"SUMIFS(Sheet1!$H$4:$H$1497,Sheet1!$F$4:$F$1497,B262,Sheet1!$Z$4:$Z$1497,$J$3)","v":0},null,null,{"$f":"IF(L261<>\"\",IF(L261>=K261,\"مطلوب\",\"\"),\"\")","v":""},{"$f":"IFERROR(IF(B261<\"\",SUMIFS(Sheet1!$L$4:$L$997,Sheet1!$F$4:$F$997,B261,Sheet1!$Z$4:$Z$997,$H$3)+F261/SUMIFS(Sheet1!$H$4:$H$997,Sheet1!$F$4:$F$997,B261,Sheet1!$Z$4:$Z$997,$H$3),F261/D261),\"\")","v":""},{"$f":"IFERROR(SUMPRODUCT(K261*N261),\"\")","v":""}]
[null,null,null,null,null,null,null,{"$f":"SUMIFS(Sheet1!$H$4:$H$1497,Sheet1!$F$4:$F$1497,B263,Sheet1!$Z$4:$Z$1497,$H$3)","v":0},{"$f":"SUMIFS(Sheet1!$J$4:$J$15,Sheet1!$F$4:$F$15,B263,Sheet1!$Z$4:$Z$15,$H$3)","v":0},{"$f":"SUMIFS(Sheet1!$H$4:$H$1497,Sheet1!$F$4:$F$1497,B263,Sheet1!$Z$4:$Z$1497,$J$3)","v":0},null,null,"",{"$f":"IFERROR(IF(B262<\"\",SUMIFS(Sheet1!$L$4:$L$997,Sheet1!$F$4:$F$997,B262,Sheet1!$Z$4:$Z$997,$H$3)+F262/SUMIFS(Sheet1!$H$4:$H$997,Sheet1!$F$4:$F$997,B262,Sheet1!$Z$4:$Z$997,$H$3),F262/D262),\"\")","v":""},""]
[null,null,null,null,null,null,null,{"$f":"SUMIFS(Sheet1!$H$4:$H$1497,Sheet1!$F$4:$F$1497,B264,Sheet1!$Z$4:$Z$1497,$H$3)","v":0},{"$f":"SUMIFS(Sheet1!$J$4:$J$15,Sheet1!$F$4:$F$15,B264,Sheet1!$Z$4:$Z$15,$H$3)","v":0},{"$f":"SUMIFS(Sheet1!$H$4:$H$1497,Sheet1!$F$4:$F$1497,B264,Sheet1!$Z$4:$Z$1497,$J$3)","v":0},null,null,"",{"$f":"IFERROR(IF(B263<\"\",SUMIFS(Sheet1!$L$4:$L$997,Sheet1!$F$4:$F$997,B263,Sheet1!$Z$4:$Z$997,$H$3)+F263/SUMIFS(Sheet1!$H$4:$H$997,Sheet1!$F$4:$F$997,B263,Sheet1!$Z$4:$Z$997,$H$3),F263/D263),\"\")","v":""},""]
[null,null,null,null,null,null,null,{"$f":"SUMIFS(Sheet1!$H$4:$H$1497,Sheet1!$F$4:$F$1497,B265,Sheet1!$Z$4:$Z$1497,$H$3)","v":0},{"$f":"SUMIFS(Sheet1!$J$4:$J$15,Sheet1!$F$4:$F$15,B265,Sheet1!$Z$4:$Z$15,$H$3)","v":0},{"$f":"SUMIFS(Sheet1!$H$4:$H$1497,Sheet1!$F$4:$F$1497,B265,Sheet1!$Z$4:$Z$1497,$J$3)","v":0},null,null,"",{"$f":"IFERROR(IF(B264<\"\",SUMIFS(Sheet1!$L$4:$L$997,Sheet1!$F$4:$F$997,B264,Sheet1!$Z$4:$Z$997,$H$3)+F264/SUMIFS(Sheet1!$H$4:$H$997,Sheet1!$F$4:$F$997,B264,Sheet1!$Z$4:$Z$997,$H$3),F264/D264),\"\")","v":""},""]
[null,null,null,null,null,null,null,{"$f":"SUMIFS(Sheet1!$H$4:$H$1497,Sheet1!$F$4:$F$1497,B266,Sheet1!$Z$4:$Z$1497,$H$3)","v":0},{"$f":"SUMIFS(Sheet1!$J$4:$J$15,Sheet1!$F$4:$F$15,B266,Sheet1!$Z$4:$Z$15,$H$3)","v":0},{"$f":"SUMIFS(Sheet1!$H$4:$H$1497,Sheet1!$F$4:$F$1497,B266,Sheet1!$Z$4:$Z$1497,$J$3)","v":0},null,null,"",{"$f":"IFERROR(IF(B265<\"\",SUMIFS(Sheet1!$L$4:$L$997,Sheet1!$F$4:$F$997,B265,Sheet1!$Z$4:$Z$997,$H$3)+F265/SUMIFS(Sheet1!$H$4:$H$997,Sheet1!$F$4:$F$997,B265,Sheet1!$Z$4:$Z$997,$H$3),F265/D265),\"\")","v":""},""]
[null,null,null,null,null,null,null,{"$f":"SUMIFS(Sheet1!$H$4:$H$1497,Sheet1!$F$4:$F$1497,B267,Sheet1!$Z$4:$Z$1497,$H$3)","v":0},{"$f":"SUMIFS(Sheet1!$J$4:$J$15,Sheet1!$F$4:$F$15,B267,Sheet1!$Z$4:$Z$15,$H$3)","v":0},{"$f":"SUMIFS(Sheet1!$H$4:$H$1497,Sheet1!$F$4:$F$1497,B267,Sheet1!$Z$4:$Z$1497,$J$3)","v":0},null,null,"",{"$f":"IFERROR(IF(B266<\"\",SUMIFS(Sheet1!$L$4:$L$997,Sheet1!$F$4:$F$997,B266,Sheet1!$Z$4:$Z$997,$H$3)+F266/SUMIFS(Sheet1!$H$4:$H$997,Sheet1!$F$4:$F$997,B266,Sheet1!$Z$4:$Z$997,$H$3),F266/D266),\"\")","v":""},""]
[null,null,null,null,null,null,null,{"$f":"SUMIFS(Sheet1!$H$4:$H$1497,Sheet1!$F$4:$F$1497,B268,Sheet1!$Z$4:$Z$1497,$H$3)","v":0},{"$f":"SUMIFS(Sheet1!$J$4:$J$15,Sheet1!$F$4:$F$15,B268,Sheet1!$Z$4:$Z$15,$H$3)","v":0},{"$f":"SUMIFS(Sheet1!$H$4:$H$1497,Sheet1!$F$4:$F$1497,B268,Sheet1!$Z$4:$Z$1497,$J$3)","v":0},null,null,"",{"$f":"IFERROR(IF(B267<\"\",SUMIFS(Sheet1!$L$4:$L$997,Sheet1!$F$4:$F$997,B267,Sheet1!$Z$4:$Z$997,$H$3)+F267/SUMIFS(Sheet1!$H$4:$H$997,Sheet1!$F$4:$F$997,B267,Sheet1!$Z$4:$Z$997,$H$3),F267/D267),\"\")","v":""},""]
[null,null,null,null,null,null,null,{"$f":"SUMIFS(Sheet1!$H$4:$H$1497,Sheet1!$F$4:$F$1497,B269,Sheet1!$Z$4:$Z$1497,$H$3)","v":0},{"$f":"SUMIFS(Sheet1!$J$4:$J$15,Sheet1!$F$4:$F$15,B269,Sheet1!$Z$4:$Z$15,$H$3)","v":0},{"$f":"SUMIFS(Sheet1!$H$4:$H$1497,Sheet1!$F$4:$F$1497,B269,Sheet1!$Z$4:$Z$1497,$J$3)","v":0},null,null,"",{"$f":"IFERROR(IF(B268<\"\",SUMIFS(Sheet1!$L$4:$L$997,Sheet1!$F$4:$F$997,B268,Sheet1!$Z$4:$Z$997,$H$3)+F268/SUMIFS(Sheet1!$H$4:$H$997,Sheet1!$F$4:$F$997,B268,Sheet1!$Z$4:$Z$997,$H$3),F268/D268),\"\")","v":""},""]
[null,null,null,null,null,null,null,{"$f":"SUMIFS(Sheet1!$H$4:$H$1497,Sheet1!$F$4:$F$1497,B270,Sheet1!$Z$4:$Z$1497,$H$3)","v":0},{"$f":"SUMIFS(Sheet1!$J$4:$J$15,Sheet1!$F$4:$F$15,B270,Sheet1!$Z$4:$Z$15,$H$3)","v":0},{"$f":"SUMIFS(Sheet1!$H$4:$H$1497,Sheet1!$F$4:$F$1497,B270,Sheet1!$Z$4:$Z$1497,$J$3)","v":0},null,null,"",{"$f":"IFERROR(IF(B269<\"\",SUMIFS(Sheet1!$L$4:$L$997,Sheet1!$F$4:$F$997,B269,Sheet1!$Z$4:$Z$997,$H$3)+F269/SUMIFS(Sheet1!$H$4:$H$997,Sheet1!$F$4:$F$997,B269,Sheet1!$Z$4:$Z$997,$H$3),F269/D269),\"\")","v":""},""]
[null,null,null,null,null,null,null,{"$f":"SUMIFS(Sheet1!$H$4:$H$1497,Sheet1!$F$4:$F$1497,B271,Sheet1!$Z$4:$Z$1497,$H$3)","v":0},{"$f":"SUMIFS(Sheet1!$J$4:$J$15,Sheet1!$F$4:$F$15,B271,Sheet1!$Z$4:$Z$15,$H$3)","v":0},{"$f":"SUMIFS(Sheet1!$H$4:$H$1497,Sheet1!$F$4:$F$1497,B271,Sheet1!$Z$4:$Z$1497,$J$3)","v":0},null,null,"",{"$f":"IFERROR(IF(B270<\"\",SUMIFS(Sheet1!$L$4:$L$997,Sheet1!$F$4:$F$997,B270,Sheet1!$Z$4:$Z$997,$H$3)+F270/SUMIFS(Sheet1!$H$4:$H$997,Sheet1!$F$4:$F$997,B270,Sheet1!$Z$4:$Z$997,$H$3),F270/D270),\"\")","v":""},""]
[null,null,null,null,null,null,null,{"$f":"SUMIFS(Sheet1!$H$4:$H$1497,Sheet1!$F$4:$F$1497,B272,Sheet1!$Z$4:$Z$1497,$H$3)","v":0},{"$f":"SUMIFS(Sheet1!$J$4:$J$15,Sheet1!$F$4:$F$15,B272,Sheet1!$Z$4:$Z$15,$H$3)","v":0},{"$f":"SUMIFS(Sheet1!$H$4:$H$1497,Sheet1!$F$4:$F$1497,B272,Sheet1!$Z$4:$Z$1497,$J$3)","v":0},null,null,"",{"$f":"IFERROR(IF(B271<\"\",SUMIFS(Sheet1!$L$4:$L$997,Sheet1!$F$4:$F$997,B271,Sheet1!$Z$4:$Z$997,$H$3)+F271/SUMIFS(Sheet1!$H$4:$H$997,Sheet1!$F$4:$F$997,B271,Sheet1!$Z$4:$Z$997,$H$3),F271/D271),\"\")","v":""},""]
[null,null,null,null,null,null,null,{"$f":"SUMIFS(Sheet1!$H$4:$H$1497,Sheet1!$F$4:$F$1497,B273,Sheet1!$Z$4:$Z$1497,$H$3)","v":0},{"$f":"SUMIFS(Sheet1!$J$4:$J$15,Sheet1!$F$4:$F$15,B273,Sheet1!$Z$4:$Z$15,$H$3)","v":0},{"$f":"SUMIFS(Sheet1!$H$4:$H$1497,Sheet1!$F$4:$F$1497,B273,Sheet1!$Z$4:$Z$1497,$J$3)","v":0},null,null,"",{"$f":"IFERROR(IF(B272<\"\",SUMIFS(Sheet1!$L$4:$L$997,Sheet1!$F$4:$F$997,B272,Sheet1!$Z$4:$Z$997,$H$3)+F272/SUMIFS(Sheet1!$H$4:$H$997,Sheet1!$F$4:$F$997,B272,Sheet1!$Z$4:$Z$997,$H$3),F272/D272),\"\")","v":""},""]
[null,null,null,null,null,null,null,{"$f":"SUMIFS(Sheet1!$H$4:$H$1497,Sheet1!$F$4:$F$1497,B274,Sheet1!$Z$4:$Z$1497,$H$3)","v":0},{"$f":"SUMIFS(Sheet1!$J$4:$J$15,Sheet1!$F$4:$F$15,B274,Sheet1!$Z$4:$Z$15,$H$3)","v":0},{"$f":"SUMIFS(Sheet1!$H$4:$H$1497,Sheet1!$F$4:$F$1497,B274,Sheet1!$Z$4:$Z$1497,$J$3)","v":0},null,null,"",{"$f":"IFERROR(IF(B273<\"\",SUMIFS(Sheet1!$L$4:$L$997,Sheet1!$F$4:$F$997,B273,Sheet1!$Z$4:$Z$997,$H$3)+F273/SUMIFS(Sheet1!$H$4:$H$997,Sheet1!$F$4:$F$997,B273,Sheet1!$Z$4:$Z$997,$H$3),F273/D273),\"\")","v":""},""]
[null,null,null,null,null,null,null,{"$f":"SUMIFS(Sheet1!$H$4:$H$1497,Sheet1!$F$4:$F$1497,B275,Sheet1!$Z$4:$Z$1497,$H$3)","v":0},{"$f":"SUMIFS(Sheet1!$J$4:$J$15,Sheet1!$F$4:$F$15,B275,Sheet1!$Z$4:$Z$15,$H$3)","v":0},{"$f":"SUMIFS(Sheet1!$H$4:$H$1497,Sheet1!$F$4:$F$1497,B275,Sheet1!$Z$4:$Z$1497,$J$3)","v":0},null,null,"",{"$f":"IFERROR(IF(B274<\"\",SUMIFS(Sheet1!$L$4:$L$997,Sheet1!$F$4:$F$997,B274,Sheet1!$Z$4:$Z$997,$H$3)+F274/SUMIFS(Sheet1!$H$4:$H$997,Sheet1!$F$4:$F$997,B274,Sheet1!$Z$4:$Z$997,$H$3),F274/D274),\"\")","v":""},""]
[null,null,null,null,null,null,null,{"$f":"SUMIFS(Sheet1!$H$4:$H$1497,Sheet1!$F$4:$F$1497,B276,Sheet1!$Z$4:$Z$1497,$H$3)","v":0},{"$f":"SUMIFS(Sheet1!$J$4:$J$15,Sheet1!$F$4:$F$15,B276,Sheet1!$Z$4:$Z$15,$H$3)","v":0},{"$f":"SUMIFS(Sheet1!$H$4:$H$1497,Sheet1!$F$4:$F$1497,B276,Sheet1!$Z$4:$Z$1497,$J$3)","v":0},null,null,"",{"$f":"IFERROR(IF(B275<\"\",SUMIFS(Sheet1!$L$4:$L$997,Sheet1!$F$4:$F$997,B275,Sheet1!$Z$4:$Z$997,$H$3)+F275/SUMIFS(Sheet1!$H$4:$H$997,Sheet1!$F$4:$F$997,B275,Sheet1!$Z$4:$Z$997,$H$3),F275/D275),\"\")","v":""},""]
[null,null,null,null,null,null,null,{"$f":"SUMIFS(Sheet1!$H$4:$H$1497,Sheet1!$F$4:$F$1497,B277,Sheet1!$Z$4:$Z$1497,$H$3)","v":0},{"$f":"SUMIFS(Sheet1!$J$4:$J$15,Sheet1!$F$4:$F$15,B277,Sheet1!$Z$4:$Z$15,$H$3)","v":0},{"$f":"SUMIFS(Sheet1!$H$4:$H$1497,Sheet1!$F$4:$F$1497,B277,Sheet1!$Z$4:$Z$1497,$J$3)","v":0},null,null,"",{"$f":"IFERROR(IF(B276<\"\",SUMIFS(Sheet1!$L$4:$L$997,Sheet1!$F$4:$F$997,B276,Sheet1!$Z$4:$Z$997,$H$3)+F276/SUMIFS(Sheet1!$H$4:$H$997,Sheet1!$F$4:$F$997,B276,Sheet1!$Z$4:$Z$997,$H$3),F276/D276),\"\")","v":""},""]
[null,null,null,null,null,null,null,{"$f":"SUMIFS(Sheet1!$H$4:$H$1497,Sheet1!$F$4:$F$1497,B278,Sheet1!$Z$4:$Z$1497,$H$3)","v":0},{"$f":"SUMIFS(Sheet1!$J$4:$J$15,Sheet1!$F$4:$F$15,B278,Sheet1!$Z$4:$Z$15,$H$3)","v":0},{"$f":"SUMIFS(Sheet1!$H$4:$H$1497,Sheet1!$F$4:$F$1497,B278,Sheet1!$Z$4:$Z$1497,$J$3)","v":0},null,null,"",{"$f":"IFERROR(IF(B277<\"\",SUMIFS(Sheet1!$L$4:$L$997,Sheet1!$F$4:$F$997,B277,Sheet1!$Z$4:$Z$997,$H$3)+F277/SUMIFS(Sheet1!$H$4:$H$997,Sheet1!$F$4:$F$997,B277,Sheet1!$Z$4:$Z$997,$H$3),F277/D277),\"\")","v":""},""]
[null,null,null,null,null,null,null,{"$f":"SUMIFS(Sheet1!$H$4:$H$1497,Sheet1!$F$4:$F$1497,B279,Sheet1!$Z$4:$Z$1497,$H$3)","v":0},{"$f":"SUMIFS(Sheet1!$J$4:$J$15,Sheet1!$F$4:$F$15,B279,Sheet1!$Z$4:$Z$15,$H$3)","v":0},{"$f":"SUMIFS(Sheet1!$H$4:$H$1497,Sheet1!$F$4:$F$1497,B279,Sheet1!$Z$4:$Z$1497,$J$3)","v":0},null,null,"",{"$f":"IFERROR(IF(B278<\"\",SUMIFS(Sheet1!$L$4:$L$997,Sheet1!$F$4:$F$997,B278,Sheet1!$Z$4:$Z$997,$H$3)+F278/SUMIFS(Sheet1!$H$4:$H$997,Sheet1!$F$4:$F$997,B278,Sheet1!$Z$4:$Z$997,$H$3),F278/D278),\"\")","v":""},""]
[null,null,null,null,null,null,null,{"$f":"SUMIFS(Sheet1!$H$4:$H$1497,Sheet1!$F$4:$F$1497,B280,Sheet1!$Z$4:$Z$1497,$H$3)","v":0},{"$f":"SUMIFS(Sheet1!$J$4:$J$15,Sheet1!$F$4:$F$15,B280,Sheet1!$Z$4:$Z$15,$H$3)","v":0},{"$f":"SUMIFS(Sheet1!$H$4:$H$1497,Sheet1!$F$4:$F$1497,B280,Sheet1!$Z$4:$Z$1497,$J$3)","v":0},null,null,"",{"$f":"IFERROR(IF(B279<\"\",SUMIFS(Sheet1!$L$4:$L$997,Sheet1!$F$4:$F$997,B279,Sheet1!$Z$4:$Z$997,$H$3)+F279/SUMIFS(Sheet1!$H$4:$H$997,Sheet1!$F$4:$F$997,B279,Sheet1!$Z$4:$Z$997,$H$3),F279/D279),\"\")","v":""},""]
[null,null,null,null,null,null,null,{"$f":"SUMIFS(Sheet1!$H$4:$H$1497,Sheet1!$F$4:$F$1497,B281,Sheet1!$Z$4:$Z$1497,$H$3)","v":0},{"$f":"SUMIFS(Sheet1!$J$4:$J$15,Sheet1!$F$4:$F$15,B281,Sheet1!$Z$4:$Z$15,$H$3)","v":0},{"$f":"SUMIFS(Sheet1!$H$4:$H$1497,Sheet1!$F$4:$F$1497,B281,Sheet1!$Z$4:$Z$1497,$J$3)","v":0},null,null,"",{"$f":"IFERROR(IF(B280<\"\",SUMIFS(Sheet1!$L$4:$L$997,Sheet1!$F$4:$F$997,B280,Sheet1!$Z$4:$Z$997,$H$3)+F280/SUMIFS(Sheet1!$H$4:$H$997,Sheet1!$F$4:$F$997,B280,Sheet1!$Z$4:$Z$997,$H$3),F280/D280),\"\")","v":""},""]
[null,null,null,null,null,null,null,{"$f":"SUMIFS(Sheet1!$H$4:$H$1497,Sheet1!$F$4:$F$1497,B282,Sheet1!$Z$4:$Z$1497,$H$3)","v":0},{"$f":"SUMIFS(Sheet1!$J$4:$J$15,Sheet1!$F$4:$F$15,B282,Sheet1!$Z$4:$Z$15,$H$3)","v":0},{"$f":"SUMIFS(Sheet1!$H$4:$H$1497,Sheet1!$F$4:$F$1497,B282,Sheet1!$Z$4:$Z$1497,$J$3)","v":0},null,null,"",{"$f":"IFERROR(IF(B281<\"\",SUMIFS(Sheet1!$L$4:$L$997,Sheet1!$F$4:$F$997,B281,Sheet1!$Z$4:$Z$997,$H$3)+F281/SUMIFS(Sheet1!$H$4:$H$997,Sheet1!$F$4:$F$997,B281,Sheet1!$Z$4:$Z$997,$H$3),F281/D281),\"\")","v":""},""]
[null,null,null,null,null,null,null,{"$f":"SUMIFS(Sheet1!$H$4:$H$1497,Sheet1!$F$4:$F$1497,B283,Sheet1!$Z$4:$Z$1497,$H$3)","v":0},{"$f":"SUMIFS(Sheet1!$J$4:$J$15,Sheet1!$F$4:$F$15,B283,Sheet1!$Z$4:$Z$15,$H$3)","v":0},{"$f":"SUMIFS(Sheet1!$H$4:$H$1497,Sheet1!$F$4:$F$1497,B283,Sheet1!$Z$4:$Z$1497,$J$3)","v":0},null,null,"",{"$f":"IFERROR(IF(B282<\"\",SUMIFS(Sheet1!$L$4:$L$997,Sheet1!$F$4:$F$997,B282,Sheet1!$Z$4:$Z$997,$H$3)+F282/SUMIFS(Sheet1!$H$4:$H$997,Sheet1!$F$4:$F$997,B282,Sheet1!$Z$4:$Z$997,$H$3),F282/D282),\"\")","v":""},""]
[null,null,null,null,null,null,null,{"$f":"SUMIFS(Sheet1!$H$4:$H$1497,Sheet1!$F$4:$F$1497,B284,Sheet1!$Z$4:$Z$1497,$H$3)","v":0},{"$f":"SUMIFS(Sheet1!$J$4:$J$15,Sheet1!$F$4:$F$15,B284,Sheet1!$Z$4:$Z$15,$H$3)","v":0},{"$f":"SUMIFS(Sheet1!$H$4:$H$1497,Sheet1!$F$4:$F$1497,B284,Sheet1!$Z$4:$Z$1497,$J$3)","v":0},null,null,"",{"$f":"IFERROR(IF(B283<\"\",SUMIFS(Sheet1!$L$4:$L$997,Sheet1!$F$4:$F$997,B283,Sheet1!$Z$4:$Z$997,$H$3)+F283/SUMIFS(Sheet1!$H$4:$H$997,Sheet1!$F$4:$F$997,B283,Sheet1!$Z$4:$Z$997,$H$3),F283/D283),\"\")","v":""},""]
[null,null,null,null,null,null,null,{"$f":"SUMIFS(Sheet1!$H$4:$H$1497,Sheet1!$F$4:$F$1497,B285,Sheet1!$Z$4:$Z$1497,$H$3)","v":0},{"$f":"SUMIFS(Sheet1!$J$4:$J$15,Sheet1!$F$4:$F$15,B285,Sheet1!$Z$4:$Z$15,$H$3)","v":0},{"$f":"SUMIFS(Sheet1!$H$4:$H$1497,Sheet1!$F$4:$F$1497,B285,Sheet1!$Z$4:$Z$1497,$J$3)","v":0},null,null,"",{"$f":"IFERROR(IF(B284<\"\",SUMIFS(Sheet1!$L$4:$L$997,Sheet1!$F$4:$F$997,B284,Sheet1!$Z$4:$Z$997,$H$3)+F284/SUMIFS(Sheet1!$H$4:$H$997,Sheet1!$F$4:$F$997,B284,Sheet1!$Z$4:$Z$997,$H$3),F284/D284),\"\")","v":""},""]
[null,null,null,null,null,null,null,{"$f":"SUMIFS(Sheet1!$H$4:$H$1497,Sheet1!$F$4:$F$1497,B286,Sheet1!$Z$4:$Z$1497,$H$3)","v":0},{"$f":"SUMIFS(Sheet1!$J$4:$J$15,Sheet1!$F$4:$F$15,B286,Sheet1!$Z$4:$Z$15,$H$3)","v":0},{"$f":"SUMIFS(Sheet1!$H$4:$H$1497,Sheet1!$F$4:$F$1497,B286,Sheet1!$Z$4:$Z$1497,$J$3)","v":0},null,null,"",{"$f":"IFERROR(IF(B285<\"\",SUMIFS(Sheet1!$L$4:$L$997,Sheet1!$F$4:$F$997,B285,Sheet1!$Z$4:$Z$997,$H$3)+F285/SUMIFS(Sheet1!$H$4:$H$997,Sheet1!$F$4:$F$997,B285,Sheet1!$Z$4:$Z$997,$H$3),F285/D285),\"\")","v":""},""]
[null,null,null,null,null,null,null,{"$f":"SUMIFS(Sheet1!$H$4:$H$1497,Sheet1!$F$4:$F$1497,B287,Sheet1!$Z$4:$Z$1497,$H$3)","v":0},{"$f":"SUMIFS(Sheet1!$J$4:$J$15,Sheet1!$F$4:$F$15,B287,Sheet1!$Z$4:$Z$15,$H$3)","v":0},{"$f":"SUMIFS(Sheet1!$H$4:$H$1497,Sheet1!$F$4:$F$1497,B287,Sheet1!$Z$4:$Z$1497,$J$3)","v":0},null,null,"",{"$f":"IFERROR(IF(B286<\"\",SUMIFS(Sheet1!$L$4:$L$997,Sheet1!$F$4:$F$997,B286,Sheet1!$Z$4:$Z$997,$H$3)+F286/SUMIFS(Sheet1!$H$4:$H$997,Sheet1!$F$4:$F$997,B286,Sheet1!$Z$4:$Z$997,$H$3),F286/D286),\"\")","v":""},""]
[null,null,null,null,null,null,null,{"$f":"SUMIFS(Sheet1!$H$4:$H$1497,Sheet1!$F$4:$F$1497,B288,Sheet1!$Z$4:$Z$1497,$H$3)","v":0},{"$f":"SUMIFS(Sheet1!$J$4:$J$15,Sheet1!$F$4:$F$15,B288,Sheet1!$Z$4:$Z$15,$H$3)","v":0},{"$f":"SUMIFS(Sheet1!$H$4:$H$1497,Sheet1!$F$4:$F$1497,B288,Sheet1!$Z$4:$Z$1497,$J$3)","v":0},null,null,"",{"$f":"IFERROR(IF(B287<\"\",SUMIFS(Sheet1!$L$4:$L$997,Sheet1!$F$4:$F$997,B287,Sheet1!$Z$4:$Z$997,$H$3)+F287/SUMIFS(Sheet1!$H$4:$H$997,Sheet1!$F$4:$F$997,B287,Sheet1!$Z$4:$Z$997,$H$3),F287/D287),\"\")","v":""},""]
[null,null,null,null,null,null,null,{"$f":"SUMIFS(Sheet1!$H$4:$H$1497,Sheet1!$F$4:$F$1497,B289,Sheet1!$Z$4:$Z$1497,$H$3)","v":0},{"$f":"SUMIFS(Sheet1!$J$4:$J$15,Sheet1!$F$4:$F$15,B289,Sheet1!$Z$4:$Z$15,$H$3)","v":0},{"$f":"SUMIFS(Sheet1!$H$4:$H$1497,Sheet1!$F$4:$F$1497,B289,Sheet1!$Z$4:$Z$1497,$J$3)","v":0},null,null,"",{"$f":"IFERROR(IF(B288<\"\",SUMIFS(Sheet1!$L$4:$L$997,Sheet1!$F$4:$F$997,B288,Sheet1!$Z$4:$Z$997,$H$3)+F288/SUMIFS(Sheet1!$H$4:$H$997,Sheet1!$F$4:$F$997,B288,Sheet1!$Z$4:$Z$997,$H$3),F288/D288),\"\")","v":""},""]
[null,null,null,null,null,null,null,{"$f":"SUMIFS(Sheet1!$H$4:$H$1497,Sheet1!$F$4:$F$1497,B290,Sheet1!$Z$4:$Z$1497,$H$3)","v":0},{"$f":"SUMIFS(Sheet1!$J$4:$J$15,Sheet1!$F$4:$F$15,B290,Sheet1!$Z$4:$Z$15,$H$3)","v":0},{"$f":"SUMIFS(Sheet1!$H$4:$H$1497,Sheet1!$F$4:$F$1497,B290,Sheet1!$Z$4:$Z$1497,$J$3)","v":0},null,null,"",{"$f":"IFERROR(IF(B289<\"\",SUMIFS(Sheet1!$L$4:$L$997,Sheet1!$F$4:$F$997,B289,Sheet1!$Z$4:$Z$997,$H$3)+F289/SUMIFS(Sheet1!$H$4:$H$997,Sheet1!$F$4:$F$997,B289,Sheet1!$Z$4:$Z$997,$H$3),F289/D289),\"\")","v":""},""]
[null,null,null,null,null,null,null,{"$f":"SUMIFS(Sheet1!$H$4:$H$1497,Sheet1!$F$4:$F$1497,B291,Sheet1!$Z$4:$Z$1497,$H$3)","v":0},{"$f":"SUMIFS(Sheet1!$J$4:$J$15,Sheet1!$F$4:$F$15,B291,Sheet1!$Z$4:$Z$15,$H$3)","v":0},{"$f":"SUMIFS(Sheet1!$H$4:$H$1497,Sheet1!$F$4:$F$1497,B291,Sheet1!$Z$4:$Z$1497,$J$3)","v":0},null,null,"",{"$f":"IFERROR(IF(B290<\"\",SUMIFS(Sheet1!$L$4:$L$997,Sheet1!$F$4:$F$997,B290,Sheet1!$Z$4:$Z$997,$H$3)+F290/SUMIFS(Sheet1!$H$4:$H$997,Sheet1!$F$4:$F$997,B290,Sheet1!$Z$4:$Z$997,$H$3),F290/D290),\"\")","v":""},""]
[null,null,null,null,null,null,null,{"$f":"SUMIFS(Sheet1!$H$4:$H$1497,Sheet1!$F$4:$F$1497,B292,Sheet1!$Z$4:$Z$1497,$H$3)","v":0},{"$f":"SUMIFS(Sheet1!$J$4:$J$15,Sheet1!$F$4:$F$15,B292,Sheet1!$Z$4:$Z$15,$H$3)","v":0},{"$f":"SUMIFS(Sheet1!$H$4:$H$1497,Sheet1!$F$4:$F$1497,B292,Sheet1!$Z$4:$Z$1497,$J$3)","v":0},null,null,"",{"$f":"IFERROR(IF(B291<\"\",SUMIFS(Sheet1!$L$4:$L$997,Sheet1!$F$4:$F$997,B291,Sheet1!$Z$4:$Z$997,$H$3)+F291/SUMIFS(Sheet1!$H$4:$H$997,Sheet1!$F$4:$F$997,B291,Sheet1!$Z$4:$Z$997,$H$3),F291/D291),\"\")","v":""},""]
[null,null,null,null,null,null,null,{"$f":"SUMIFS(Sheet1!$H$4:$H$1497,Sheet1!$F$4:$F$1497,B293,Sheet1!$Z$4:$Z$1497,$H$3)","v":0},{"$f":"SUMIFS(Sheet1!$J$4:$J$15,Sheet1!$F$4:$F$15,B293,Sheet1!$Z$4:$Z$15,$H$3)","v":0},{"$f":"SUMIFS(Sheet1!$H$4:$H$1497,Sheet1!$F$4:$F$1497,B293,Sheet1!$Z$4:$Z$1497,$J$3)","v":0},null,null,"",{"$f":"IFERROR(IF(B292<\"\",SUMIFS(Sheet1!$L$4:$L$997,Sheet1!$F$4:$F$997,B292,Sheet1!$Z$4:$Z$997,$H$3)+F292/SUMIFS(Sheet1!$H$4:$H$997,Sheet1!$F$4:$F$997,B292,Sheet1!$Z$4:$Z$997,$H$3),F292/D292),\"\")","v":""},""]
[null,null,null,null,null,null,null,{"$f":"SUMIFS(Sheet1!$H$4:$H$1497,Sheet1!$F$4:$F$1497,B294,Sheet1!$Z$4:$Z$1497,$H$3)","v":0},{"$f":"SUMIFS(Sheet1!$J$4:$J$15,Sheet1!$F$4:$F$15,B294,Sheet1!$Z$4:$Z$15,$H$3)","v":0},{"$f":"SUMIFS(Sheet1!$H$4:$H$1497,Sheet1!$F$4:$F$1497,B294,Sheet1!$Z$4:$Z$1497,$J$3)","v":0},null,null,"",{"$f":"IFERROR(IF(B293<\"\",SUMIFS(Sheet1!$L$4:$L$997,Sheet1!$F$4:$F$997,B293,Sheet1!$Z$4:$Z$997,$H$3)+F293/SUMIFS(Sheet1!$H$4:$H$997,Sheet1!$F$4:$F$997,B293,Sheet1!$Z$4:$Z$997,$H$3),F293/D293),\"\")","v":""},""]
[null,null,null,null,null,null,null,{"$f":"SUMIFS(Sheet1!$H$4:$H$1497,Sheet1!$F$4:$F$1497,B295,Sheet1!$Z$4:$Z$1497,$H$3)","v":0},{"$f":"SUMIFS(Sheet1!$J$4:$J$15,Sheet1!$F$4:$F$15,B295,Sheet1!$Z$4:$Z$15,$H$3)","v":0},{"$f":"SUMIFS(Sheet1!$H$4:$H$1497,Sheet1!$F$4:$F$1497,B295,Sheet1!$Z$4:$Z$1497,$J$3)","v":0},null,null,"",{"$f":"IFERROR(IF(B294<\"\",SUMIFS(Sheet1!$L$4:$L$997,Sheet1!$F$4:$F$997,B294,Sheet1!$Z$4:$Z$997,$H$3)+F294/SUMIFS(Sheet1!$H$4:$H$997,Sheet1!$F$4:$F$997,B294,Sheet1!$Z$4:$Z$997,$H$3),F294/D294),\"\")","v":""},""]
[null,null,null,null,null,null,null,{"$f":"SUMIFS(Sheet1!$H$4:$H$1497,Sheet1!$F$4:$F$1497,B296,Sheet1!$Z$4:$Z$1497,$H$3)","v":0},{"$f":"SUMIFS(Sheet1!$J$4:$J$15,Sheet1!$F$4:$F$15,B296,Sheet1!$Z$4:$Z$15,$H$3)","v":0},{"$f":"SUMIFS(Sheet1!$H$4:$H$1497,Sheet1!$F$4:$F$1497,B296,Sheet1!$Z$4:$Z$1497,$J$3)","v":0},null,null,"",{"$f":"IFERROR(IF(B295<\"\",SUMIFS(Sheet1!$L$4:$L$997,Sheet1!$F$4:$F$997,B295,Sheet1!$Z$4:$Z$997,$H$3)+F295/SUMIFS(Sheet1!$H$4:$H$997,Sheet1!$F$4:$F$997,B295,Sheet1!$Z$4:$Z$997,$H$3),F295/D295),\"\")","v":""},""]
[null,null,null,null,null,null,null,{"$f":"SUMIFS(Sheet1!$H$4:$H$1497,Sheet1!$F$4:$F$1497,B297,Sheet1!$Z$4:$Z$1497,$H$3)","v":0},{"$f":"SUMIFS(Sheet1!$J$4:$J$15,Sheet1!$F$4:$F$15,B297,Sheet1!$Z$4:$Z$15,$H$3)","v":0},{"$f":"SUMIFS(Sheet1!$H$4:$H$1497,Sheet1!$F$4:$F$1497,B297,Sheet1!$Z$4:$Z$1497,$J$3)","v":0},null,null,"",{"$f":"IFERROR(IF(B296<\"\",SUMIFS(Sheet1!$L$4:$L$997,Sheet1!$F$4:$F$997,B296,Sheet1!$Z$4:$Z$997,$H$3)+F296/SUMIFS(Sheet1!$H$4:$H$997,Sheet1!$F$4:$F$997,B296,Sheet1!$Z$4:$Z$997,$H$3),F296/D296),\"\")","v":""},""]
[null,null,null,null,null,null,null,{"$f":"SUMIFS(Sheet1!$H$4:$H$1497,Sheet1!$F$4:$F$1497,B298,Sheet1!$Z$4:$Z$1497,$H$3)","v":0},{"$f":"SUMIFS(Sheet1!$J$4:$J$15,Sheet1!$F$4:$F$15,B298,Sheet1!$Z$4:$Z$15,$H$3)","v":0},{"$f":"SUMIFS(Sheet1!$H$4:$H$1497,Sheet1!$F$4:$F$1497,B298,Sheet1!$Z$4:$Z$1497,$J$3)","v":0},null,null,"",{"$f":"IFERROR(IF(B297<\"\",SUMIFS(Sheet1!$L$4:$L$997,Sheet1!$F$4:$F$997,B297,Sheet1!$Z$4:$Z$997,$H$3)+F297/SUMIFS(Sheet1!$H$4:$H$997,Sheet1!$F$4:$F$997,B297,Sheet1!$Z$4:$Z$997,$H$3),F297/D297),\"\")","v":""},""]
[null,null,null,null,null,null,null,{"$f":"SUMIFS(Sheet1!$H$4:$H$1497,Sheet1!$F$4:$F$1497,B299,Sheet1!$Z$4:$Z$1497,$H$3)","v":0},{"$f":"SUMIFS(Sheet1!$J$4:$J$15,Sheet1!$F$4:$F$15,B299,Sheet1!$Z$4:$Z$15,$H$3)","v":0},{"$f":"SUMIFS(Sheet1!$H$4:$H$1497,Sheet1!$F$4:$F$1497,B299,Sheet1!$Z$4:$Z$1497,$J$3)","v":0},null,null,"",{"$f":"IFERROR(IF(B298<\"\",SUMIFS(Sheet1!$L$4:$L$997,Sheet1!$F$4:$F$997,B298,Sheet1!$Z$4:$Z$997,$H$3)+F298/SUMIFS(Sheet1!$H$4:$H$997,Sheet1!$F$4:$F$997,B298,Sheet1!$Z$4:$Z$997,$H$3),F298/D298),\"\")","v":""},""]
[null,null,null,null,null,null,null,{"$f":"SUMIFS(Sheet1!$H$4:$H$1497,Sheet1!$F$4:$F$1497,B300,Sheet1!$Z$4:$Z$1497,$H$3)","v":0},{"$f":"SUMIFS(Sheet1!$J$4:$J$15,Sheet1!$F$4:$F$15,B300,Sheet1!$Z$4:$Z$15,$H$3)","v":0},{"$f":"SUMIFS(Sheet1!$H$4:$H$1497,Sheet1!$F$4:$F$1497,B300,Sheet1!$Z$4:$Z$1497,$J$3)","v":0},null,null,"",{"$f":"IFERROR(IF(B299<\"\",SUMIFS(Sheet1!$L$4:$L$997,Sheet1!$F$4:$F$997,B299,Sheet1!$Z$4:$Z$997,$H$3)+F299/SUMIFS(Sheet1!$H$4:$H$997,Sheet1!$F$4:$F$997,B299,Sheet1!$Z$4:$Z$997,$H$3),F299/D299),\"\")","v":""},""]
[null,null,null,null,null,null,null,{"$f":"SUMIFS(Sheet1!$H$4:$H$1497,Sheet1!$F$4:$F$1497,B301,Sheet1!$Z$4:$Z$1497,$H$3)","v":0},{"$f":"SUMIFS(Sheet1!$J$4:$J$15,Sheet1!$F$4:$F$15,B301,Sheet1!$Z$4:$Z$15,$H$3)","v":0},{"$f":"SUMIFS(Sheet1!$H$4:$H$1497,Sheet1!$F$4:$F$1497,B301,Sheet1!$Z$4:$Z$1497,$J$3)","v":0},null,null,"",{"$f":"IFERROR(IF(B300<\"\",SUMIFS(Sheet1!$L$4:$L$997,Sheet1!$F$4:$F$997,B300,Sheet1!$Z$4:$Z$997,$H$3)+F300/SUMIFS(Sheet1!$H$4:$H$997,Sheet1!$F$4:$F$997,B300,Sheet1!$Z$4:$Z$997,$H$3),F300/D300),\"\")","v":""},""]
[null,null,null,null,null,null,null,{"$f":"SUMIFS(Sheet1!$H$4:$H$1497,Sheet1!$F$4:$F$1497,B302,Sheet1!$Z$4:$Z$1497,$H$3)","v":0},{"$f":"SUMIFS(Sheet1!$J$4:$J$15,Sheet1!$F$4:$F$15,B302,Sheet1!$Z$4:$Z$15,$H$3)","v":0},{"$f":"SUMIFS(Sheet1!$H$4:$H$1497,Sheet1!$F$4:$F$1497,B302,Sheet1!$Z$4:$Z$1497,$J$3)","v":0},null,null,"",{"$f":"IFERROR(IF(B301<\"\",SUMIFS(Sheet1!$L$4:$L$997,Sheet1!$F$4:$F$997,B301,Sheet1!$Z$4:$Z$997,$H$3)+F301/SUMIFS(Sheet1!$H$4:$H$997,Sheet1!$F$4:$F$997,B301,Sheet1!$Z$4:$Z$997,$H$3),F301/D301),\"\")","v":""},""]
[null,null,null,null,null,null,null,{"$f":"SUMIFS(Sheet1!$H$4:$H$1497,Sheet1!$F$4:$F$1497,B303,Sheet1!$Z$4:$Z$1497,$H$3)","v":0},{"$f":"SUMIFS(Sheet1!$J$4:$J$15,Sheet1!$F$4:$F$15,B303,Sheet1!$Z$4:$Z$15,$H$3)","v":0},{"$f":"SUMIFS(Sheet1!$H$4:$H$1497,Sheet1!$F$4:$F$1497,B303,Sheet1!$Z$4:$Z$1497,$J$3)","v":0},null,null,"",{"$f":"IFERROR(IF(B302<\"\",SUMIFS(Sheet1!$L$4:$L$997,Sheet1!$F$4:$F$997,B302,Sheet1!$Z$4:$Z$997,$H$3)+F302/SUMIFS(Sheet1!$H$4:$H$997,Sheet1!$F$4:$F$997,B302,Sheet1!$Z$4:$Z$997,$H$3),F302/D302),\"\")","v":""},""]
[null,null,null,null,null,null,null,{"$f":"SUMIFS(Sheet1!$H$4:$H$1497,Sheet1!$F$4:$F$1497,B304,Sheet1!$Z$4:$Z$1497,$H$3)","v":0},{"$f":"SUMIFS(Sheet1!$J$4:$J$15,Sheet1!$F$4:$F$15,B304,Sheet1!$Z$4:$Z$15,$H$3)","v":0},{"$f":"SUMIFS(Sheet1!$H$4:$H$1497,Sheet1!$F$4:$F$1497,B304,Sheet1!$Z$4:$Z$1497,$J$3)","v":0},null,null,"",{"$f":"IFERROR(IF(B303<\"\",SUMIFS(Sheet1!$L$4:$L$997,Sheet1!$F$4:$F$997,B303,Sheet1!$Z$4:$Z$997,$H$3)+F303/SUMIFS(Sheet1!$H$4:$H$997,Sheet1!$F$4:$F$997,B303,Sheet1!$Z$4:$Z$997,$H$3),F303/D303),\"\")","v":""},""]
[null,null,null,null,null,null,null,{"$f":"SUMIFS(Sheet1!$H$4:$H$1497,Sheet1!$F$4:$F$1497,B305,Sheet1!$Z$4:$Z$1497,$H$3)","v":0},{"$f":"SUMIFS(Sheet1!$J$4:$J$15,Sheet1!$F$4:$F$15,B305,Sheet1!$Z$4:$Z$15,$H$3)","v":0},{"$f":"SUMIFS(Sheet1!$H$4:$H$1497,Sheet1!$F$4:$F$1497,B305,Sheet1!$Z$4:$Z$1497,$J$3)","v":0},null,null,"",{"$f":"IFERROR(IF(B304<\"\",SUMIFS(Sheet1!$L$4:$L$997,Sheet1!$F$4:$F$997,B304,Sheet1!$Z$4:$Z$997,$H$3)+F304/SUMIFS(Sheet1!$H$4:$H$997,Sheet1!$F$4:$F$997,B304,Sheet1!$Z$4:$Z$997,$H$3),F304/D304),\"\")","v":""},""]
[null,null,null,null,null,null,null,{"$f":"SUMIFS(Sheet1!$H$4:$H$1497,Sheet1!$F$4:$F$1497,B306,Sheet1!$Z$4:$Z$1497,$H$3)","v":0},{"$f":"SUMIFS(Sheet1!$J$4:$J$15,Sheet1!$F$4:$F$15,B306,Sheet1!$Z$4:$Z$15,$H$3)","v":0},{"$f":"SUMIFS(Sheet1!$H$4:$H$1497,Sheet1!$F$4:$F$1497,B306,Sheet1!$Z$4:$Z$1497,$J$3)","v":0},null,null,"",{"$f":"IFERROR(IF(B305<\"\",SUMIFS(Sheet1!$L$4:$L$997,Sheet1!$F$4:$F$997,B305,Sheet1!$Z$4:$Z$997,$H$3)+F305/SUMIFS(Sheet1!$H$4:$H$997,Sheet1!$F$4:$F$997,B305,Sheet1!$Z$4:$Z$997,$H$3),F305/D305),\"\")","v":""},""]
[null,null,null,null,null,null,null,{"$f":"SUMIFS(Sheet1!$H$4:$H$1497,Sheet1!$F$4:$F$1497,B307,Sheet1!$Z$4:$Z$1497,$H$3)","v":0},{"$f":"SUMIFS(Sheet1!$J$4:$J$15,Sheet1!$F$4:$F$15,B307,Sheet1!$Z$4:$Z$15,$H$3)","v":0},{"$f":"SUMIFS(Sheet1!$H$4:$H$1497,Sheet1!$F$4:$F$1497,B307,Sheet1!$Z$4:$Z$1497,$J$3)","v":0},null,null,"",{"$f":"IFERROR(IF(B306<\"\",SUMIFS(Sheet1!$L$4:$L$997,Sheet1!$F$4:$F$997,B306,Sheet1!$Z$4:$Z$997,$H$3)+F306/SUMIFS(Sheet1!$H$4:$H$997,Sheet1!$F$4:$F$997,B306,Sheet1!$Z$4:$Z$997,$H$3),F306/D306),\"\")","v":""},""]
[null,null,null,null,null,null,null,{"$f":"SUMIFS(Sheet1!$H$4:$H$1497,Sheet1!$F$4:$F$1497,B308,Sheet1!$Z$4:$Z$1497,$H$3)","v":0},{"$f":"SUMIFS(Sheet1!$J$4:$J$15,Sheet1!$F$4:$F$15,B308,Sheet1!$Z$4:$Z$15,$H$3)","v":0},{"$f":"SUMIFS(Sheet1!$H$4:$H$1497,Sheet1!$F$4:$F$1497,B308,Sheet1!$Z$4:$Z$1497,$J$3)","v":0},null,null,"",{"$f":"IFERROR(IF(B307<\"\",SUMIFS(Sheet1!$L$4:$L$997,Sheet1!$F$4:$F$997,B307,Sheet1!$Z$4:$Z$997,$H$3)+F307/SUMIFS(Sheet1!$H$4:$H$997,Sheet1!$F$4:$F$997,B307,Sheet1!$Z$4:$Z$997,$H$3),F307/D307),\"\")","v":""},""]
[null,null,null,null,null,null,null,{"$f":"SUMIFS(Sheet1!$H$4:$H$1497,Sheet1!$F$4:$F$1497,B309,Sheet1!$Z$4:$Z$1497,$H$3)","v":0},{"$f":"SUMIFS(Sheet1!$J$4:$J$15,Sheet1!$F$4:$F$15,B309,Sheet1!$Z$4:$Z$15,$H$3)","v":0},{"$f":"SUMIFS(Sheet1!$H$4:$H$1497,Sheet1!$F$4:$F$1497,B309,Sheet1!$Z$4:$Z$1497,$J$3)","v":0},null,null,"",{"$f":"IFERROR(IF(B308<\"\",SUMIFS(Sheet1!$L$4:$L$997,Sheet1!$F$4:$F$997,B308,Sheet1!$Z$4:$Z$997,$H$3)+F308/SUMIFS(Sheet1!$H$4:$H$997,Sheet1!$F$4:$F$997,B308,Sheet1!$Z$4:$Z$997,$H$3),F308/D308),\"\")","v":""},""]
[null,null,null,null,null,null,null,{"$f":"SUMIFS(Sheet1!$H$4:$H$1497,Sheet1!$F$4:$F$1497,B310,Sheet1!$Z$4:$Z$1497,$H$3)","v":0},{"$f":"SUMIFS(Sheet1!$J$4:$J$15,Sheet1!$F$4:$F$15,B310,Sheet1!$Z$4:$Z$15,$H$3)","v":0},{"$f":"SUMIFS(Sheet1!$H$4:$H$1497,Sheet1!$F$4:$F$1497,B310,Sheet1!$Z$4:$Z$1497,$J$3)","v":0},null,null,"",{"$f":"IFERROR(IF(B309<\"\",SUMIFS(Sheet1!$L$4:$L$997,Sheet1!$F$4:$F$997,B309,Sheet1!$Z$4:$Z$997,$H$3)+F309/SUMIFS(Sheet1!$H$4:$H$997,Sheet1!$F$4:$F$997,B309,Sheet1!$Z$4:$Z$997,$H$3),F309/D309),\"\")","v":""},""]
[null,null,null,null,null,null,null,{"$f":"SUMIFS(Sheet1!$H$4:$H$1497,Sheet1!$F$4:$F$1497,B311,Sheet1!$Z$4:$Z$1497,$H$3)","v":0},{"$f":"SUMIFS(Sheet1!$J$4:$J$15,Sheet1!$F$4:$F$15,B311,Sheet1!$Z$4:$Z$15,$H$3)","v":0},{"$f":"SUMIFS(Sheet1!$H$4:$H$1497,Sheet1!$F$4:$F$1497,B311,Sheet1!$Z$4:$Z$1497,$J$3)","v":0},null,null,"",{"$f":"IFERROR(IF(B310<\"\",SUMIFS(Sheet1!$L$4:$L$997,Sheet1!$F$4:$F$997,B310,Sheet1!$Z$4:$Z$997,$H$3)+F310/SUMIFS(Sheet1!$H$4:$H$997,Sheet1!$F$4:$F$997,B310,Sheet1!$Z$4:$Z$997,$H$3),F310/D310),\"\")","v":""},""]
[null,null,null,null,null,null,null,{"$f":"SUMIFS(Sheet1!$H$4:$H$1497,Sheet1!$F$4:$F$1497,B312,Sheet1!$Z$4:$Z$1497,$H$3)","v":0},{"$f":"SUMIFS(Sheet1!$J$4:$J$15,Sheet1!$F$4:$F$15,B312,Sheet1!$Z$4:$Z$15,$H$3)","v":0},{"$f":"SUMIFS(Sheet1!$H$4:$H$1497,Sheet1!$F$4:$F$1497,B312,Sheet1!$Z$4:$Z$1497,$J$3)","v":0},null,null,"",{"$f":"IFERROR(IF(B311<\"\",SUMIFS(Sheet1!$L$4:$L$997,Sheet1!$F$4:$F$997,B311,Sheet1!$Z$4:$Z$997,$H$3)+F311/SUMIFS(Sheet1!$H$4:$H$997,Sheet1!$F$4:$F$997,B311,Sheet1!$Z$4:$Z$997,$H$3),F311/D311),\"\")","v":""},""]
[null,null,null,null,null,null,null,{"$f":"SUMIFS(Sheet1!$H$4:$H$1497,Sheet1!$F$4:$F$1497,B313,Sheet1!$Z$4:$Z$1497,$H$3)","v":0},{"$f":"SUMIFS(Sheet1!$J$4:$J$15,Sheet1!$F$4:$F$15,B313,Sheet1!$Z$4:$Z$15,$H$3)","v":0},{"$f":"SUMIFS(Sheet1!$H$4:$H$1497,Sheet1!$F$4:$F$1497,B313,Sheet1!$Z$4:$Z$1497,$J$3)","v":0},null,null,"",{"$f":"IFERROR(IF(B312<\"\",SUMIFS(Sheet1!$L$4:$L$997,Sheet1!$F$4:$F$997,B312,Sheet1!$Z$4:$Z$997,$H$3)+F312/SUMIFS(Sheet1!$H$4:$H$997,Sheet1!$F$4:$F$997,B312,Sheet1!$Z$4:$Z$997,$H$3),F312/D312),\"\")","v":""},""]
[null,null,null,null,null,null,null,{"$f":"SUMIFS(Sheet1!$H$4:$H$1497,Sheet1!$F$4:$F$1497,B314,Sheet1!$Z$4:$Z$1497,$H$3)","v":0},{"$f":"SUMIFS(Sheet1!$J$4:$J$15,Sheet1!$F$4:$F$15,B314,Sheet1!$Z$4:$Z$15,$H$3)","v":0},{"$f":"SUMIFS(Sheet1!$H$4:$H$1497,Sheet1!$F$4:$F$1497,B314,Sheet1!$Z$4:$Z$1497,$J$3)","v":0},null,null,"",{"$f":"IFERROR(IF(B313<\"\",SUMIFS(Sheet1!$L$4:$L$997,Sheet1!$F$4:$F$997,B313,Sheet1!$Z$4:$Z$997,$H$3)+F313/SUMIFS(Sheet1!$H$4:$H$997,Sheet1!$F$4:$F$997,B313,Sheet1!$Z$4:$Z$997,$H$3),F313/D313),\"\")","v":""},""]
[null,null,null,null,null,null,null,{"$f":"SUMIFS(Sheet1!$H$4:$H$1497,Sheet1!$F$4:$F$1497,B315,Sheet1!$Z$4:$Z$1497,$H$3)","v":0},{"$f":"SUMIFS(Sheet1!$J$4:$J$15,Sheet1!$F$4:$F$15,B315,Sheet1!$Z$4:$Z$15,$H$3)","v":0},{"$f":"SUMIFS(Sheet1!$H$4:$H$1497,Sheet1!$F$4:$F$1497,B315,Sheet1!$Z$4:$Z$1497,$J$3)","v":0},null,null,"",{"$f":"IFERROR(IF(B314<\"\",SUMIFS(Sheet1!$L$4:$L$997,Sheet1!$F$4:$F$997,B314,Sheet1!$Z$4:$Z$997,$H$3)+F314/SUMIFS(Sheet1!$H$4:$H$997,Sheet1!$F$4:$F$997,B314,Sheet1!$Z$4:$Z$997,$H$3),F314/D314),\"\")","v":""},""]
[null,null,null,null,null,null,null,{"$f":"SUMIFS(Sheet1!$H$4:$H$1497,Sheet1!$F$4:$F$1497,B316,Sheet1!$Z$4:$Z$1497,$H$3)","v":0},{"$f":"SUMIFS(Sheet1!$J$4:$J$15,Sheet1!$F$4:$F$15,B316,Sheet1!$Z$4:$Z$15,$H$3)","v":0},{"$f":"SUMIFS(Sheet1!$H$4:$H$1497,Sheet1!$F$4:$F$1497,B316,Sheet1!$Z$4:$Z$1497,$J$3)","v":0},null,null,"",{"$f":"IFERROR(IF(B315<\"\",SUMIFS(Sheet1!$L$4:$L$997,Sheet1!$F$4:$F$997,B315,Sheet1!$Z$4:$Z$997,$H$3)+F315/SUMIFS(Sheet1!$H$4:$H$997,Sheet1!$F$4:$F$997,B315,Sheet1!$Z$4:$Z$997,$H$3),F315/D315),\"\")","v":""},""]
[null,null,null,null,null,null,null,{"$f":"SUMIFS(Sheet1!$H$4:$H$1497,Sheet1!$F$4:$F$1497,B317,Sheet1!$Z$4:$Z$1497,$H$3)","v":0},{"$f":"SUMIFS(Sheet1!$J$4:$J$15,Sheet1!$F$4:$F$15,B317,Sheet1!$Z$4:$Z$15,$H$3)","v":0},{"$f":"SUMIFS(Sheet1!$H$4:$H$1497,Sheet1!$F$4:$F$1497,B317,Sheet1!$Z$4:$Z$1497,$J$3)","v":0},null,null,"",{"$f":"IFERROR(IF(B316<\"\",SUMIFS(Sheet1!$L$4:$L$997,Sheet1!$F$4:$F$997,B316,Sheet1!$Z$4:$Z$997,$H$3)+F316/SUMIFS(Sheet1!$H$4:$H$997,Sheet1!$F$4:$F$997,B316,Sheet1!$Z$4:$Z$997,$H$3),F316/D316),\"\")","v":""},""]
[null,null,null,null,null,null,null,{"$f":"SUMIFS(Sheet1!$H$4:$H$1497,Sheet1!$F$4:$F$1497,B318,Sheet1!$Z$4:$Z$1497,$H$3)","v":0},{"$f":"SUMIFS(Sheet1!$J$4:$J$15,Sheet1!$F$4:$F$15,B318,Sheet1!$Z$4:$Z$15,$H$3)","v":0},{"$f":"SUMIFS(Sheet1!$H$4:$H$1497,Sheet1!$F$4:$F$1497,B318,Sheet1!$Z$4:$Z$1497,$J$3)","v":0},null,null,"",{"$f":"IFERROR(IF(B317<\"\",SUMIFS(Sheet1!$L$4:$L$997,Sheet1!$F$4:$F$997,B317,Sheet1!$Z$4:$Z$997,$H$3)+F317/SUMIFS(Sheet1!$H$4:$H$997,Sheet1!$F$4:$F$997,B317,Sheet1!$Z$4:$Z$997,$H$3),F317/D317),\"\")","v":""},""]
[null,null,null,null,null,null,null,{"$f":"SUMIFS(Sheet1!$H$4:$H$1497,Sheet1!$F$4:$F$1497,B319,Sheet1!$Z$4:$Z$1497,$H$3)","v":0},{"$f":"SUMIFS(Sheet1!$J$4:$J$15,Sheet1!$F$4:$F$15,B319,Sheet1!$Z$4:$Z$15,$H$3)","v":0},{"$f":"SUMIFS(Sheet1!$H$4:$H$1497,Sheet1!$F$4:$F$1497,B319,Sheet1!$Z$4:$Z$1497,$J$3)","v":0},null,null,"",{"$f":"IFERROR(IF(B318<\"\",SUMIFS(Sheet1!$L$4:$L$997,Sheet1!$F$4:$F$997,B318,Sheet1!$Z$4:$Z$997,$H$3)+F318/SUMIFS(Sheet1!$H$4:$H$997,Sheet1!$F$4:$F$997,B318,Sheet1!$Z$4:$Z$997,$H$3),F318/D318),\"\")","v":""},""]
[null,null,null,null,null,null,null,{"$f":"SUMIFS(Sheet1!$H$4:$H$1497,Sheet1!$F$4:$F$1497,B320,Sheet1!$Z$4:$Z$1497,$H$3)","v":0},{"$f":"SUMIFS(Sheet1!$J$4:$J$15,Sheet1!$F$4:$F$15,B320,Sheet1!$Z$4:$Z$15,$H$3)","v":0},{"$f":"SUMIFS(Sheet1!$H$4:$H$1497,Sheet1!$F$4:$F$1497,B320,Sheet1!$Z$4:$Z$1497,$J$3)","v":0},null,null,"",{"$f":"IFERROR(IF(B319<\"\",SUMIFS(Sheet1!$L$4:$L$997,Sheet1!$F$4:$F$997,B319,Sheet1!$Z$4:$Z$997,$H$3)+F319/SUMIFS(Sheet1!$H$4:$H$997,Sheet1!$F$4:$F$997,B319,Sheet1!$Z$4:$Z$997,$H$3),F319/D319),\"\")","v":""},""]
[null,null,null,null,null,null,null,{"$f":"SUMIFS(Sheet1!$H$4:$H$1497,Sheet1!$F$4:$F$1497,B321,Sheet1!$Z$4:$Z$1497,$H$3)","v":0},{"$f":"SUMIFS(Sheet1!$J$4:$J$15,Sheet1!$F$4:$F$15,B321,Sheet1!$Z$4:$Z$15,$H$3)","v":0},{"$f":"SUMIFS(Sheet1!$H$4:$H$1497,Sheet1!$F$4:$F$1497,B321,Sheet1!$Z$4:$Z$1497,$J$3)","v":0},null,null,"",{"$f":"IFERROR(IF(B320<\"\",SUMIFS(Sheet1!$L$4:$L$997,Sheet1!$F$4:$F$997,B320,Sheet1!$Z$4:$Z$997,$H$3)+F320/SUMIFS(Sheet1!$H$4:$H$997,Sheet1!$F$4:$F$997,B320,Sheet1!$Z$4:$Z$997,$H$3),F320/D320),\"\")","v":""},""]
[null,null,null,null,null,null,null,{"$f":"SUMIFS(Sheet1!$H$4:$H$1497,Sheet1!$F$4:$F$1497,B322,Sheet1!$Z$4:$Z$1497,$H$3)","v":0},{"$f":"SUMIFS(Sheet1!$J$4:$J$15,Sheet1!$F$4:$F$15,B322,Sheet1!$Z$4:$Z$15,$H$3)","v":0},{"$f":"SUMIFS(Sheet1!$H$4:$H$1497,Sheet1!$F$4:$F$1497,B322,Sheet1!$Z$4:$Z$1497,$J$3)","v":0},null,null,"",{"$f":"IFERROR(IF(B321<\"\",SUMIFS(Sheet1!$L$4:$L$997,Sheet1!$F$4:$F$997,B321,Sheet1!$Z$4:$Z$997,$H$3)+F321/SUMIFS(Sheet1!$H$4:$H$997,Sheet1!$F$4:$F$997,B321,Sheet1!$Z$4:$Z$997,$H$3),F321/D321),\"\")","v":""},""]
[null,null,null,null,null,null,null,{"$f":"SUMIFS(Sheet1!$H$4:$H$1497,Sheet1!$F$4:$F$1497,B323,Sheet1!$Z$4:$Z$1497,$H$3)","v":0},{"$f":"SUMIFS(Sheet1!$J$4:$J$15,Sheet1!$F$4:$F$15,B323,Sheet1!$Z$4:$Z$15,$H$3)","v":0},{"$f":"SUMIFS(Sheet1!$H$4:$H$1497,Sheet1!$F$4:$F$1497,B323,Sheet1!$Z$4:$Z$1497,$J$3)","v":0},null,null,"",{"$f":"IFERROR(IF(B322<\"\",SUMIFS(Sheet1!$L$4:$L$997,Sheet1!$F$4:$F$997,B322,Sheet1!$Z$4:$Z$997,$H$3)+F322/SUMIFS(Sheet1!$H$4:$H$997,Sheet1!$F$4:$F$997,B322,Sheet1!$Z$4:$Z$997,$H$3),F322/D322),\"\")","v":""},""]
[null,null,null,null,null,null,null,{"$f":"SUMIFS(Sheet1!$H$4:$H$1497,Sheet1!$F$4:$F$1497,B324,Sheet1!$Z$4:$Z$1497,$H$3)","v":0},{"$f":"SUMIFS(Sheet1!$J$4:$J$15,Sheet1!$F$4:$F$15,B324,Sheet1!$Z$4:$Z$15,$H$3)","v":0},{"$f":"SUMIFS(Sheet1!$H$4:$H$1497,Sheet1!$F$4:$F$1497,B324,Sheet1!$Z$4:$Z$1497,$J$3)","v":0},null,null,"",{"$f":"IFERROR(IF(B323<\"\",SUMIFS(Sheet1!$L$4:$L$997,Sheet1!$F$4:$F$997,B323,Sheet1!$Z$4:$Z$997,$H$3)+F323/SUMIFS(Sheet1!$H$4:$H$997,Sheet1!$F$4:$F$997,B323,Sheet1!$Z$4:$Z$997,$H$3),F323/D323),\"\")","v":""},""]
[null,null,null,null,null,null,null,{"$f":"SUMIFS(Sheet1!$H$4:$H$1497,Sheet1!$F$4:$F$1497,B325,Sheet1!$Z$4:$Z$1497,$H$3)","v":0},{"$f":"SUMIFS(Sheet1!$J$4:$J$15,Sheet1!$F$4:$F$15,B325,Sheet1!$Z$4:$Z$15,$H$3)","v":0},{"$f":"SUMIFS(Sheet1!$H$4:$H$1497,Sheet1!$F$4:$F$1497,B325,Sheet1!$Z$4:$Z$1497,$J$3)","v":0},null,null,"",{"$f":"IFERROR(IF(B324<\"\",SUMIFS(Sheet1!$L$4:$L$997,Sheet1!$F$4:$F$997,B324,Sheet1!$Z$4:$Z$997,$H$3)+F324/SUMIFS(Sheet1!$H$4:$H$997,Sheet1!$F$4:$F$997,B324,Sheet1!$Z$4:$Z$997,$H$3),F324/D324),\"\")","v":""},""]
[null,null,null,null,null,null,null,{"$f":"SUMIFS(Sheet1!$H$4:$H$1497,Sheet1!$F$4:$F$1497,B326,Sheet1!$Z$4:$Z$1497,$H$3)","v":0},{"$f":"SUMIFS(Sheet1!$J$4:$J$15,Sheet1!$F$4:$F$15,B326,Sheet1!$Z$4:$Z$15,$H$3)","v":0},{"$f":"SUMIFS(Sheet1!$H$4:$H$1497,Sheet1!$F$4:$F$1497,B326,Sheet1!$Z$4:$Z$1497,$J$3)","v":0},null,null,{"$f":"IF(L325<>\"\",IF(L325>=K325,\"مطلوب\",\"\"),\"\")","v":""},{"$f":"IFERROR(IF(B325<\"\",SUMIFS(Sheet1!$L$4:$L$997,Sheet1!$F$4:$F$997,B325,Sheet1!$Z$4:$Z$997,$H$3)+F325/SUMIFS(Sheet1!$H$4:$H$997,Sheet1!$F$4:$F$997,B325,Sheet1!$Z$4:$Z$997,$H$3),F325/D325),\"\")","v":""},{"$f":"IFERROR(SUMPRODUCT(K325*N325),\"\")","v":""}]
[null,null,null,null,null,null,null,{"$f":"SUMIFS(Sheet1!$H$4:$H$1497,Sheet1!$F$4:$F$1497,B327,Sheet1!$Z$4:$Z$1497,$H$3)","v":0},{"$f":"SUMIFS(Sheet1!$J$4:$J$15,Sheet1!$F$4:$F$15,B327,Sheet1!$Z$4:$Z$15,$H$3)","v":0},{"$f":"SUMIFS(Sheet1!$H$4:$H$1497,Sheet1!$F$4:$F$1497,B327,Sheet1!$Z$4:$Z$1497,$J$3)","v":0},null,null,"",{"$f":"IFERROR(IF(B326<\"\",SUMIFS(Sheet1!$L$4:$L$997,Sheet1!$F$4:$F$997,B326,Sheet1!$Z$4:$Z$997,$H$3)+F326/SUMIFS(Sheet1!$H$4:$H$997,Sheet1!$F$4:$F$997,B326,Sheet1!$Z$4:$Z$997,$H$3),F326/D326),\"\")","v":""},""]
[null,null,null,null,null,null,null,{"$f":"SUMIFS(Sheet1!$H$4:$H$1497,Sheet1!$F$4:$F$1497,B328,Sheet1!$Z$4:$Z$1497,$H$3)","v":0},{"$f":"SUMIFS(Sheet1!$J$4:$J$15,Sheet1!$F$4:$F$15,B328,Sheet1!$Z$4:$Z$15,$H$3)","v":0},{"$f":"SUMIFS(Sheet1!$H$4:$H$1497,Sheet1!$F$4:$F$1497,B328,Sheet1!$Z$4:$Z$1497,$J$3)","v":0},null,null,"",{"$f":"IFERROR(IF(B327<\"\",SUMIFS(Sheet1!$L$4:$L$997,Sheet1!$F$4:$F$997,B327,Sheet1!$Z$4:$Z$997,$H$3)+F327/SUMIFS(Sheet1!$H$4:$H$997,Sheet1!$F$4:$F$997,B327,Sheet1!$Z$4:$Z$997,$H$3),F327/D327),\"\")","v":""},""]
[null,null,null,null,null,null,null,{"$f":"SUMIFS(Sheet1!$H$4:$H$1497,Sheet1!$F$4:$F$1497,B329,Sheet1!$Z$4:$Z$1497,$H$3)","v":0},{"$f":"SUMIFS(Sheet1!$J$4:$J$15,Sheet1!$F$4:$F$15,B329,Sheet1!$Z$4:$Z$15,$H$3)","v":0},{"$f":"SUMIFS(Sheet1!$H$4:$H$1497,Sheet1!$F$4:$F$1497,B329,Sheet1!$Z$4:$Z$1497,$J$3)","v":0},null,null,"",{"$f":"IFERROR(IF(B328<\"\",SUMIFS(Sheet1!$L$4:$L$997,Sheet1!$F$4:$F$997,B328,Sheet1!$Z$4:$Z$997,$H$3)+F328/SUMIFS(Sheet1!$H$4:$H$997,Sheet1!$F$4:$F$997,B328,Sheet1!$Z$4:$Z$997,$H$3),F328/D328),\"\")","v":""},""]
[null,null,null,null,null,null,null,{"$f":"SUMIFS(Sheet1!$H$4:$H$1497,Sheet1!$F$4:$F$1497,B330,Sheet1!$Z$4:$Z$1497,$H$3)","v":0},{"$f":"SUMIFS(Sheet1!$J$4:$J$15,Sheet1!$F$4:$F$15,B330,Sheet1!$Z$4:$Z$15,$H$3)","v":0},{"$f":"SUMIFS(Sheet1!$H$4:$H$1497,Sheet1!$F$4:$F$1497,B330,Sheet1!$Z$4:$Z$1497,$J$3)","v":0},null,null,"",{"$f":"IFERROR(IF(B329<\"\",SUMIFS(Sheet1!$L$4:$L$997,Sheet1!$F$4:$F$997,B329,Sheet1!$Z$4:$Z$997,$H$3)+F329/SUMIFS(Sheet1!$H$4:$H$997,Sheet1!$F$4:$F$997,B329,Sheet1!$Z$4:$Z$997,$H$3),F329/D329),\"\")","v":""},""]
[null,null,null,null,null,null,null,{"$f":"SUMIFS(Sheet1!$H$4:$H$1497,Sheet1!$F$4:$F$1497,B331,Sheet1!$Z$4:$Z$1497,$H$3)","v":0},{"$f":"SUMIFS(Sheet1!$J$4:$J$15,Sheet1!$F$4:$F$15,B331,Sheet1!$Z$4:$Z$15,$H$3)","v":0},{"$f":"SUMIFS(Sheet1!$H$4:$H$1497,Sheet1!$F$4:$F$1497,B331,Sheet1!$Z$4:$Z$1497,$J$3)","v":0},null,null,"",{"$f":"IFERROR(IF(B330<\"\",SUMIFS(Sheet1!$L$4:$L$997,Sheet1!$F$4:$F$997,B330,Sheet1!$Z$4:$Z$997,$H$3)+F330/SUMIFS(Sheet1!$H$4:$H$997,Sheet1!$F$4:$F$997,B330,Sheet1!$Z$4:$Z$997,$H$3),F330/D330),\"\")","v":""},""]
[null,null,null,null,null,null,null,{"$f":"SUMIFS(Sheet1!$H$4:$H$1497,Sheet1!$F$4:$F$1497,B332,Sheet1!$Z$4:$Z$1497,$H$3)","v":0},{"$f":"SUMIFS(Sheet1!$J$4:$J$15,Sheet1!$F$4:$F$15,B332,Sheet1!$Z$4:$Z$15,$H$3)","v":0},{"$f":"SUMIFS(Sheet1!$H$4:$H$1497,Sheet1!$F$4:$F$1497,B332,Sheet1!$Z$4:$Z$1497,$J$3)","v":0},null,null,"",{"$f":"IFERROR(IF(B331<\"\",SUMIFS(Sheet1!$L$4:$L$997,Sheet1!$F$4:$F$997,B331,Sheet1!$Z$4:$Z$997,$H$3)+F331/SUMIFS(Sheet1!$H$4:$H$997,Sheet1!$F$4:$F$997,B331,Sheet1!$Z$4:$Z$997,$H$3),F331/D331),\"\")","v":""},""]
[null,null,null,null,null,null,null,{"$f":"SUMIFS(Sheet1!$H$4:$H$1497,Sheet1!$F$4:$F$1497,B333,Sheet1!$Z$4:$Z$1497,$H$3)","v":0},{"$f":"SUMIFS(Sheet1!$J$4:$J$15,Sheet1!$F$4:$F$15,B333,Sheet1!$Z$4:$Z$15,$H$3)","v":0},{"$f":"SUMIFS(Sheet1!$H$4:$H$1497,Sheet1!$F$4:$F$1497,B333,Sheet1!$Z$4:$Z$1497,$J$3)","v":0},null,null,"",{"$f":"IFERROR(IF(B332<\"\",SUMIFS(Sheet1!$L$4:$L$997,Sheet1!$F$4:$F$997,B332,Sheet1!$Z$4:$Z$997,$H$3)+F332/SUMIFS(Sheet1!$H$4:$H$997,Sheet1!$F$4:$F$997,B332,Sheet1!$Z$4:$Z$997,$H$3),F332/D332),\"\")","v":""},""]
[null,null,null,null,null,null,null,{"$f":"SUMIFS(Sheet1!$H$4:$H$1497,Sheet1!$F$4:$F$1497,B334,Sheet1!$Z$4:$Z$1497,$H$3)","v":0},{"$f":"SUMIFS(Sheet1!$J$4:$J$15,Sheet1!$F$4:$F$15,B334,Sheet1!$Z$4:$Z$15,$H$3)","v":0},{"$f":"SUMIFS(Sheet1!$H$4:$H$1497,Sheet1!$F$4:$F$1497,B334,Sheet1!$Z$4:$Z$1497,$J$3)","v":0},null,null,"",{"$f":"IFERROR(IF(B333<\"\",SUMIFS(Sheet1!$L$4:$L$997,Sheet1!$F$4:$F$997,B333,Sheet1!$Z$4:$Z$997,$H$3)+F333/SUMIFS(Sheet1!$H$4:$H$997,Sheet1!$F$4:$F$997,B333,Sheet1!$Z$4:$Z$997,$H$3),F333/D333),\"\")","v":""},""]
[null,null,null,null,null,null,null,{"$f":"SUMIFS(Sheet1!$H$4:$H$1497,Sheet1!$F$4:$F$1497,B335,Sheet1!$Z$4:$Z$1497,$H$3)","v":0},{"$f":"SUMIFS(Sheet1!$J$4:$J$15,Sheet1!$F$4:$F$15,B335,Sheet1!$Z$4:$Z$15,$H$3)","v":0},{"$f":"SUMIFS(Sheet1!$H$4:$H$1497,Sheet1!$F$4:$F$1497,B335,Sheet1!$Z$4:$Z$1497,$J$3)","v":0},null,null,"",{"$f":"IFERROR(IF(B334<\"\",SUMIFS(Sheet1!$L$4:$L$997,Sheet1!$F$4:$F$997,B334,Sheet1!$Z$4:$Z$997,$H$3)+F334/SUMIFS(Sheet1!$H$4:$H$997,Sheet1!$F$4:$F$997,B334,Sheet1!$Z$4:$Z$997,$H$3),F334/D334),\"\")","v":""},""]
[null,null,null,null,null,null,null,{"$f":"SUMIFS(Sheet1!$H$4:$H$1497,Sheet1!$F$4:$F$1497,B336,Sheet1!$Z$4:$Z$1497,$H$3)","v":0},{"$f":"SUMIFS(Sheet1!$J$4:$J$15,Sheet1!$F$4:$F$15,B336,Sheet1!$Z$4:$Z$15,$H$3)","v":0},{"$f":"SUMIFS(Sheet1!$H$4:$H$1497,Sheet1!$F$4:$F$1497,B336,Sheet1!$Z$4:$Z$1497,$J$3)","v":0},null,null,"",{"$f":"IFERROR(IF(B335<\"\",SUMIFS(Sheet1!$L$4:$L$997,Sheet1!$F$4:$F$997,B335,Sheet1!$Z$4:$Z$997,$H$3)+F335/SUMIFS(Sheet1!$H$4:$H$997,Sheet1!$F$4:$F$997,B335,Sheet1!$Z$4:$Z$997,$H$3),F335/D335),\"\")","v":""},""]
[null,null,null,null,null,null,null,{"$f":"SUMIFS(Sheet1!$H$4:$H$1497,Sheet1!$F$4:$F$1497,B337,Sheet1!$Z$4:$Z$1497,$H$3)","v":0},{"$f":"SUMIFS(Sheet1!$J$4:$J$15,Sheet1!$F$4:$F$15,B337,Sheet1!$Z$4:$Z$15,$H$3)","v":0},{"$f":"SUMIFS(Sheet1!$H$4:$H$1497,Sheet1!$F$4:$F$1497,B337,Sheet1!$Z$4:$Z$1497,$J$3)","v":0},null,null,"",{"$f":"IFERROR(IF(B336<\"\",SUMIFS(Sheet1!$L$4:$L$997,Sheet1!$F$4:$F$997,B336,Sheet1!$Z$4:$Z$997,$H$3)+F336/SUMIFS(Sheet1!$H$4:$H$997,Sheet1!$F$4:$F$997,B336,Sheet1!$Z$4:$Z$997,$H$3),F336/D336),\"\")","v":""},""]
[null,null,null,null,null,null,null,{"$f":"SUMIFS(Sheet1!$H$4:$H$1497,Sheet1!$F$4:$F$1497,B338,Sheet1!$Z$4:$Z$1497,$H$3)","v":0},{"$f":"SUMIFS(Sheet1!$J$4:$J$15,Sheet1!$F$4:$F$15,B338,Sheet1!$Z$4:$Z$15,$H$3)","v":0},{"$f":"SUMIFS(Sheet1!$H$4:$H$1497,Sheet1!$F$4:$F$1497,B338,Sheet1!$Z$4:$Z$1497,$J$3)","v":0},null,null,"",{"$f":"IFERROR(IF(B337<\"\",SUMIFS(Sheet1!$L$4:$L$997,Sheet1!$F$4:$F$997,B337,Sheet1!$Z$4:$Z$997,$H$3)+F337/SUMIFS(Sheet1!$H$4:$H$997,Sheet1!$F$4:$F$997,B337,Sheet1!$Z$4:$Z$997,$H$3),F337/D337),\"\")","v":""},""]
[null,null,null,null,null,null,null,{"$f":"SUMIFS(Sheet1!$H$4:$H$1497,Sheet1!$F$4:$F$1497,B339,Sheet1!$Z$4:$Z$1497,$H$3)","v":0},{"$f":"SUMIFS(Sheet1!$J$4:$J$15,Sheet1!$F$4:$F$15,B339,Sheet1!$Z$4:$Z$15,$H$3)","v":0},{"$f":"SUMIFS(Sheet1!$H$4:$H$1497,Sheet1!$F$4:$F$1497,B339,Sheet1!$Z$4:$Z$1497,$J$3)","v":0},null,null,"",{"$f":"IFERROR(IF(B338<\"\",SUMIFS(Sheet1!$L$4:$L$997,Sheet1!$F$4:$F$997,B338,Sheet1!$Z$4:$Z$997,$H$3)+F338/SUMIFS(Sheet1!$H$4:$H$997,Sheet1!$F$4:$F$997,B338,Sheet1!$Z$4:$Z$997,$H$3),F338/D338),\"\")","v":""},""]
[null,null,null,null,null,null,null,{"$f":"SUMIFS(Sheet1!$H$4:$H$1497,Sheet1!$F$4:$F$1497,B340,Sheet1!$Z$4:$Z$1497,$H$3)","v":0},{"$f":"SUMIFS(Sheet1!$J$4:$J$15,Sheet1!$F$4:$F$15,B340,Sheet1!$Z$4:$Z$15,$H$3)","v":0},{"$f":"SUMIFS(Sheet1!$H$4:$H$1497,Sheet1!$F$4:$F$1497,B340,Sheet1!$Z$4:$Z$1497,$J$3)","v":0},null,null,"",{"$f":"IFERROR(IF(B339<\"\",SUMIFS(Sheet1!$L$4:$L$997,Sheet1!$F$4:$F$997,B339,Sheet1!$Z$4:$Z$997,$H$3)+F339/SUMIFS(Sheet1!$H$4:$H$997,Sheet1!$F$4:$F$997,B339,Sheet1!$Z$4:$Z$997,$H$3),F339/D339),\"\")","v":""},""]
[null,null,null,null,null,null,null,{"$f":"SUMIFS(Sheet1!$H$4:$H$1497,Sheet1!$F$4:$F$1497,B341,Sheet1!$Z$4:$Z$1497,$H$3)","v":0},{"$f":"SUMIFS(Sheet1!$J$4:$J$15,Sheet1!$F$4:$F$15,B341,Sheet1!$Z$4:$Z$15,$H$3)","v":0},{"$f":"SUMIFS(Sheet1!$H$4:$H$1497,Sheet1!$F$4:$F$1497,B341,Sheet1!$Z$4:$Z$1497,$J$3)","v":0},null,null,"",{"$f":"IFERROR(IF(B340<\"\",SUMIFS(Sheet1!$L$4:$L$997,Sheet1!$F$4:$F$997,B340,Sheet1!$Z$4:$Z$997,$H$3)+F340/SUMIFS(Sheet1!$H$4:$H$997,Sheet1!$F$4:$F$997,B340,Sheet1!$Z$4:$Z$997,$H$3),F340/D340),\"\")","v":""},""]
[null,null,null,null,null,null,null,{"$f":"SUMIFS(Sheet1!$H$4:$H$1497,Sheet1!$F$4:$F$1497,B342,Sheet1!$Z$4:$Z$1497,$H$3)","v":0},{"$f":"SUMIFS(Sheet1!$J$4:$J$15,Sheet1!$F$4:$F$15,B342,Sheet1!$Z$4:$Z$15,$H$3)","v":0},{"$f":"SUMIFS(Sheet1!$H$4:$H$1497,Sheet1!$F$4:$F$1497,B342,Sheet1!$Z$4:$Z$1497,$J$3)","v":0},null,null,"",{"$f":"IFERROR(IF(B341<\"\",SUMIFS(Sheet1!$L$4:$L$997,Sheet1!$F$4:$F$997,B341,Sheet1!$Z$4:$Z$997,$H$3)+F341/SUMIFS(Sheet1!$H$4:$H$997,Sheet1!$F$4:$F$997,B341,Sheet1!$Z$4:$Z$997,$H$3),F341/D341),\"\")","v":""},""]
[null,null,null,null,null,null,null,{"$f":"SUMIFS(Sheet1!$H$4:$H$1497,Sheet1!$F$4:$F$1497,B343,Sheet1!$Z$4:$Z$1497,$H$3)","v":0},{"$f":"SUMIFS(Sheet1!$J$4:$J$15,Sheet1!$F$4:$F$15,B343,Sheet1!$Z$4:$Z$15,$H$3)","v":0},{"$f":"SUMIFS(Sheet1!$H$4:$H$1497,Sheet1!$F$4:$F$1497,B343,Sheet1!$Z$4:$Z$1497,$J$3)","v":0},null,null,"",{"$f":"IFERROR(IF(B342<\"\",SUMIFS(Sheet1!$L$4:$L$997,Sheet1!$F$4:$F$997,B342,Sheet1!$Z$4:$Z$997,$H$3)+F342/SUMIFS(Sheet1!$H$4:$H$997,Sheet1!$F$4:$F$997,B342,Sheet1!$Z$4:$Z$997,$H$3),F342/D342),\"\")","v":""},""]
[null,null,null,null,null,null,null,{"$f":"SUMIFS(Sheet1!$H$4:$H$1497,Sheet1!$F$4:$F$1497,B344,Sheet1!$Z$4:$Z$1497,$H$3)","v":0},{"$f":"SUMIFS(Sheet1!$J$4:$J$15,Sheet1!$F$4:$F$15,B344,Sheet1!$Z$4:$Z$15,$H$3)","v":0},{"$f":"SUMIFS(Sheet1!$H$4:$H$1497,Sheet1!$F$4:$F$1497,B344,Sheet1!$Z$4:$Z$1497,$J$3)","v":0},null,null,"",{"$f":"IFERROR(IF(B343<\"\",SUMIFS(Sheet1!$L$4:$L$997,Sheet1!$F$4:$F$997,B343,Sheet1!$Z$4:$Z$997,$H$3)+F343/SUMIFS(Sheet1!$H$4:$H$997,Sheet1!$F$4:$F$997,B343,Sheet1!$Z$4:$Z$997,$H$3),F343/D343),\"\")","v":""},""]
[null,null,null,null,null,null,null,{"$f":"SUMIFS(Sheet1!$H$4:$H$1497,Sheet1!$F$4:$F$1497,B345,Sheet1!$Z$4:$Z$1497,$H$3)","v":0},{"$f":"SUMIFS(Sheet1!$J$4:$J$15,Sheet1!$F$4:$F$15,B345,Sheet1!$Z$4:$Z$15,$H$3)","v":0},{"$f":"SUMIFS(Sheet1!$H$4:$H$1497,Sheet1!$F$4:$F$1497,B345,Sheet1!$Z$4:$Z$1497,$J$3)","v":0},null,null,"",{"$f":"IFERROR(IF(B344<\"\",SUMIFS(Sheet1!$L$4:$L$997,Sheet1!$F$4:$F$997,B344,Sheet1!$Z$4:$Z$997,$H$3)+F344/SUMIFS(Sheet1!$H$4:$H$997,Sheet1!$F$4:$F$997,B344,Sheet1!$Z$4:$Z$997,$H$3),F344/D344),\"\")","v":""},""]
[null,null,null,null,null,null,null,{"$f":"SUMIFS(Sheet1!$H$4:$H$1497,Sheet1!$F$4:$F$1497,B346,Sheet1!$Z$4:$Z$1497,$H$3)","v":0},{"$f":"SUMIFS(Sheet1!$J$4:$J$15,Sheet1!$F$4:$F$15,B346,Sheet1!$Z$4:$Z$15,$H$3)","v":0},{"$f":"SUMIFS(Sheet1!$H$4:$H$1497,Sheet1!$F$4:$F$1497,B346,Sheet1!$Z$4:$Z$1497,$J$3)","v":0},null,null,"",{"$f":"IFERROR(IF(B345<\"\",SUMIFS(Sheet1!$L$4:$L$997,Sheet1!$F$4:$F$997,B345,Sheet1!$Z$4:$Z$997,$H$3)+F345/SUMIFS(Sheet1!$H$4:$H$997,Sheet1!$F$4:$F$997,B345,Sheet1!$Z$4:$Z$997,$H$3),F345/D345),\"\")","v":""},""]
[null,null,null,null,null,null,null,{"$f":"SUMIFS(Sheet1!$H$4:$H$1497,Sheet1!$F$4:$F$1497,B347,Sheet1!$Z$4:$Z$1497,$H$3)","v":0},{"$f":"SUMIFS(Sheet1!$J$4:$J$15,Sheet1!$F$4:$F$15,B347,Sheet1!$Z$4:$Z$15,$H$3)","v":0},{"$f":"SUMIFS(Sheet1!$H$4:$H$1497,Sheet1!$F$4:$F$1497,B347,Sheet1!$Z$4:$Z$1497,$J$3)","v":0},null,null,"",{"$f":"IFERROR(IF(B346<\"\",SUMIFS(Sheet1!$L$4:$L$997,Sheet1!$F$4:$F$997,B346,Sheet1!$Z$4:$Z$997,$H$3)+F346/SUMIFS(Sheet1!$H$4:$H$997,Sheet1!$F$4:$F$997,B346,Sheet1!$Z$4:$Z$997,$H$3),F346/D346),\"\")","v":""},""]
[null,null,null,null,null,null,null,{"$f":"SUMIFS(Sheet1!$H$4:$H$1497,Sheet1!$F$4:$F$1497,B348,Sheet1!$Z$4:$Z$1497,$H$3)","v":0},{"$f":"SUMIFS(Sheet1!$J$4:$J$15,Sheet1!$F$4:$F$15,B348,Sheet1!$Z$4:$Z$15,$H$3)","v":0},{"$f":"SUMIFS(Sheet1!$H$4:$H$1497,Sheet1!$F$4:$F$1497,B348,Sheet1!$Z$4:$Z$1497,$J$3)","v":0},null,null,"",{"$f":"IFERROR(IF(B347<\"\",SUMIFS(Sheet1!$L$4:$L$997,Sheet1!$F$4:$F$997,B347,Sheet1!$Z$4:$Z$997,$H$3)+F347/SUMIFS(Sheet1!$H$4:$H$997,Sheet1!$F$4:$F$997,B347,Sheet1!$Z$4:$Z$997,$H$3),F347/D347),\"\")","v":""},""]
[null,null,null,null,null,null,null,{"$f":"SUMIFS(Sheet1!$H$4:$H$1497,Sheet1!$F$4:$F$1497,B349,Sheet1!$Z$4:$Z$1497,$H$3)","v":0},{"$f":"SUMIFS(Sheet1!$J$4:$J$15,Sheet1!$F$4:$F$15,B349,Sheet1!$Z$4:$Z$15,$H$3)","v":0},{"$f":"SUMIFS(Sheet1!$H$4:$H$1497,Sheet1!$F$4:$F$1497,B349,Sheet1!$Z$4:$Z$1497,$J$3)","v":0},null,null,"",{"$f":"IFERROR(IF(B348<\"\",SUMIFS(Sheet1!$L$4:$L$997,Sheet1!$F$4:$F$997,B348,Sheet1!$Z$4:$Z$997,$H$3)+F348/SUMIFS(Sheet1!$H$4:$H$997,Sheet1!$F$4:$F$997,B348,Sheet1!$Z$4:$Z$997,$H$3),F348/D348),\"\")","v":""},""]
[null,null,null,null,null,null,null,{"$f":"SUMIFS(Sheet1!$H$4:$H$1497,Sheet1!$F$4:$F$1497,B350,Sheet1!$Z$4:$Z$1497,$H$3)","v":0},{"$f":"SUMIFS(Sheet1!$J$4:$J$15,Sheet1!$F$4:$F$15,B350,Sheet1!$Z$4:$Z$15,$H$3)","v":0},{"$f":"SUMIFS(Sheet1!$H$4:$H$1497,Sheet1!$F$4:$F$1497,B350,Sheet1!$Z$4:$Z$1497,$J$3)","v":0},null,null,"",{"$f":"IFERROR(IF(B349<\"\",SUMIFS(Sheet1!$L$4:$L$997,Sheet1!$F$4:$F$997,B349,Sheet1!$Z$4:$Z$997,$H$3)+F349/SUMIFS(Sheet1!$H$4:$H$997,Sheet1!$F$4:$F$997,B349,Sheet1!$Z$4:$Z$997,$H$3),F349/D349),\"\")","v":""},""]
[null,null,null,null,null,null,null,{"$f":"SUMIFS(Sheet1!$H$4:$H$1497,Sheet1!$F$4:$F$1497,B351,Sheet1!$Z$4:$Z$1497,$H$3)","v":0},{"$f":"SUMIFS(Sheet1!$J$4:$J$15,Sheet1!$F$4:$F$15,B351,Sheet1!$Z$4:$Z$15,$H$3)","v":0},{"$f":"SUMIFS(Sheet1!$H$4:$H$1497,Sheet1!$F$4:$F$1497,B351,Sheet1!$Z$4:$Z$1497,$J$3)","v":0},null,null,"",{"$f":"IFERROR(IF(B350<\"\",SUMIFS(Sheet1!$L$4:$L$997,Sheet1!$F$4:$F$997,B350,Sheet1!$Z$4:$Z$997,$H$3)+F350/SUMIFS(Sheet1!$H$4:$H$997,Sheet1!$F$4:$F$997,B350,Sheet1!$Z$4:$Z$997,$H$3),F350/D350),\"\")","v":""},""]
[null,null,null,null,null,null,null,{"$f":"SUMIFS(Sheet1!$H$4:$H$1497,Sheet1!$F$4:$F$1497,B352,Sheet1!$Z$4:$Z$1497,$H$3)","v":0},{"$f":"SUMIFS(Sheet1!$J$4:$J$15,Sheet1!$F$4:$F$15,B352,Sheet1!$Z$4:$Z$15,$H$3)","v":0},{"$f":"SUMIFS(Sheet1!$H$4:$H$1497,Sheet1!$F$4:$F$1497,B352,Sheet1!$Z$4:$Z$1497,$J$3)","v":0},null,null,"",{"$f":"IFERROR(IF(B351<\"\",SUMIFS(Sheet1!$L$4:$L$997,Sheet1!$F$4:$F$997,B351,Sheet1!$Z$4:$Z$997,$H$3)+F351/SUMIFS(Sheet1!$H$4:$H$997,Sheet1!$F$4:$F$997,B351,Sheet1!$Z$4:$Z$997,$H$3),F351/D351),\"\")","v":""},""]
[null,null,null,null,null,null,null,{"$f":"SUMIFS(Sheet1!$H$4:$H$1497,Sheet1!$F$4:$F$1497,B353,Sheet1!$Z$4:$Z$1497,$H$3)","v":0},{"$f":"SUMIFS(Sheet1!$J$4:$J$15,Sheet1!$F$4:$F$15,B353,Sheet1!$Z$4:$Z$15,$H$3)","v":0},{"$f":"SUMIFS(Sheet1!$H$4:$H$1497,Sheet1!$F$4:$F$1497,B353,Sheet1!$Z$4:$Z$1497,$J$3)","v":0},null,null,"",{"$f":"IFERROR(IF(B352<\"\",SUMIFS(Sheet1!$L$4:$L$997,Sheet1!$F$4:$F$997,B352,Sheet1!$Z$4:$Z$997,$H$3)+F352/SUMIFS(Sheet1!$H$4:$H$997,Sheet1!$F$4:$F$997,B352,Sheet1!$Z$4:$Z$997,$H$3),F352/D352),\"\")","v":""},""]
[null,null,null,null,null,null,null,{"$f":"SUMIFS(Sheet1!$H$4:$H$1497,Sheet1!$F$4:$F$1497,B354,Sheet1!$Z$4:$Z$1497,$H$3)","v":0},null,{"$f":"SUMIFS(Sheet1!$H$4:$H$1497,Sheet1!$F$4:$F$1497,B354,Sheet1!$Z$4:$Z$1497,$J$3)","v":0},null,null,"",{"$f":"IFERROR(IF(B353<\"\",SUMIFS(Sheet1!$L$4:$L$997,Sheet1!$F$4:$F$997,B353,Sheet1!$Z$4:$Z$997,$H$3)+F353/SUMIFS(Sheet1!$H$4:$H$997,Sheet1!$F$4:$F$997,B353,Sheet1!$Z$4:$Z$997,$H$3),F353/D353),\"\")","v":""},""]
[null,null,null,null,null,null,null,{"$f":"SUMIFS(Sheet1!$H$4:$H$1497,Sheet1!$F$4:$F$1497,B355,Sheet1!$Z$4:$Z$1497,$H$3)","v":0},null,{"$f":"SUMIFS(Sheet1!$H$4:$H$1497,Sheet1!$F$4:$F$1497,B355,Sheet1!$Z$4:$Z$1497,$J$3)","v":0},null,null,"",{"$f":"IFERROR(IF(B354<\"\",SUMIFS(Sheet1!$L$4:$L$997,Sheet1!$F$4:$F$997,B354,Sheet1!$Z$4:$Z$997,$H$3)+F354/SUMIFS(Sheet1!$H$4:$H$997,Sheet1!$F$4:$F$997,B354,Sheet1!$Z$4:$Z$997,$H$3),F354/D354),\"\")","v":""},""]
[null,null,null,null,null,null,null,{"$f":"SUMIFS(Sheet1!$H$4:$H$1497,Sheet1!$F$4:$F$1497,B356,Sheet1!$Z$4:$Z$1497,$H$3)","v":0},null,{"$f":"SUMIFS(Sheet1!$H$4:$H$1497,Sheet1!$F$4:$F$1497,B356,Sheet1!$Z$4:$Z$1497,$J$3)","v":0},null,null,"",{"$f":"IFERROR(IF(B355<\"\",SUMIFS(Sheet1!$L$4:$L$997,Sheet1!$F$4:$F$997,B355,Sheet1!$Z$4:$Z$997,$H$3)+F355/SUMIFS(Sheet1!$H$4:$H$997,Sheet1!$F$4:$F$997,B355,Sheet1!$Z$4:$Z$997,$H$3),F355/D355),\"\")","v":""},""]
[null,null,null,null,null,null,null,{"$f":"SUMIFS(Sheet1!$H$4:$H$1497,Sheet1!$F$4:$F$1497,B357,Sheet1!$Z$4:$Z$1497,$H$3)","v":0},null,{"$f":"SUMIFS(Sheet1!$H$4:$H$1497,Sheet1!$F$4:$F$1497,B357,Sheet1!$Z$4:$Z$1497,$J$3)","v":0},null,null,"",{"$f":"IFERROR(IF(B356<\"\",SUMIFS(Sheet1!$L$4:$L$997,Sheet1!$F$4:$F$997,B356,Sheet1!$Z$4:$Z$997,$H$3)+F356/SUMIFS(Sheet1!$H$4:$H$997,Sheet1!$F$4:$F$997,B356,Sheet1!$Z$4:$Z$997,$H$3),F356/D356),\"\")","v":""},""]
[null,null,null,null,null,null,null,{"$f":"SUMIFS(Sheet1!$H$4:$H$1497,Sheet1!$F$4:$F$1497,B358,Sheet1!$Z$4:$Z$1497,$H$3)","v":0},null,{"$f":"SUMIFS(Sheet1!$H$4:$H$1497,Sheet1!$F$4:$F$1497,B358,Sheet1!$Z$4:$Z$1497,$J$3)","v":0},null,null,"",{"$f":"IFERROR(IF(B357<\"\",SUMIFS(Sheet1!$L$4:$L$997,Sheet1!$F$4:$F$997,B357,Sheet1!$Z$4:$Z$997,$H$3)+F357/SUMIFS(Sheet1!$H$4:$H$997,Sheet1!$F$4:$F$997,B357,Sheet1!$Z$4:$Z$997,$H$3),F357/D357),\"\")","v":""},""]
[null,null,null,null,null,null,null,{"$f":"SUMIFS(Sheet1!$H$4:$H$1497,Sheet1!$F$4:$F$1497,B359,Sheet1!$Z$4:$Z$1497,$H$3)","v":0},null,{"$f":"SUMIFS(Sheet1!$H$4:$H$1497,Sheet1!$F$4:$F$1497,B359,Sheet1!$Z$4:$Z$1497,$J$3)","v":0},null,null,"",{"$f":"IFERROR(IF(B358<\"\",SUMIFS(Sheet1!$L$4:$L$997,Sheet1!$F$4:$F$997,B358,Sheet1!$Z$4:$Z$997,$H$3)+F358/SUMIFS(Sheet1!$H$4:$H$997,Sheet1!$F$4:$F$997,B358,Sheet1!$Z$4:$Z$997,$H$3),F358/D358),\"\")","v":""},""]
[null,null,null,null,null,null,null,{"$f":"SUMIFS(Sheet1!$H$4:$H$1497,Sheet1!$F$4:$F$1497,B360,Sheet1!$Z$4:$Z$1497,$H$3)","v":0},null,{"$f":"SUMIFS(Sheet1!$H$4:$H$1497,Sheet1!$F$4:$F$1497,B360,Sheet1!$Z$4:$Z$1497,$J$3)","v":0},null,null,"",{"$f":"IFERROR(IF(B359<\"\",SUMIFS(Sheet1!$L$4:$L$997,Sheet1!$F$4:$F$997,B359,Sheet1!$Z$4:$Z$997,$H$3)+F359/SUMIFS(Sheet1!$H$4:$H$997,Sheet1!$F$4:$F$997,B359,Sheet1!$Z$4:$Z$997,$H$3),F359/D359),\"\")","v":""},""]
[null,null,null,null,null,null,null,{"$f":"SUMIFS(Sheet1!$H$4:$H$1497,Sheet1!$F$4:$F$1497,B361,Sheet1!$Z$4:$Z$1497,$H$3)","v":0},null,{"$f":"SUMIFS(Sheet1!$H$4:$H$1497,Sheet1!$F$4:$F$1497,B361,Sheet1!$Z$4:$Z$1497,$J$3)","v":0},null,null,"",{"$f":"IFERROR(IF(B360<\"\",SUMIFS(Sheet1!$L$4:$L$997,Sheet1!$F$4:$F$997,B360,Sheet1!$Z$4:$Z$997,$H$3)+F360/SUMIFS(Sheet1!$H$4:$H$997,Sheet1!$F$4:$F$997,B360,Sheet1!$Z$4:$Z$997,$H$3),F360/D360),\"\")","v":""},""]
[null,null,null,null,null,null,null,{"$f":"SUMIFS(Sheet1!$H$4:$H$1497,Sheet1!$F$4:$F$1497,B362,Sheet1!$Z$4:$Z$1497,$H$3)","v":0},null,{"$f":"SUMIFS(Sheet1!$H$4:$H$1497,Sheet1!$F$4:$F$1497,B362,Sheet1!$Z$4:$Z$1497,$J$3)","v":0},null,null,"",{"$f":"IFERROR(IF(B361<\"\",SUMIFS(Sheet1!$L$4:$L$997,Sheet1!$F$4:$F$997,B361,Sheet1!$Z$4:$Z$997,$H$3)+F361/SUMIFS(Sheet1!$H$4:$H$997,Sheet1!$F$4:$F$997,B361,Sheet1!$Z$4:$Z$997,$H$3),F361/D361),\"\")","v":""},""]
[null,null,null,null,null,null,null,{"$f":"SUMIFS(Sheet1!$H$4:$H$1497,Sheet1!$F$4:$F$1497,B363,Sheet1!$Z$4:$Z$1497,$H$3)","v":0},null,{"$f":"SUMIFS(Sheet1!$H$4:$H$1497,Sheet1!$F$4:$F$1497,B363,Sheet1!$Z$4:$Z$1497,$J$3)","v":0},null,null,"",{"$f":"IFERROR(IF(B362<\"\",SUMIFS(Sheet1!$L$4:$L$997,Sheet1!$F$4:$F$997,B362,Sheet1!$Z$4:$Z$997,$H$3)+F362/SUMIFS(Sheet1!$H$4:$H$997,Sheet1!$F$4:$F$997,B362,Sheet1!$Z$4:$Z$997,$H$3),F362/D362),\"\")","v":""},""]
[null,null,null,null,null,null,null,{"$f":"SUMIFS(Sheet1!$H$4:$H$1497,Sheet1!$F$4:$F$1497,B364,Sheet1!$Z$4:$Z$1497,$H$3)","v":0},null,{"$f":"SUMIFS(Sheet1!$H$4:$H$1497,Sheet1!$F$4:$F$1497,B364,Sheet1!$Z$4:$Z$1497,$J$3)","v":0},null,null,"",{"$f":"IFERROR(IF(B363<\"\",SUMIFS(Sheet1!$L$4:$L$997,Sheet1!$F$4:$F$997,B363,Sheet1!$Z$4:$Z$997,$H$3)+F363/SUMIFS(Sheet1!$H$4:$H$997,Sheet1!$F$4:$F$997,B363,Sheet1!$Z$4:$Z$997,$H$3),F363/D363),\"\")","v":""},""]
[null,null,null,null,null,null,null,{"$f":"SUMIFS(Sheet1!$H$4:$H$1497,Sheet1!$F$4:$F$1497,B365,Sheet1!$Z$4:$Z$1497,$H$3)","v":0},null,{"$f":"SUMIFS(Sheet1!$H$4:$H$1497,Sheet1!$F$4:$F$1497,B365,Sheet1!$Z$4:$Z$1497,$J$3)","v":0},null,null,"",{"$f":"IFERROR(IF(B364<\"\",SUMIFS(Sheet1!$L$4:$L$997,Sheet1!$F$4:$F$997,B364,Sheet1!$Z$4:$Z$997,$H$3)+F364/SUMIFS(Sheet1!$H$4:$H$997,Sheet1!$F$4:$F$997,B364,Sheet1!$Z$4:$Z$997,$H$3),F364/D364),\"\")","v":""},""]
[null,null,null,null,null,null,null,{"$f":"SUMIFS(Sheet1!$H$4:$H$1497,Sheet1!$F$4:$F$1497,B366,Sheet1!$Z$4:$Z$1497,$H$3)","v":0},null,{"$f":"SUMIFS(Sheet1!$H$4:$H$1497,Sheet1!$F$4:$F$1497,B366,Sheet1!$Z$4:$Z$1497,$J$3)","v":0},null,null,"",{"$f":"IFERROR(IF(B365<\"\",SUMIFS(Sheet1!$L$4:$L$997,Sheet1!$F$4:$F$997,B365,Sheet1!$Z$4:$Z$997,$H$3)+F365/SUMIFS(Sheet1!$H$4:$H$997,Sheet1!$F$4:$F$997,B365,Sheet1!$Z$4:$Z$997,$H$3),F365/D365),\"\")","v":""},""]
[null,null,null,null,null,null,null,{"$f":"SUMIFS(Sheet1!$H$4:$H$1497,Sheet1!$F$4:$F$1497,B367,Sheet1!$Z$4:$Z$1497,$H$3)","v":0},null,{"$f":"SUMIFS(Sheet1!$H$4:$H$1497,Sheet1!$F$4:$F$1497,B367,Sheet1!$Z$4:$Z$1497,$J$3)","v":0},null,null,"",{"$f":"IFERROR(IF(B366<\"\",SUMIFS(Sheet1!$L$4:$L$997,Sheet1!$F$4:$F$997,B366,Sheet1!$Z$4:$Z$997,$H$3)+F366/SUMIFS(Sheet1!$H$4:$H$997,Sheet1!$F$4:$F$997,B366,Sheet1!$Z$4:$Z$997,$H$3),F366/D366),\"\")","v":""},""]
[null,null,null,null,null,null,null,{"$f":"SUMIFS(Sheet1!$H$4:$H$1497,Sheet1!$F$4:$F$1497,B368,Sheet1!$Z$4:$Z$1497,$H$3)","v":0},null,{"$f":"SUMIFS(Sheet1!$H$4:$H$1497,Sheet1!$F$4:$F$1497,B368,Sheet1!$Z$4:$Z$1497,$J$3)","v":0},null,null,"",{"$f":"IFERROR(IF(B367<\"\",SUMIFS(Sheet1!$L$4:$L$997,Sheet1!$F$4:$F$997,B367,Sheet1!$Z$4:$Z$997,$H$3)+F367/SUMIFS(Sheet1!$H$4:$H$997,Sheet1!$F$4:$F$997,B367,Sheet1!$Z$4:$Z$997,$H$3),F367/D367),\"\")","v":""},""]
[null,null,null,null,null,null,null,{"$f":"SUMIFS(Sheet1!$H$4:$H$1497,Sheet1!$F$4:$F$1497,B369,Sheet1!$Z$4:$Z$1497,$H$3)","v":0},null,{"$f":"SUMIFS(Sheet1!$H$4:$H$1497,Sheet1!$F$4:$F$1497,B369,Sheet1!$Z$4:$Z$1497,$J$3)","v":0},null,null,"",{"$f":"IFERROR(IF(B368<\"\",SUMIFS(Sheet1!$L$4:$L$997,Sheet1!$F$4:$F$997,B368,Sheet1!$Z$4:$Z$997,$H$3)+F368/SUMIFS(Sheet1!$H$4:$H$997,Sheet1!$F$4:$F$997,B368,Sheet1!$Z$4:$Z$997,$H$3),F368/D368),\"\")","v":""},""]
[null,null,null,null,null,null,null,{"$f":"SUMIFS(Sheet1!$H$4:$H$1497,Sheet1!$F$4:$F$1497,B370,Sheet1!$Z$4:$Z$1497,$H$3)","v":0},null,{"$f":"SUMIFS(Sheet1!$H$4:$H$1497,Sheet1!$F$4:$F$1497,B370,Sheet1!$Z$4:$Z$1497,$J$3)","v":0},null,null,"",{"$f":"IFERROR(IF(B369<\"\",SUMIFS(Sheet1!$L$4:$L$997,Sheet1!$F$4:$F$997,B369,Sheet1!$Z$4:$Z$997,$H$3)+F369/SUMIFS(Sheet1!$H$4:$H$997,Sheet1!$F$4:$F$997,B369,Sheet1!$Z$4:$Z$997,$H$3),F369/D369),\"\")","v":""},""]
[null,null,null,null,null,null,null,{"$f":"SUMIFS(Sheet1!$H$4:$H$1497,Sheet1!$F$4:$F$1497,B371,Sheet1!$Z$4:$Z$1497,$H$3)","v":0},null,{"$f":"SUMIFS(Sheet1!$H$4:$H$1497,Sheet1!$F$4:$F$1497,B371,Sheet1!$Z$4:$Z$1497,$J$3)","v":0},null,null,"",{"$f":"IFERROR(IF(B370<\"\",SUMIFS(Sheet1!$L$4:$L$997,Sheet1!$F$4:$F$997,B370,Sheet1!$Z$4:$Z$997,$H$3)+F370/SUMIFS(Sheet1!$H$4:$H$997,Sheet1!$F$4:$F$997,B370,Sheet1!$Z$4:$Z$997,$H$3),F370/D370),\"\")","v":""},""]
[null,null,null,null,null,null,null,{"$f":"SUMIFS(Sheet1!$H$4:$H$1497,Sheet1!$F$4:$F$1497,B372,Sheet1!$Z$4:$Z$1497,$H$3)","v":0},null,{"$f":"SUMIFS(Sheet1!$H$4:$H$1497,Sheet1!$F$4:$F$1497,B372,Sheet1!$Z$4:$Z$1497,$J$3)","v":0},null,null,"",{"$f":"IFERROR(IF(B371<\"\",SUMIFS(Sheet1!$L$4:$L$997,Sheet1!$F$4:$F$997,B371,Sheet1!$Z$4:$Z$997,$H$3)+F371/SUMIFS(Sheet1!$H$4:$H$997,Sheet1!$F$4:$F$997,B371,Sheet1!$Z$4:$Z$997,$H$3),F371/D371),\"\")","v":""},""]
[null,null,null,null,null,null,null,{"$f":"SUMIFS(Sheet1!$H$4:$H$1497,Sheet1!$F$4:$F$1497,B373,Sheet1!$Z$4:$Z$1497,$H$3)","v":0},null,{"$f":"SUMIFS(Sheet1!$H$4:$H$1497,Sheet1!$F$4:$F$1497,B373,Sheet1!$Z$4:$Z$1497,$J$3)","v":0},null,null,"",{"$f":"IFERROR(IF(B372<\"\",SUMIFS(Sheet1!$L$4:$L$997,Sheet1!$F$4:$F$997,B372,Sheet1!$Z$4:$Z$997,$H$3)+F372/SUMIFS(Sheet1!$H$4:$H$997,Sheet1!$F$4:$F$997,B372,Sheet1!$Z$4:$Z$997,$H$3),F372/D372),\"\")","v":""},""]
[null,null,null,null,null,null,null,{"$f":"SUMIFS(Sheet1!$H$4:$H$1497,Sheet1!$F$4:$F$1497,B374,Sheet1!$Z$4:$Z$1497,$H$3)","v":0},null,{"$f":"SUMIFS(Sheet1!$H$4:$H$1497,Sheet1!$F$4:$F$1497,B374,Sheet1!$Z$4:$Z$1497,$J$3)","v":0},null,null,"",{"$f":"IFERROR(IF(B373<\"\",SUMIFS(Sheet1!$L$4:$L$997,Sheet1!$F$4:$F$997,B373,Sheet1!$Z$4:$Z$997,$H$3)+F373/SUMIFS(Sheet1!$H$4:$H$997,Sheet1!$F$4:$F$997,B373,Sheet1!$Z$4:$Z$997,$H$3),F373/D373),\"\")","v":""},""]
[null,null,null,null,null,null,null,{"$f":"SUMIFS(Sheet1!$H$4:$H$1497,Sheet1!$F$4:$F$1497,B375,Sheet1!$Z$4:$Z$1497,$H$3)","v":0},null,{"$f":"SUMIFS(Sheet1!$H$4:$H$1497,Sheet1!$F$4:$F$1497,B375,Sheet1!$Z$4:$Z$1497,$J$3)","v":0},null,null,"",{"$f":"IFERROR(IF(B374<\"\",SUMIFS(Sheet1!$L$4:$L$997,Sheet1!$F$4:$F$997,B374,Sheet1!$Z$4:$Z$997,$H$3)+F374/SUMIFS(Sheet1!$H$4:$H$997,Sheet1!$F$4:$F$997,B374,Sheet1!$Z$4:$Z$997,$H$3),F374/D374),\"\")","v":""},""]
[null,null,null,null,null,null,null,{"$f":"SUMIFS(Sheet1!$H$4:$H$1497,Sheet1!$F$4:$F$1497,B376,Sheet1!$Z$4:$Z$1497,$H$3)","v":0},null,{"$f":"SUMIFS(Sheet1!$H$4:$H$1497,Sheet1!$F$4:$F$1497,B376,Sheet1!$Z$4:$Z$1497,$J$3)","v":0},null,null,"",{"$f":"IFERROR(IF(B375<\"\",SUMIFS(Sheet1!$L$4:$L$997,Sheet1!$F$4:$F$997,B375,Sheet1!$Z$4:$Z$997,$H$3)+F375/SUMIFS(Sheet1!$H$4:$H$997,Sheet1!$F$4:$F$997,B375,Sheet1!$Z$4:$Z$997,$H$3),F375/D375),\"\")","v":""},""]
[null,null,null,null,null,null,null,{"$f":"SUMIFS(Sheet1!$H$4:$H$1497,Sheet1!$F$4:$F$1497,B377,Sheet1!$Z$4:$Z$1497,$H$3)","v":0},null,{"$f":"SUMIFS(Sheet1!$H$4:$H$1497,Sheet1!$F$4:$F$1497,B377,Sheet1!$Z$4:$Z$1497,$J$3)","v":0},null,null,"",{"$f":"IFERROR(IF(B376<\"\",SUMIFS(Sheet1!$L$4:$L$997,Sheet1!$F$4:$F$997,B376,Sheet1!$Z$4:$Z$997,$H$3)+F376/SUMIFS(Sheet1!$H$4:$H$997,Sheet1!$F$4:$F$997,B376,Sheet1!$Z$4:$Z$997,$H$3),F376/D376),\"\")","v":""},""]
[null,null,null,null,null,null,null,{"$f":"SUMIFS(Sheet1!$H$4:$H$1497,Sheet1!$F$4:$F$1497,B378,Sheet1!$Z$4:$Z$1497,$H$3)","v":0},null,{"$f":"SUMIFS(Sheet1!$H$4:$H$1497,Sheet1!$F$4:$F$1497,B378,Sheet1!$Z$4:$Z$1497,$J$3)","v":0},null,null,"",{"$f":"IFERROR(IF(B377<\"\",SUMIFS(Sheet1!$L$4:$L$997,Sheet1!$F$4:$F$997,B377,Sheet1!$Z$4:$Z$997,$H$3)+F377/SUMIFS(Sheet1!$H$4:$H$997,Sheet1!$F$4:$F$997,B377,Sheet1!$Z$4:$Z$997,$H$3),F377/D377),\"\")","v":""},""]
[null,null,null,null,null,null,null,{"$f":"SUMIFS(Sheet1!$H$4:$H$1497,Sheet1!$F$4:$F$1497,B379,Sheet1!$Z$4:$Z$1497,$H$3)","v":0},null,{"$f":"SUMIFS(Sheet1!$H$4:$H$1497,Sheet1!$F$4:$F$1497,B379,Sheet1!$Z$4:$Z$1497,$J$3)","v":0},null,null,"",{"$f":"IFERROR(IF(B378<\"\",SUMIFS(Sheet1!$L$4:$L$997,Sheet1!$F$4:$F$997,B378,Sheet1!$Z$4:$Z$997,$H$3)+F378/SUMIFS(Sheet1!$H$4:$H$997,Sheet1!$F$4:$F$997,B378,Sheet1!$Z$4:$Z$997,$H$3),F378/D378),\"\")","v":""},""]
[null,null,null,null,null,null,null,{"$f":"SUMIFS(Sheet1!$H$4:$H$1497,Sheet1!$F$4:$F$1497,B380,Sheet1!$Z$4:$Z$1497,$H$3)","v":0},null,{"$f":"SUMIFS(Sheet1!$H$4:$H$1497,Sheet1!$F$4:$F$1497,B380,Sheet1!$Z$4:$Z$1497,$J$3)","v":0},null,null,"",{"$f":"IFERROR(IF(B379<\"\",SUMIFS(Sheet1!$L$4:$L$997,Sheet1!$F$4:$F$997,B379,Sheet1!$Z$4:$Z$997,$H$3)+F379/SUMIFS(Sheet1!$H$4:$H$997,Sheet1!$F$4:$F$997,B379,Sheet1!$Z$4:$Z$997,$H$3),F379/D379),\"\")","v":""},""]
[null,null,null,null,null,null,null,{"$f":"SUMIFS(Sheet1!$H$4:$H$1497,Sheet1!$F$4:$F$1497,B381,Sheet1!$Z$4:$Z$1497,$H$3)","v":0},null,{"$f":"SUMIFS(Sheet1!$H$4:$H$1497,Sheet1!$F$4:$F$1497,B381,Sheet1!$Z$4:$Z$1497,$J$3)","v":0},null,null,"",{"$f":"IFERROR(IF(B380<\"\",SUMIFS(Sheet1!$L$4:$L$997,Sheet1!$F$4:$F$997,B380,Sheet1!$Z$4:$Z$997,$H$3)+F380/SUMIFS(Sheet1!$H$4:$H$997,Sheet1!$F$4:$F$997,B380,Sheet1!$Z$4:$Z$997,$H$3),F380/D380),\"\")","v":""},""]
[null,null,null,null,null,null,null,{"$f":"SUMIFS(Sheet1!$H$4:$H$1497,Sheet1!$F$4:$F$1497,B382,Sheet1!$Z$4:$Z$1497,$H$3)","v":0},null,{"$f":"SUMIFS(Sheet1!$H$4:$H$1497,Sheet1!$F$4:$F$1497,B382,Sheet1!$Z$4:$Z$1497,$J$3)","v":0},null,null,"",{"$f":"IFERROR(IF(B381<\"\",SUMIFS(Sheet1!$L$4:$L$997,Sheet1!$F$4:$F$997,B381,Sheet1!$Z$4:$Z$997,$H$3)+F381/SUMIFS(Sheet1!$H$4:$H$997,Sheet1!$F$4:$F$997,B381,Sheet1!$Z$4:$Z$997,$H$3),F381/D381),\"\")","v":""},""]
[null,null,null,null,null,null,null,{"$f":"SUMIFS(Sheet1!$H$4:$H$1497,Sheet1!$F$4:$F$1497,B383,Sheet1!$Z$4:$Z$1497,$H$3)","v":0},null,{"$f":"SUMIFS(Sheet1!$H$4:$H$1497,Sheet1!$F$4:$F$1497,B383,Sheet1!$Z$4:$Z$1497,$J$3)","v":0},null,null,"",{"$f":"IFERROR(IF(B382<\"\",SUMIFS(Sheet1!$L$4:$L$997,Sheet1!$F$4:$F$997,B382,Sheet1!$Z$4:$Z$997,$H$3)+F382/SUMIFS(Sheet1!$H$4:$H$997,Sheet1!$F$4:$F$997,B382,Sheet1!$Z$4:$Z$997,$H$3),F382/D382),\"\")","v":""},""]
[null,null,null,null,null,null,null,{"$f":"SUMIFS(Sheet1!$H$4:$H$1497,Sheet1!$F$4:$F$1497,B384,Sheet1!$Z$4:$Z$1497,$H$3)","v":0},null,{"$f":"SUMIFS(Sheet1!$H$4:$H$1497,Sheet1!$F$4:$F$1497,B384,Sheet1!$Z$4:$Z$1497,$J$3)","v":0},null,null,"",{"$f":"IFERROR(IF(B383<\"\",SUMIFS(Sheet1!$L$4:$L$997,Sheet1!$F$4:$F$997,B383,Sheet1!$Z$4:$Z$997,$H$3)+F383/SUMIFS(Sheet1!$H$4:$H$997,Sheet1!$F$4:$F$997,B383,Sheet1!$Z$4:$Z$997,$H$3),F383/D383),\"\")","v":""},""]
[null,null,null,null,null,null,null,{"$f":"SUMIFS(Sheet1!$H$4:$H$1497,Sheet1!$F$4:$F$1497,B385,Sheet1!$Z$4:$Z$1497,$H$3)","v":0},null,{"$f":"SUMIFS(Sheet1!$H$4:$H$1497,Sheet1!$F$4:$F$1497,B385,Sheet1!$Z$4:$Z$1497,$J$3)","v":0},null,null,"",{"$f":"IFERROR(IF(B384<\"\",SUMIFS(Sheet1!$L$4:$L$997,Sheet1!$F$4:$F$997,B384,Sheet1!$Z$4:$Z$997,$H$3)+F384/SUMIFS(Sheet1!$H$4:$H$997,Sheet1!$F$4:$F$997,B384,Sheet1!$Z$4:$Z$997,$H$3),F384/D384),\"\")","v":""},""]
[null,null,null,null,null,null,null,{"$f":"SUMIFS(Sheet1!$H$4:$H$1497,Sheet1!$F$4:$F$1497,B386,Sheet1!$Z$4:$Z$1497,$H$3)","v":0},null,{"$f":"SUMIFS(Sheet1!$H$4:$H$1497,Sheet1!$F$4:$F$1497,B386,Sheet1!$Z$4:$Z$1497,$J$3)","v":0},null,null,"",{"$f":"IFERROR(IF(B385<\"\",SUMIFS(Sheet1!$L$4:$L$997,Sheet1!$F$4:$F$997,B385,Sheet1!$Z$4:$Z$997,$H$3)+F385/SUMIFS(Sheet1!$H$4:$H$997,Sheet1!$F$4:$F$997,B385,Sheet1!$Z$4:$Z$997,$H$3),F385/D385),\"\")","v":""},""]
[null,null,null,null,null,null,null,{"$f":"SUMIFS(Sheet1!$H$4:$H$1497,Sheet1!$F$4:$F$1497,B387,Sheet1!$Z$4:$Z$1497,$H$3)","v":0},null,{"$f":"SUMIFS(Sheet1!$H$4:$H$1497,Sheet1!$F$4:$F$1497,B387,Sheet1!$Z$4:$Z$1497,$J$3)","v":0},null,null,"",{"$f":"IFERROR(IF(B386<\"\",SUMIFS(Sheet1!$L$4:$L$997,Sheet1!$F$4:$F$997,B386,Sheet1!$Z$4:$Z$997,$H$3)+F386/SUMIFS(Sheet1!$H$4:$H$997,Sheet1!$F$4:$F$997,B386,Sheet1!$Z$4:$Z$997,$H$3),F386/D386),\"\")","v":""},""]
[null,null,null,null,null,null,null,{"$f":"SUMIFS(Sheet1!$H$4:$H$1497,Sheet1!$F$4:$F$1497,B388,Sheet1!$Z$4:$Z$1497,$H$3)","v":0},null,{"$f":"SUMIFS(Sheet1!$H$4:$H$1497,Sheet1!$F$4:$F$1497,B388,Sheet1!$Z$4:$Z$1497,$J$3)","v":0},null,null,"",{"$f":"IFERROR(IF(B387<\"\",SUMIFS(Sheet1!$L$4:$L$997,Sheet1!$F$4:$F$997,B387,Sheet1!$Z$4:$Z$997,$H$3)+F387/SUMIFS(Sheet1!$H$4:$H$997,Sheet1!$F$4:$F$997,B387,Sheet1!$Z$4:$Z$997,$H$3),F387/D387),\"\")","v":""},""]
[null,null,null,null,null,null,null,{"$f":"SUMIFS(Sheet1!$H$4:$H$1497,Sheet1!$F$4:$F$1497,B389,Sheet1!$Z$4:$Z$1497,$H$3)","v":0},null,{"$f":"SUMIFS(Sheet1!$H$4:$H$1497,Sheet1!$F$4:$F$1497,B389,Sheet1!$Z$4:$Z$1497,$J$3)","v":0},null,null,"",{"$f":"IFERROR(IF(B388<\"\",SUMIFS(Sheet1!$L$4:$L$997,Sheet1!$F$4:$F$997,B388,Sheet1!$Z$4:$Z$997,$H$3)+F388/SUMIFS(Sheet1!$H$4:$H$997,Sheet1!$F$4:$F$997,B388,Sheet1!$Z$4:$Z$997,$H$3),F388/D388),\"\")","v":""},""]
[null,null,null,null,null,null,null,{"$f":"SUMIFS(Sheet1!$H$4:$H$1497,Sheet1!$F$4:$F$1497,B390,Sheet1!$Z$4:$Z$1497,$H$3)","v":0},null,{"$f":"SUMIFS(Sheet1!$H$4:$H$1497,Sheet1!$F$4:$F$1497,B390,Sheet1!$Z$4:$Z$1497,$J$3)","v":0},null,null,{"$f":"IF(L389<>\"\",IF(L389>=K389,\"مطلوب\",\"\"),\"\")","v":""},{"$f":"IFERROR(IF(B389<\"\",SUMIFS(Sheet1!$L$4:$L$997,Sheet1!$F$4:$F$997,B389,Sheet1!$Z$4:$Z$997,$H$3)+F389/SUMIFS(Sheet1!$H$4:$H$997,Sheet1!$F$4:$F$997,B389,Sheet1!$Z$4:$Z$997,$H$3),F389/D389),\"\")","v":""},{"$f":"IFERROR(SUMPRODUCT(K389*N389),\"\")","v":""}]
[null,null,null,null,null,null,null,{"$f":"SUMIFS(Sheet1!$H$4:$H$1497,Sheet1!$F$4:$F$1497,B391,Sheet1!$Z$4:$Z$1497,$H$3)","v":0},null,{"$f":"SUMIFS(Sheet1!$H$4:$H$1497,Sheet1!$F$4:$F$1497,B391,Sheet1!$Z$4:$Z$1497,$J$3)","v":0},null,null,"",{"$f":"IFERROR(IF(B390<\"\",SUMIFS(Sheet1!$L$4:$L$997,Sheet1!$F$4:$F$997,B390,Sheet1!$Z$4:$Z$997,$H$3)+F390/SUMIFS(Sheet1!$H$4:$H$997,Sheet1!$F$4:$F$997,B390,Sheet1!$Z$4:$Z$997,$H$3),F390/D390),\"\")","v":""},""]
[null,null,null,null,null,null,null,{"$f":"SUMIFS(Sheet1!$H$4:$H$1497,Sheet1!$F$4:$F$1497,B392,Sheet1!$Z$4:$Z$1497,$H$3)","v":0},null,{"$f":"SUMIFS(Sheet1!$H$4:$H$1497,Sheet1!$F$4:$F$1497,B392,Sheet1!$Z$4:$Z$1497,$J$3)","v":0},null,null,"",{"$f":"IFERROR(IF(B391<\"\",SUMIFS(Sheet1!$L$4:$L$997,Sheet1!$F$4:$F$997,B391,Sheet1!$Z$4:$Z$997,$H$3)+F391/SUMIFS(Sheet1!$H$4:$H$997,Sheet1!$F$4:$F$997,B391,Sheet1!$Z$4:$Z$997,$H$3),F391/D391),\"\")","v":""},""]
[null,null,null,null,null,null,null,{"$f":"SUMIFS(Sheet1!$H$4:$H$1497,Sheet1!$F$4:$F$1497,B393,Sheet1!$Z$4:$Z$1497,$H$3)","v":0},null,{"$f":"SUMIFS(Sheet1!$H$4:$H$1497,Sheet1!$F$4:$F$1497,B393,Sheet1!$Z$4:$Z$1497,$J$3)","v":0},null,null,"",{"$f":"IFERROR(IF(B392<\"\",SUMIFS(Sheet1!$L$4:$L$997,Sheet1!$F$4:$F$997,B392,Sheet1!$Z$4:$Z$997,$H$3)+F392/SUMIFS(Sheet1!$H$4:$H$997,Sheet1!$F$4:$F$997,B392,Sheet1!$Z$4:$Z$997,$H$3),F392/D392),\"\")","v":""},""]
[null,null,null,null,null,null,null,{"$f":"SUMIFS(Sheet1!$H$4:$H$1497,Sheet1!$F$4:$F$1497,B394,Sheet1!$Z$4:$Z$1497,$H$3)","v":0},null,{"$f":"SUMIFS(Sheet1!$H$4:$H$1497,Sheet1!$F$4:$F$1497,B394,Sheet1!$Z$4:$Z$1497,$J$3)","v":0},null,null,"",{"$f":"IFERROR(IF(B393<\"\",SUMIFS(Sheet1!$L$4:$L$997,Sheet1!$F$4:$F$997,B393,Sheet1!$Z$4:$Z$997,$H$3)+F393/SUMIFS(Sheet1!$H$4:$H$997,Sheet1!$F$4:$F$997,B393,Sheet1!$Z$4:$Z$997,$H$3),F393/D393),\"\")","v":""},""]
[null,null,null,null,null,null,null,{"$f":"SUMIFS(Sheet1!$H$4:$H$1497,Sheet1!$F$4:$F$1497,B395,Sheet1!$Z$4:$Z$1497,$H$3)","v":0},null,{"$f":"SUMIFS(Sheet1!$H$4:$H$1497,Sheet1!$F$4:$F$1497,B395,Sheet1!$Z$4:$Z$1497,$J$3)","v":0},null,null,"",{"$f":"IFERROR(IF(B394<\"\",SUMIFS(Sheet1!$L$4:$L$997,Sheet1!$F$4:$F$997,B394,Sheet1!$Z$4:$Z$997,$H$3)+F394/SUMIFS(Sheet1!$H$4:$H$997,Sheet1!$F$4:$F$997,B394,Sheet1!$Z$4:$Z$997,$H$3),F394/D394),\"\")","v":""},""]
[null,null,null,null,null,null,null,{"$f":"SUMIFS(Sheet1!$H$4:$H$1497,Sheet1!$F$4:$F$1497,B396,Sheet1!$Z$4:$Z$1497,$H$3)","v":0},null,{"$f":"SUMIFS(Sheet1!$H$4:$H$1497,Sheet1!$F$4:$F$1497,B396,Sheet1!$Z$4:$Z$1497,$J$3)","v":0},null,null,"",{"$f":"IFERROR(IF(B395<\"\",SUMIFS(Sheet1!$L$4:$L$997,Sheet1!$F$4:$F$997,B395,Sheet1!$Z$4:$Z$997,$H$3)+F395/SUMIFS(Sheet1!$H$4:$H$997,Sheet1!$F$4:$F$997,B395,Sheet1!$Z$4:$Z$997,$H$3),F395/D395),\"\")","v":""},""]
[null,null,null,null,null,null,null,{"$f":"SUMIFS(Sheet1!$H$4:$H$1497,Sheet1!$F$4:$F$1497,B397,Sheet1!$Z$4:$Z$1497,$H$3)","v":0},null,{"$f":"SUMIFS(Sheet1!$H$4:$H$1497,Sheet1!$F$4:$F$1497,B397,Sheet1!$Z$4:$Z$1497,$J$3)","v":0},null,null,"",{"$f":"IFERROR(IF(B396<\"\",SUMIFS(Sheet1!$L$4:$L$997,Sheet1!$F$4:$F$997,B396,Sheet1!$Z$4:$Z$997,$H$3)+F396/SUMIFS(Sheet1!$H$4:$H$997,Sheet1!$F$4:$F$997,B396,Sheet1!$Z$4:$Z$997,$H$3),F396/D396),\"\")","v":""},""]
[null,null,null,null,null,null,null,{"$f":"SUMIFS(Sheet1!$H$4:$H$1497,Sheet1!$F$4:$F$1497,B398,Sheet1!$Z$4:$Z$1497,$H$3)","v":0},null,{"$f":"SUMIFS(Sheet1!$H$4:$H$1497,Sheet1!$F$4:$F$1497,B398,Sheet1!$Z$4:$Z$1497,$J$3)","v":0},null,null,"",{"$f":"IFERROR(IF(B397<\"\",SUMIFS(Sheet1!$L$4:$L$997,Sheet1!$F$4:$F$997,B397,Sheet1!$Z$4:$Z$997,$H$3)+F397/SUMIFS(Sheet1!$H$4:$H$997,Sheet1!$F$4:$F$997,B397,Sheet1!$Z$4:$Z$997,$H$3),F397/D397),\"\")","v":""},""]
[null,null,null,null,null,null,null,{"$f":"SUMIFS(Sheet1!$H$4:$H$1497,Sheet1!$F$4:$F$1497,B399,Sheet1!$Z$4:$Z$1497,$H$3)","v":0},null,{"$f":"SUMIFS(Sheet1!$H$4:$H$1497,Sheet1!$F$4:$F$1497,B399,Sheet1!$Z$4:$Z$1497,$J$3)","v":0},null,null,"",{"$f":"IFERROR(IF(B398<\"\",SUMIFS(Sheet1!$L$4:$L$997,Sheet1!$F$4:$F$997,B398,Sheet1!$Z$4:$Z$997,$H$3)+F398/SUMIFS(Sheet1!$H$4:$H$997,Sheet1!$F$4:$F$997,B398,Sheet1!$Z$4:$Z$997,$H$3),F398/D398),\"\")","v":""},""]
[null,null,null,null,null,null,null,{"$f":"SUMIFS(Sheet1!$H$4:$H$1497,Sheet1!$F$4:$F$1497,B400,Sheet1!$Z$4:$Z$1497,$H$3)","v":0},null,{"$f":"SUMIFS(Sheet1!$H$4:$H$1497,Sheet1!$F$4:$F$1497,B400,Sheet1!$Z$4:$Z$1497,$J$3)","v":0},null,null,"",{"$f":"IFERROR(IF(B399<\"\",SUMIFS(Sheet1!$L$4:$L$997,Sheet1!$F$4:$F$997,B399,Sheet1!$Z$4:$Z$997,$H$3)+F399/SUMIFS(Sheet1!$H$4:$H$997,Sheet1!$F$4:$F$997,B399,Sheet1!$Z$4:$Z$997,$H$3),F399/D399),\"\")","v":""},""]
[null,null,null,null,null,null,null,{"$f":"SUMIFS(Sheet1!$H$4:$H$1497,Sheet1!$F$4:$F$1497,B401,Sheet1!$Z$4:$Z$1497,$H$3)","v":0},null,{"$f":"SUMIFS(Sheet1!$H$4:$H$1497,Sheet1!$F$4:$F$1497,B401,Sheet1!$Z$4:$Z$1497,$J$3)","v":0},null,null,"",{"$f":"IFERROR(IF(B400<\"\",SUMIFS(Sheet1!$L$4:$L$997,Sheet1!$F$4:$F$997,B400,Sheet1!$Z$4:$Z$997,$H$3)+F400/SUMIFS(Sheet1!$H$4:$H$997,Sheet1!$F$4:$F$997,B400,Sheet1!$Z$4:$Z$997,$H$3),F400/D400),\"\")","v":""},""]
[null,null,null,null,null,null,null,{"$f":"SUMIFS(Sheet1!$H$4:$H$1497,Sheet1!$F$4:$F$1497,B402,Sheet1!$Z$4:$Z$1497,$H$3)","v":0},null,{"$f":"SUMIFS(Sheet1!$H$4:$H$1497,Sheet1!$F$4:$F$1497,B402,Sheet1!$Z$4:$Z$1497,$J$3)","v":0},null,null,"",{"$f":"IFERROR(IF(B401<\"\",SUMIFS(Sheet1!$L$4:$L$997,Sheet1!$F$4:$F$997,B401,Sheet1!$Z$4:$Z$997,$H$3)+F401/SUMIFS(Sheet1!$H$4:$H$997,Sheet1!$F$4:$F$997,B401,Sheet1!$Z$4:$Z$997,$H$3),F401/D401),\"\")","v":""},""]
[null,null,null,null,null,null,null,{"$f":"SUMIFS(Sheet1!$H$4:$H$1497,Sheet1!$F$4:$F$1497,B403,Sheet1!$Z$4:$Z$1497,$H$3)","v":0},null,{"$f":"SUMIFS(Sheet1!$H$4:$H$1497,Sheet1!$F$4:$F$1497,B403,Sheet1!$Z$4:$Z$1497,$J$3)","v":0},null,null,"",{"$f":"IFERROR(IF(B402<\"\",SUMIFS(Sheet1!$L$4:$L$997,Sheet1!$F$4:$F$997,B402,Sheet1!$Z$4:$Z$997,$H$3)+F402/SUMIFS(Sheet1!$H$4:$H$997,Sheet1!$F$4:$F$997,B402,Sheet1!$Z$4:$Z$997,$H$3),F402/D402),\"\")","v":""},""]
[null,null,null,null,null,null,null,{"$f":"SUMIFS(Sheet1!$H$4:$H$1497,Sheet1!$F$4:$F$1497,B404,Sheet1!$Z$4:$Z$1497,$H$3)","v":0},null,{"$f":"SUMIFS(Sheet1!$H$4:$H$1497,Sheet1!$F$4:$F$1497,B404,Sheet1!$Z$4:$Z$1497,$J$3)","v":0},null,null,"",{"$f":"IFERROR(IF(B403<\"\",SUMIFS(Sheet1!$L$4:$L$997,Sheet1!$F$4:$F$997,B403,Sheet1!$Z$4:$Z$997,$H$3)+F403/SUMIFS(Sheet1!$H$4:$H$997,Sheet1!$F$4:$F$997,B403,Sheet1!$Z$4:$Z$997,$H$3),F403/D403),\"\")","v":""},""]
[null,null,null,null,null,null,null,{"$f":"SUMIFS(Sheet1!$H$4:$H$1497,Sheet1!$F$4:$F$1497,B405,Sheet1!$Z$4:$Z$1497,$H$3)","v":0},null,{"$f":"SUMIFS(Sheet1!$H$4:$H$1497,Sheet1!$F$4:$F$1497,B405,Sheet1!$Z$4:$Z$1497,$J$3)","v":0},null,null,"",{"$f":"IFERROR(IF(B404<\"\",SUMIFS(Sheet1!$L$4:$L$997,Sheet1!$F$4:$F$997,B404,Sheet1!$Z$4:$Z$997,$H$3)+F404/SUMIFS(Sheet1!$H$4:$H$997,Sheet1!$F$4:$F$997,B404,Sheet1!$Z$4:$Z$997,$H$3),F404/D404),\"\")","v":""},""]
[null,null,null,null,null,null,null,{"$f":"SUMIFS(Sheet1!$H$4:$H$1497,Sheet1!$F$4:$F$1497,B406,Sheet1!$Z$4:$Z$1497,$H$3)","v":0},null,{"$f":"SUMIFS(Sheet1!$H$4:$H$1497,Sheet1!$F$4:$F$1497,B406,Sheet1!$Z$4:$Z$1497,$J$3)","v":0},null,null,"",{"$f":"IFERROR(IF(B405<\"\",SUMIFS(Sheet1!$L$4:$L$997,Sheet1!$F$4:$F$997,B405,Sheet1!$Z$4:$Z$997,$H$3)+F405/SUMIFS(Sheet1!$H$4:$H$997,Sheet1!$F$4:$F$997,B405,Sheet1!$Z$4:$Z$997,$H$3),F405/D405),\"\")","v":""},""]
[null,null,null,null,null,null,null,{"$f":"SUMIFS(Sheet1!$H$4:$H$1497,Sheet1!$F$4:$F$1497,B407,Sheet1!$Z$4:$Z$1497,$H$3)","v":0},null,{"$f":"SUMIFS(Sheet1!$H$4:$H$1497,Sheet1!$F$4:$F$1497,B407,Sheet1!$Z$4:$Z$1497,$J$3)","v":0},null,null,"",{"$f":"IFERROR(IF(B406<\"\",SUMIFS(Sheet1!$L$4:$L$997,Sheet1!$F$4:$F$997,B406,Sheet1!$Z$4:$Z$997,$H$3)+F406/SUMIFS(Sheet1!$H$4:$H$997,Sheet1!$F$4:$F$997,B406,Sheet1!$Z$4:$Z$997,$H$3),F406/D406),\"\")","v":""},""]
[null,null,null,null,null,null,null,{"$f":"SUMIFS(Sheet1!$H$4:$H$1497,Sheet1!$F$4:$F$1497,B408,Sheet1!$Z$4:$Z$1497,$H$3)","v":0},null,{"$f":"SUMIFS(Sheet1!$H$4:$H$1497,Sheet1!$F$4:$F$1497,B408,Sheet1!$Z$4:$Z$1497,$J$3)","v":0},null,null,"",{"$f":"IFERROR(IF(B407<\"\",SUMIFS(Sheet1!$L$4:$L$997,Sheet1!$F$4:$F$997,B407,Sheet1!$Z$4:$Z$997,$H$3)+F407/SUMIFS(Sheet1!$H$4:$H$997,Sheet1!$F$4:$F$997,B407,Sheet1!$Z$4:$Z$997,$H$3),F407/D407),\"\")","v":""},""]
[null,null,null,null,null,null,null,{"$f":"SUMIFS(Sheet1!$H$4:$H$1497,Sheet1!$F$4:$F$1497,B409,Sheet1!$Z$4:$Z$1497,$H$3)","v":0},null,{"$f":"SUMIFS(Sheet1!$H$4:$H$1497,Sheet1!$F$4:$F$1497,B409,Sheet1!$Z$4:$Z$1497,$J$3)","v":0},null,null,"",{"$f":"IFERROR(IF(B408<\"\",SUMIFS(Sheet1!$L$4:$L$997,Sheet1!$F$4:$F$997,B408,Sheet1!$Z$4:$Z$997,$H$3)+F408/SUMIFS(Sheet1!$H$4:$H$997,Sheet1!$F$4:$F$997,B408,Sheet1!$Z$4:$Z$997,$H$3),F408/D408),\"\")","v":""},""]
[null,null,null,null,null,null,null,{"$f":"SUMIFS(Sheet1!$H$4:$H$1497,Sheet1!$F$4:$F$1497,B410,Sheet1!$Z$4:$Z$1497,$H$3)","v":0},null,{"$f":"SUMIFS(Sheet1!$H$4:$H$1497,Sheet1!$F$4:$F$1497,B410,Sheet1!$Z$4:$Z$1497,$J$3)","v":0},null,null,"",{"$f":"IFERROR(IF(B409<\"\",SUMIFS(Sheet1!$L$4:$L$997,Sheet1!$F$4:$F$997,B409,Sheet1!$Z$4:$Z$997,$H$3)+F409/SUMIFS(Sheet1!$H$4:$H$997,Sheet1!$F$4:$F$997,B409,Sheet1!$Z$4:$Z$997,$H$3),F409/D409),\"\")","v":""},""]
[null,null,null,null,null,null,null,{"$f":"SUMIFS(Sheet1!$H$4:$H$1497,Sheet1!$F$4:$F$1497,B411,Sheet1!$Z$4:$Z$1497,$H$3)","v":0},null,{"$f":"SUMIFS(Sheet1!$H$4:$H$1497,Sheet1!$F$4:$F$1497,B411,Sheet1!$Z$4:$Z$1497,$J$3)","v":0},null,null,"",{"$f":"IFERROR(IF(B410<\"\",SUMIFS(Sheet1!$L$4:$L$997,Sheet1!$F$4:$F$997,B410,Sheet1!$Z$4:$Z$997,$H$3)+F410/SUMIFS(Sheet1!$H$4:$H$997,Sheet1!$F$4:$F$997,B410,Sheet1!$Z$4:$Z$997,$H$3),F410/D410),\"\")","v":""},""]
[null,null,null,null,null,null,null,{"$f":"SUMIFS(Sheet1!$H$4:$H$1497,Sheet1!$F$4:$F$1497,B412,Sheet1!$Z$4:$Z$1497,$H$3)","v":0},null,{"$f":"SUMIFS(Sheet1!$H$4:$H$1497,Sheet1!$F$4:$F$1497,B412,Sheet1!$Z$4:$Z$1497,$J$3)","v":0},null,null,"",{"$f":"IFERROR(IF(B411<\"\",SUMIFS(Sheet1!$L$4:$L$997,Sheet1!$F$4:$F$997,B411,Sheet1!$Z$4:$Z$997,$H$3)+F411/SUMIFS(Sheet1!$H$4:$H$997,Sheet1!$F$4:$F$997,B411,Sheet1!$Z$4:$Z$997,$H$3),F411/D411),\"\")","v":""},""]
[null,null,null,null,null,null,null,{"$f":"SUMIFS(Sheet1!$H$4:$H$1497,Sheet1!$F$4:$F$1497,B413,Sheet1!$Z$4:$Z$1497,$H$3)","v":0},null,{"$f":"SUMIFS(Sheet1!$H$4:$H$1497,Sheet1!$F$4:$F$1497,B413,Sheet1!$Z$4:$Z$1497,$J$3)","v":0},null,null,"",{"$f":"IFERROR(IF(B412<\"\",SUMIFS(Sheet1!$L$4:$L$997,Sheet1!$F$4:$F$997,B412,Sheet1!$Z$4:$Z$997,$H$3)+F412/SUMIFS(Sheet1!$H$4:$H$997,Sheet1!$F$4:$F$997,B412,Sheet1!$Z$4:$Z$997,$H$3),F412/D412),\"\")","v":""},""]
[null,null,null,null,null,null,null,{"$f":"SUMIFS(Sheet1!$H$4:$H$1497,Sheet1!$F$4:$F$1497,B414,Sheet1!$Z$4:$Z$1497,$H$3)","v":0},null,{"$f":"SUMIFS(Sheet1!$H$4:$H$1497,Sheet1!$F$4:$F$1497,B414,Sheet1!$Z$4:$Z$1497,$J$3)","v":0},null,null,"",{"$f":"IFERROR(IF(B413<\"\",SUMIFS(Sheet1!$L$4:$L$997,Sheet1!$F$4:$F$997,B413,Sheet1!$Z$4:$Z$997,$H$3)+F413/SUMIFS(Sheet1!$H$4:$H$997,Sheet1!$F$4:$F$997,B413,Sheet1!$Z$4:$Z$997,$H$3),F413/D413),\"\")","v":""},""]
[null,null,null,null,null,null,null,{"$f":"SUMIFS(Sheet1!$H$4:$H$1497,Sheet1!$F$4:$F$1497,B415,Sheet1!$Z$4:$Z$1497,$H$3)","v":0},null,{"$f":"SUMIFS(Sheet1!$H$4:$H$1497,Sheet1!$F$4:$F$1497,B415,Sheet1!$Z$4:$Z$1497,$J$3)","v":0},null,null,"",{"$f":"IFERROR(IF(B414<\"\",SUMIFS(Sheet1!$L$4:$L$997,Sheet1!$F$4:$F$997,B414,Sheet1!$Z$4:$Z$997,$H$3)+F414/SUMIFS(Sheet1!$H$4:$H$997,Sheet1!$F$4:$F$997,B414,Sheet1!$Z$4:$Z$997,$H$3),F414/D414),\"\")","v":""},""]
[null,null,null,null,null,null,null,{"$f":"SUMIFS(Sheet1!$H$4:$H$1497,Sheet1!$F$4:$F$1497,B416,Sheet1!$Z$4:$Z$1497,$H$3)","v":0},null,{"$f":"SUMIFS(Sheet1!$H$4:$H$1497,Sheet1!$F$4:$F$1497,B416,Sheet1!$Z$4:$Z$1497,$J$3)","v":0},null,null,"",{"$f":"IFERROR(IF(B415<\"\",SUMIFS(Sheet1!$L$4:$L$997,Sheet1!$F$4:$F$997,B415,Sheet1!$Z$4:$Z$997,$H$3)+F415/SUMIFS(Sheet1!$H$4:$H$997,Sheet1!$F$4:$F$997,B415,Sheet1!$Z$4:$Z$997,$H$3),F415/D415),\"\")","v":""},""]
[null,null,null,null,null,null,null,{"$f":"SUMIFS(Sheet1!$H$4:$H$1497,Sheet1!$F$4:$F$1497,B417,Sheet1!$Z$4:$Z$1497,$H$3)","v":0},null,{"$f":"SUMIFS(Sheet1!$H$4:$H$1497,Sheet1!$F$4:$F$1497,B417,Sheet1!$Z$4:$Z$1497,$J$3)","v":0},null,null,"",{"$f":"IFERROR(IF(B416<\"\",SUMIFS(Sheet1!$L$4:$L$997,Sheet1!$F$4:$F$997,B416,Sheet1!$Z$4:$Z$997,$H$3)+F416/SUMIFS(Sheet1!$H$4:$H$997,Sheet1!$F$4:$F$997,B416,Sheet1!$Z$4:$Z$997,$H$3),F416/D416),\"\")","v":""},""]
[null,null,null,null,null,null,null,{"$f":"SUMIFS(Sheet1!$H$4:$H$1497,Sheet1!$F$4:$F$1497,B418,Sheet1!$Z$4:$Z$1497,$H$3)","v":0},null,{"$f":"SUMIFS(Sheet1!$H$4:$H$1497,Sheet1!$F$4:$F$1497,B418,Sheet1!$Z$4:$Z$1497,$J$3)","v":0},null,null,"",{"$f":"IFERROR(IF(B417<\"\",SUMIFS(Sheet1!$L$4:$L$997,Sheet1!$F$4:$F$997,B417,Sheet1!$Z$4:$Z$997,$H$3)+F417/SUMIFS(Sheet1!$H$4:$H$997,Sheet1!$F$4:$F$997,B417,Sheet1!$Z$4:$Z$997,$H$3),F417/D417),\"\")","v":""},""]
[null,null,null,null,null,null,null,{"$f":"SUMIFS(Sheet1!$H$4:$H$1497,Sheet1!$F$4:$F$1497,B419,Sheet1!$Z$4:$Z$1497,$H$3)","v":0},null,{"$f":"SUMIFS(Sheet1!$H$4:$H$1497,Sheet1!$F$4:$F$1497,B419,Sheet1!$Z$4:$Z$1497,$J$3)","v":0},null,null,"",{"$f":"IFERROR(IF(B418<\"\",SUMIFS(Sheet1!$L$4:$L$997,Sheet1!$F$4:$F$997,B418,Sheet1!$Z$4:$Z$997,$H$3)+F418/SUMIFS(Sheet1!$H$4:$H$997,Sheet1!$F$4:$F$997,B418,Sheet1!$Z$4:$Z$997,$H$3),F418/D418),\"\")","v":""},""]
[null,null,null,null,null,null,null,{"$f":"SUMIFS(Sheet1!$H$4:$H$1497,Sheet1!$F$4:$F$1497,B420,Sheet1!$Z$4:$Z$1497,$H$3)","v":0},null,{"$f":"SUMIFS(Sheet1!$H$4:$H$1497,Sheet1!$F$4:$F$1497,B420,Sheet1!$Z$4:$Z$1497,$J$3)","v":0},null,null,"",{"$f":"IFERROR(IF(B419<\"\",SUMIFS(Sheet1!$L$4:$L$997,Sheet1!$F$4:$F$997,B419,Sheet1!$Z$4:$Z$997,$H$3)+F419/SUMIFS(Sheet1!$H$4:$H$997,Sheet1!$F$4:$F$997,B419,Sheet1!$Z$4:$Z$997,$H$3),F419/D419),\"\")","v":""},""]
[null,null,null,null,null,null,null,{"$f":"SUMIFS(Sheet1!$H$4:$H$1497,Sheet1!$F$4:$F$1497,B421,Sheet1!$Z$4:$Z$1497,$H$3)","v":0},null,{"$f":"SUMIFS(Sheet1!$H$4:$H$1497,Sheet1!$F$4:$F$1497,B421,Sheet1!$Z$4:$Z$1497,$J$3)","v":0},null,null,"",{"$f":"IFERROR(IF(B420<\"\",SUMIFS(Sheet1!$L$4:$L$997,Sheet1!$F$4:$F$997,B420,Sheet1!$Z$4:$Z$997,$H$3)+F420/SUMIFS(Sheet1!$H$4:$H$997,Sheet1!$F$4:$F$997,B420,Sheet1!$Z$4:$Z$997,$H$3),F420/D420),\"\")","v":""},""]
[null,null,null,null,null,null,null,{"$f":"SUMIFS(Sheet1!$H$4:$H$1497,Sheet1!$F$4:$F$1497,B422,Sheet1!$Z$4:$Z$1497,$H$3)","v":0},null,{"$f":"SUMIFS(Sheet1!$H$4:$H$1497,Sheet1!$F$4:$F$1497,B422,Sheet1!$Z$4:$Z$1497,$J$3)","v":0},null,null,"",{"$f":"IFERROR(IF(B421<\"\",SUMIFS(Sheet1!$L$4:$L$997,Sheet1!$F$4:$F$997,B421,Sheet1!$Z$4:$Z$997,$H$3)+F421/SUMIFS(Sheet1!$H$4:$H$997,Sheet1!$F$4:$F$997,B421,Sheet1!$Z$4:$Z$997,$H$3),F421/D421),\"\")","v":""},""]
[null,null,null,null,null,null,null,{"$f":"SUMIFS(Sheet1!$H$4:$H$1497,Sheet1!$F$4:$F$1497,B423,Sheet1!$Z$4:$Z$1497,$H$3)","v":0},null,{"$f":"SUMIFS(Sheet1!$H$4:$H$1497,Sheet1!$F$4:$F$1497,B423,Sheet1!$Z$4:$Z$1497,$J$3)","v":0},null,null,"",{"$f":"IFERROR(IF(B422<\"\",SUMIFS(Sheet1!$L$4:$L$997,Sheet1!$F$4:$F$997,B422,Sheet1!$Z$4:$Z$997,$H$3)+F422/SUMIFS(Sheet1!$H$4:$H$997,Sheet1!$F$4:$F$997,B422,Sheet1!$Z$4:$Z$997,$H$3),F422/D422),\"\")","v":""},""]
[null,null,null,null,null,null,null,{"$f":"SUMIFS(Sheet1!$H$4:$H$1497,Sheet1!$F$4:$F$1497,B424,Sheet1!$Z$4:$Z$1497,$H$3)","v":0},null,{"$f":"SUMIFS(Sheet1!$H$4:$H$1497,Sheet1!$F$4:$F$1497,B424,Sheet1!$Z$4:$Z$1497,$J$3)","v":0},null,null,"",{"$f":"IFERROR(IF(B423<\"\",SUMIFS(Sheet1!$L$4:$L$997,Sheet1!$F$4:$F$997,B423,Sheet1!$Z$4:$Z$997,$H$3)+F423/SUMIFS(Sheet1!$H$4:$H$997,Sheet1!$F$4:$F$997,B423,Sheet1!$Z$4:$Z$997,$H$3),F423/D423),\"\")","v":""},""]
[null,null,null,null,null,null,null,{"$f":"SUMIFS(Sheet1!$H$4:$H$1497,Sheet1!$F$4:$F$1497,B425,Sheet1!$Z$4:$Z$1497,$H$3)","v":0},null,{"$f":"SUMIFS(Sheet1!$H$4:$H$1497,Sheet1!$F$4:$F$1497,B425,Sheet1!$Z$4:$Z$1497,$J$3)","v":0},null,null,"",{"$f":"IFERROR(IF(B424<\"\",SUMIFS(Sheet1!$L$4:$L$997,Sheet1!$F$4:$F$997,B424,Sheet1!$Z$4:$Z$997,$H$3)+F424/SUMIFS(Sheet1!$H$4:$H$997,Sheet1!$F$4:$F$997,B424,Sheet1!$Z$4:$Z$997,$H$3),F424/D424),\"\")","v":""},""]
[null,null,null,null,null,null,null,{"$f":"SUMIFS(Sheet1!$H$4:$H$1497,Sheet1!$F$4:$F$1497,B426,Sheet1!$Z$4:$Z$1497,$H$3)","v":0},null,{"$f":"SUMIFS(Sheet1!$H$4:$H$1497,Sheet1!$F$4:$F$1497,B426,Sheet1!$Z$4:$Z$1497,$J$3)","v":0},null,null,"",{"$f":"IFERROR(IF(B425<\"\",SUMIFS(Sheet1!$L$4:$L$997,Sheet1!$F$4:$F$997,B425,Sheet1!$Z$4:$Z$997,$H$3)+F425/SUMIFS(Sheet1!$H$4:$H$997,Sheet1!$F$4:$F$997,B425,Sheet1!$Z$4:$Z$997,$H$3),F425/D425),\"\")","v":""},""]
[null,null,null,null,null,null,null,{"$f":"SUMIFS(Sheet1!$H$4:$H$1497,Sheet1!$F$4:$F$1497,B427,Sheet1!$Z$4:$Z$1497,$H$3)","v":0},null,{"$f":"SUMIFS(Sheet1!$H$4:$H$1497,Sheet1!$F$4:$F$1497,B427,Sheet1!$Z$4:$Z$1497,$J$3)","v":0},null,null,"",{"$f":"IFERROR(IF(B426<\"\",SUMIFS(Sheet1!$L$4:$L$997,Sheet1!$F$4:$F$997,B426,Sheet1!$Z$4:$Z$997,$H$3)+F426/SUMIFS(Sheet1!$H$4:$H$997,Sheet1!$F$4:$F$997,B426,Sheet1!$Z$4:$Z$997,$H$3),F426/D426),\"\")","v":""},""]
[null,null,null,null,null,null,null,{"$f":"SUMIFS(Sheet1!$H$4:$H$1497,Sheet1!$F$4:$F$1497,B428,Sheet1!$Z$4:$Z$1497,$H$3)","v":0},null,{"$f":"SUMIFS(Sheet1!$H$4:$H$1497,Sheet1!$F$4:$F$1497,B428,Sheet1!$Z$4:$Z$1497,$J$3)","v":0},null,null,"",{"$f":"IFERROR(IF(B427<\"\",SUMIFS(Sheet1!$L$4:$L$997,Sheet1!$F$4:$F$997,B427,Sheet1!$Z$4:$Z$997,$H$3)+F427/SUMIFS(Sheet1!$H$4:$H$997,Sheet1!$F$4:$F$997,B427,Sheet1!$Z$4:$Z$997,$H$3),F427/D427),\"\")","v":""},""]
[null,null,null,null,null,null,null,{"$f":"SUMIFS(Sheet1!$H$4:$H$1497,Sheet1!$F$4:$F$1497,B429,Sheet1!$Z$4:$Z$1497,$H$3)","v":0},null,{"$f":"SUMIFS(Sheet1!$H$4:$H$1497,Sheet1!$F$4:$F$1497,B429,Sheet1!$Z$4:$Z$1497,$J$3)","v":0},null,null,"",{"$f":"IFERROR(IF(B428<\"\",SUMIFS(Sheet1!$L$4:$L$997,Sheet1!$F$4:$F$997,B428,Sheet1!$Z$4:$Z$997,$H$3)+F428/SUMIFS(Sheet1!$H$4:$H$997,Sheet1!$F$4:$F$997,B428,Sheet1!$Z$4:$Z$997,$H$3),F428/D428),\"\")","v":""},""]
[null,null,null,null,null,null,null,{"$f":"SUMIFS(Sheet1!$H$4:$H$1497,Sheet1!$F$4:$F$1497,B430,Sheet1!$Z$4:$Z$1497,$H$3)","v":0},null,{"$f":"SUMIFS(Sheet1!$H$4:$H$1497,Sheet1!$F$4:$F$1497,B430,Sheet1!$Z$4:$Z$1497,$J$3)","v":0},null,null,"",{"$f":"IFERROR(IF(B429<\"\",SUMIFS(Sheet1!$L$4:$L$997,Sheet1!$F$4:$F$997,B429,Sheet1!$Z$4:$Z$997,$H$3)+F429/SUMIFS(Sheet1!$H$4:$H$997,Sheet1!$F$4:$F$997,B429,Sheet1!$Z$4:$Z$997,$H$3),F429/D429),\"\")","v":""},""]

{"sheet":"Sheet3","index":2,"n_rows":306,"n_cols":41,"rows_kept":306,"cut":false,"hidden":true,"merged":[]}
[null,null,null,null,null,null,null,null,null,null,null,null,null,null,null,null,null,">=","<=",null,null,null,null,null,null,null,null,null,null,null,null,null,null,null,null,null,null,null,null,">=","<="]
[]
["تاريخ","2018-03-01",null,null,"اسم الصنف",null,null,"المخزن المخصص",null,null,"رصيد اول",{"$f":"INDEX(Sheet2!$D$4:$D$1000,MATCH(E4,Sheet2!$B$4:$B$600,0))","v":{"$error":"#N/A"}},{"$f":"INDEX(Sheet2!D4:D10000,MATCH(E4,Sheet2!$B$4:$B$600,0))","v":{"$error":"#N/A"}}]
["تاريخ","2018-03-29",null,null,"زيت فتيس باور ",null,null,"مخزن الدلتا",null,null,"رصيد الحالي",{"$f":"LOOKUP(9999999,$K$11:$K$1500)","v":{"$error":"#N/A"}},{"$f":"LOOKUP(9999999,K11:K1500)","v":{"$error":"#N/A"}}]
["تاريخ","تاريخ","رقم الفاتورة","كود المورد","أسم المورد","كود الصنف","أسم الصنف","الفئة","كمية الوارد","كمية المنصرف","عرض مجاني","سعرالشراء","قيمة الفاتورة","قيمة الصنف","تغير السعر","متوسط المخزن","متوسط الوحدة علي الفاتورة","كود المندوب","اسم المندوب","كود العميل","أسم العميل","إجمالي القيمة الأصلية","جملة خصم الصنف","نسبة الخصم الممنوح","أسم المحاسب","المستلم","نوع الفاتورة","مخزن مخصص","مخزن محول"]
[{"$f":"$R$1&$B$3","v":">=43160"},{"$f":"$S$1&$B$4","v":"<=43188"},null,null,null,null,{"$f":"$E$4","v":"زيت فتيس باور "},null,null,null,null,null,null,null,null,null,null,null,null,null,null,null,null,null,null,null,null,null,{"$f":"$H$4","v":"مخزن الدلتا"}]
[]
[]
[]
["تاريخ","رقم الفاتورة","نوع الفاتورة","كود الصنف","أسم الصنف","الفئة","كمية الوارد","كمية المنصرف","مخزن محول","مخزن مخصص","الرصيد"]
[null,null,null,null,null,null,null,null,null,null,{"$f":"SUMPRODUCT(L3+G11-H11-I11)","v":{"$error":"#N/A"}}]
[null,null,null,null,null,null,null,null,null,null,{"$f":"IF(E12<>\"\",SUMPRODUCT(K11+G12-H12-I12),\"\")","v":""}]
[null,null,null,null,null,null,null,null,null,null,{"$f":"IF(E13<>\"\",SUMPRODUCT(K12+G13-H13-I13),\"\")","v":""}]
[null,null,null,null,null,null,null,null,null,null,""]
[null,null,null,null,null,null,null,null,null,null,""]
[null,null,null,null,null,null,null,null,null,null,""]
[null,null,null,null,null,null,null,null,null,null,""]
[null,null,null,null,null,null,null,null,null,null,""]
[null,null,null,null,null,null,null,null,null,null,""]
[null,null,null,null,null,null,null,null,null,null,""]
[null,null,null,null,null,null,null,null,null,null,""]
[null,null,null,null,null,null,null,null,null,null,""]
[null,null,null,null,null,null,null,null,null,null,""]
[null,null,null,null,null,null,null,null,null,null,""]
[null,null,null,null,null,null,null,null,null,null,""]
[null,null,null,null,null,null,null,null,null,null,""]
[null,null,null,null,null,null,null,null,null,null,""]
[null,null,null,null,null,null,null,null,null,null,""]
[null,null,null,null,null,null,null,null,null,null,""]
[null,null,null,null,null,null,null,null,null,null,""]
[null,null,null,null,null,null,null,null,null,null,""]
[null,null,null,null,null,null,null,null,null,null,""]
[null,null,null,null,null,null,null,null,null,null,""]
[null,null,null,null,null,null,null,null,null,null,""]
[null,null,null,null,null,null,null,null,null,null,""]
[null,null,null,null,null,null,null,null,null,null,""]
[null,null,null,null,null,null,null,null,null,null,""]
[null,null,null,null,null,null,null,null,null,null,""]
[null,null,null,null,null,null,null,null,null,null,""]
[null,null,null,null,null,null,null,null,null,null,""]
[null,null,null,null,null,null,null,null,null,null,""]
[null,null,null,null,null,null,null,null,null,null,""]
[null,null,null,null,null,null,null,null,null,null,""]
[null,null,null,null,null,null,null,null,null,null,""]
[null,null,null,null,null,null,null,null,null,null,""]
[null,null,null,null,null,null,null,null,null,null,""]
[null,null,null,null,null,null,null,null,null,null,""]
[null,null,null,null,null,null,null,null,null,null,""]
[null,null,null,null,null,null,null,null,null,null,""]
[null,null,null,null,null,null,null,null,null,null,""]
[null,null,null,null,null,null,null,null,null,null,""]
[null,null,null,null,null,null,null,null,null,null,""]
[null,null,null,null,null,null,null,null,null,null,""]
[null,null,null,null,null,null,null,null,null,null,""]
[null,null,null,null,null,null,null,null,null,null,""]
[null,null,null,null,null,null,null,null,null,null,""]
[null,null,null,null,null,null,null,null,null,null,""]
[null,null,null,null,null,null,null,null,null,null,""]
[null,null,null,null,null,null,null,null,null,null,""]
[null,null,null,null,null,null,null,null,null,null,""]
[null,null,null,null,null,null,null,null,null,null,""]
[null,null,null,null,null,null,null,null,null,null,""]
[null,null,null,null,null,null,null,null,null,null,""]
[null,null,null,null,null,null,null,null,null,null,""]
[null,null,null,null,null,null,null,null,null,null,""]
[null,null,null,null,null,null,null,null,null,null,""]
[null,null,null,null,null,null,null,null,null,null,""]
[null,null,null,null,null,null,null,null,null,null,""]
[null,null,null,null,null,null,null,null,null,null,""]
[null,null,null,null,null,null,null,null,null,null,""]
[null,null,null,null,null,null,null,null,null,null,""]
[null,null,null,null,null,null,null,null,null,null,""]
[null,null,null,null,null,null,null,null,null,null,""]
[null,null,null,null,null,null,null,null,null,null,""]
[null,null,null,null,null,null,null,null,null,null,""]
[null,null,null,null,null,null,null,null,null,null,""]
[null,null,null,null,null,null,null,null,null,null,{"$f":"IF(E77<>\"\",SUMPRODUCT(K76+G77-H77-I77),\"\")","v":""}]
[null,null,null,null,null,null,null,null,null,null,""]
[null,null,null,null,null,null,null,null,null,null,""]
[null,null,null,null,null,null,null,null,null,null,""]
[null,null,null,null,null,null,null,null,null,null,""]
[null,null,null,null,null,null,null,null,null,null,""]
[null,null,null,null,null,null,null,null,null,null,""]
[null,null,null,null,null,null,null,null,null,null,""]
[null,null,null,null,null,null,null,null,null,null,""]
[null,null,null,null,null,null,null,null,null,null,""]
[null,null,null,null,null,null,null,null,null,null,""]
[null,null,null,null,null,null,null,null,null,null,""]
[null,null,null,null,null,null,null,null,null,null,""]
[null,null,null,null,null,null,null,null,null,null,""]
[null,null,null,null,null,null,null,null,null,null,""]
[null,null,null,null,null,null,null,null,null,null,""]
[null,null,null,null,null,null,null,null,null,null,""]
[null,null,null,null,null,null,null,null,null,null,""]
[null,null,null,null,null,null,null,null,null,null,""]
[null,null,null,null,null,null,null,null,null,null,""]
[null,null,null,null,null,null,null,null,null,null,""]
[null,null,null,null,null,null,null,null,null,null,""]
[null,null,null,null,null,null,null,null,null,null,""]
[null,null,null,null,null,null,null,null,null,null,""]
[null,null,null,null,null,null,null,null,null,null,""]
[null,null,null,null,null,null,null,null,null,null,""]
[null,null,null,null,null,null,null,null,null,null,""]
[null,null,null,null,null,null,null,null,null,null,""]
[null,null,null,null,null,null,null,null,null,null,""]
[null,null,null,null,null,null,null,null,null,null,""]
[null,null,null,null,null,null,null,null,null,null,""]
[null,null,null,null,null,null,null,null,null,null,""]
[null,null,null,null,null,null,null,null,null,null,""]
[null,null,null,null,null,null,null,null,null,null,""]
[null,null,null,null,null,null,null,null,null,null,""]
[null,null,null,null,null,null,null,null,null,null,""]
[null,null,null,null,null,null,null,null,null,null,""]
[null,null,null,null,null,null,null,null,null,null,""]
[null,null,null,null,null,null,null,null,null,null,""]
[null,null,null,null,null,null,null,null,null,null,""]
[null,null,null,null,null,null,null,null,null,null,""]
[null,null,null,null,null,null,null,null,null,null,""]
[null,null,null,null,null,null,null,null,null,null,""]
[null,null,null,null,null,null,null,null,null,null,""]
[null,null,null,null,null,null,null,null,null,null,""]
[null,null,null,null,null,null,null,null,null,null,""]
[null,null,null,null,null,null,null,null,null,null,""]
[null,null,null,null,null,null,null,null,null,null,""]
[null,null,null,null,null,null,null,null,null,null,""]
[null,null,null,null,null,null,null,null,null,null,""]
[null,null,null,null,null,null,null,null,null,null,""]
[null,null,null,null,null,null,null,null,null,null,""]
[null,null,null,null,null,null,null,null,null,null,""]
[null,null,null,null,null,null,null,null,null,null,""]
[null,null,null,null,null,null,null,null,null,null,""]
[null,null,null,null,null,null,null,null,null,null,""]
[null,null,null,null,null,null,null,null,null,null,""]
[null,null,null,null,null,null,null,null,null,null,""]
[null,null,null,null,null,null,null,null,null,null,""]
[null,null,null,null,null,null,null,null,null,null,""]
[null,null,null,null,null,null,null,null,null,null,""]
[null,null,null,null,null,null,null,null,null,null,""]
[null,null,null,null,null,null,null,null,null,null,""]
[null,null,null,null,null,null,null,null,null,null,""]
[null,null,null,null,null,null,null,null,null,null,{"$f":"IF(E141<>\"\",SUMPRODUCT(K140+G141-H141-I141),\"\")","v":""}]
[null,null,null,null,null,null,null,null,null,null,""]
[null,null,null,null,null,null,null,null,null,null,""]
[null,null,null,null,null,null,null,null,null,null,""]
[null,null,null,null,null,null,null,null,null,null,""]
[null,null,null,null,null,null,null,null,null,null,""]
[null,null,null,null,null,null,null,null,null,null,""]
[null,null,null,null,null,null,null,null,null,null,""]
[null,null,null,null,null,null,null,null,null,null,""]
[null,null,null,null,null,null,null,null,null,null,""]
[null,null,null,null,null,null,null,null,null,null,""]
[null,null,null,null,null,null,null,null,null,null,""]
[null,null,null,null,null,null,null,null,null,null,""]
[null,null,null,null,null,null,null,null,null,null,""]
[null,null,null,null,null,null,null,null,null,null,""]
[null,null,null,null,null,null,null,null,null,null,""]
[null,null,null,null,null,null,null,null,null,null,""]
[null,null,null,null,null,null,null,null,null,null,""]
[null,null,null,null,null,null,null,null,null,null,""]
[null,null,null,null,null,null,null,null,null,null,""]
[null,null,null,null,null,null,null,null,null,null,""]
[null,null,null,null,null,null,null,null,null,null,""]
[null,null,null,null,null,null,null,null,null,null,""]
[null,null,null,null,null,null,null,null,null,null,""]
[null,null,null,null,null,null,null,null,null,null,""]
[null,null,null,null,null,null,null,null,null,null,""]
[null,null,null,null,null,null,null,null,null,null,""]
[null,null,null,null,null,null,null,null,null,null,""]
[null,null,null,null,null,null,null,null,null,null,""]
[null,null,null,null,null,null,null,null,null,null,""]
[null,null,null,null,null,null,null,null,null,null,""]
[null,null,null,null,null,null,null,null,null,null,""]
[null,null,null,null,null,null,null,null,null,null,""]
[null,null,null,null,null,null,null,null,null,null,""]
[null,null,null,null,null,null,null,null,null,null,""]
[null,null,null,null,null,null,null,null,null,null,""]
[null,null,null,null,null,null,null,null,null,null,""]
[null,null,null,null,null,null,null,null,null,null,""]
[null,null,null,null,null,null,null,null,null,null,""]
[null,null,null,null,null,null,null,null,null,null,""]
[null,null,null,null,null,null,null,null,null,null,""]
[null,null,null,null,null,null,null,null,null,null,""]
[null,null,null,null,null,null,null,null,null,null,""]
[null,null,null,null,null,null,null,null,null,null,""]
[null,null,null,null,null,null,null,null,null,null,""]
[null,null,null,null,null,null,null,null,null,null,""]
[null,null,null,null,null,null,null,null,null,null,""]
[null,null,null,null,null,null,null,null,null,null,""]
[null,null,null,null,null,null,null,null,null,null,""]
[null,null,null,null,null,null,null,null,null,null,""]
[null,null,null,null,null,null,null,null,null,null,""]
[null,null,null,null,null,null,null,null,null,null,""]
[null,null,null,null,null,null,null,null,null,null,""]
[null,null,null,null,null,null,null,null,null,null,""]
[null,null,null,null,null,null,null,null,null,null,""]
[null,null,null,null,null,null,null,null,null,null,""]
[null,null,null,null,null,null,null,null,null,null,""]
[null,null,null,null,null,null,null,null,null,null,""]
[null,null,null,null,null,null,null,null,null,null,""]
[null,null,null,null,null,null,null,null,null,null,""]
[null,null,null,null,null,null,null,null,null,null,""]
[null,null,null,null,null,null,null,null,null,null,""]
[null,null,null,null,null,null,null,null,null,null,""]
[null,null,null,null,null,null,null,null,null,null,""]
[null,null,null,null,null,null,null,null,null,null,{"$f":"IF(E205<>\"\",SUMPRODUCT(K204+G205-H205-I205),\"\")","v":""}]
[null,null,null,null,null,null,null,null,null,null,""]
[null,null,null,null,null,null,null,null,null,null,""]
[null,null,null,null,null,null,null,null,null,null,""]
[null,null,null,null,null,null,null,null,null,null,""]
[null,null,null,null,null,null,null,null,null,null,""]
[null,null,null,null,null,null,null,null,null,null,""]
[null,null,null,null,null,null,null,null,null,null,""]
[null,null,null,null,null,null,null,null,null,null,""]
[null,null,null,null,null,null,null,null,null,null,""]
[null,null,null,null,null,null,null,null,null,null,""]
[null,null,null,null,null,null,null,null,null,null,""]
[null,null,null,null,null,null,null,null,null,null,""]
[null,null,null,null,null,null,null,null,null,null,""]
[null,null,null,null,null,null,null,null,null,null,""]
[null,null,null,null,null,null,null,null,null,null,""]
[null,null,null,null,null,null,null,null,null,null,""]
[null,null,null,null,null,null,null,null,null,null,""]
[null,null,null,null,null,null,null,null,null,null,""]
[null,null,null,null,null,null,null,null,null,null,""]
[null,null,null,null,null,null,null,null,null,null,""]
[null,null,null,null,null,null,null,null,null,null,""]
[null,null,null,null,null,null,null,null,null,null,""]
[null,null,null,null,null,null,null,null,null,null,""]
[null,null,null,null,null,null,null,null,null,null,""]
[null,null,null,null,null,null,null,null,null,null,""]
[null,null,null,null,null,null,null,null,null,null,""]
[null,null,null,null,null,null,null,null,null,null,""]
[null,null,null,null,null,null,null,null,null,null,""]
[null,null,null,null,null,null,null,null,null,null,""]
[null,null,null,null,null,null,null,null,null,null,""]
[null,null,null,null,null,null,null,null,null,null,""]
[null,null,null,null,null,null,null,null,null,null,""]
[null,null,null,null,null,null,null,null,null,null,""]
[null,null,null,null,null,null,null,null,null,null,""]
[null,null,null,null,null,null,null,null,null,null,""]
[null,null,null,null,null,null,null,null,null,null,""]
[null,null,null,null,null,null,null,null,null,null,""]
[null,null,null,null,null,null,null,null,null,null,""]
[null,null,null,null,null,null,null,null,null,null,""]
[null,null,null,null,null,null,null,null,null,null,""]
[null,null,null,null,null,null,null,null,null,null,""]
[null,null,null,null,null,null,null,null,null,null,""]
[null,null,null,null,null,null,null,null,null,null,""]
[null,null,null,null,null,null,null,null,null,null,""]
[null,null,null,null,null,null,null,null,null,null,""]
[null,null,null,null,null,null,null,null,null,null,""]
[null,null,null,null,null,null,null,null,null,null,""]
[null,null,null,null,null,null,null,null,null,null,""]
[null,null,null,null,null,null,null,null,null,null,""]
[null,null,null,null,null,null,null,null,null,null,""]
[null,null,null,null,null,null,null,null,null,null,""]
[null,null,null,null,null,null,null,null,null,null,""]
[null,null,null,null,null,null,null,null,null,null,""]
[null,null,null,null,null,null,null,null,null,null,""]
[null,null,null,null,null,null,null,null,null,null,""]
[null,null,null,null,null,null,null,null,null,null,""]
[null,null,null,null,null,null,null,null,null,null,""]
[null,null,null,null,null,null,null,null,null,null,""]
[null,null,null,null,null,null,null,null,null,null,""]
[null,null,null,null,null,null,null,null,null,null,""]
[null,null,null,null,null,null,null,null,null,null,""]
[null,null,null,null,null,null,null,null,null,null,""]
[null,null,null,null,null,null,null,null,null,null,""]
[null,null,null,null,null,null,null,null,null,null,{"$f":"IF(E269<>\"\",SUMPRODUCT(K268+G269-H269-I269),\"\")","v":""}]
[null,null,null,null,null,null,null,null,null,null,""]
[null,null,null,null,null,null,null,null,null,null,""]
[null,null,null,null,null,null,null,null,null,null,""]
[null,null,null,null,null,null,null,null,null,null,""]
[null,null,null,null,null,null,null,null,null,null,""]
[null,null,null,null,null,null,null,null,null,null,""]
[null,null,null,null,null,null,null,null,null,null,""]
[null,null,null,null,null,null,null,null,null,null,""]
[null,null,null,null,null,null,null,null,null,null,""]
[null,null,null,null,null,null,null,null,null,null,""]
[null,null,null,null,null,null,null,null,null,null,""]
[null,null,null,null,null,null,null,null,null,null,""]
[null,null,null,null,null,null,null,null,null,null,""]
[null,null,null,null,null,null,null,null,null,null,""]
[null,null,null,null,null,null,null,null,null,null,""]
[null,null,null,null,null,null,null,null,null,null,""]
[null,null,null,null,null,null,null,null,null,null,""]
[null,null,null,null,null,null,null,null,null,null,""]
[null,null,null,null,null,null,null,null,null,null,""]
[null,null,null,null,null,null,null,null,null,null,""]
[null,null,null,null,null,null,null,null,null,null,""]
[null,null,null,null,null,null,null,null,null,null,""]
[null,null,null,null,null,null,null,null,null,null,""]
[null,null,null,null,null,null,null,null,null,null,""]
[null,null,null,null,null,null,null,null,null,null,""]
[null,null,null,null,null,null,null,null,null,null,""]
[null,null,null,null,null,null,null,null,null,null,""]
[null,null,null,null,null,null,null,null,null,null,""]
[null,null,null,null,null,null,null,null,null,null,""]
[null,null,null,null,null,null,null,null,null,null,""]
[null,null,null,null,null,null,null,null,null,null,""]
[null,null,null,null,null,null,null,null,null,null,""]
[null,null,null,null,null,null,null,null,null,null,""]
[null,null,null,null,null,null,null,null,null,null,""]
[null,null,null,null,null,null,null,null,null,null,""]
[null,null,null,null,null,null,null,null,null,null,""]
[null,null,null,null,null,null,null,null,null,null,""]

{"sheet":"Sheet4","index":3,"n_rows":48,"n_cols":108,"rows_kept":48,"cut":false,"hidden":true,"merged":[[14,52,14,53],[14,23,14,24],[14,25,14,26],[14,27,14,28],[9,23,9,24],[9,25,9,26],[9,27,9,28],[14,8,14,9],[14,2,14,3],[9,3,9,4],[14,4,14,5],[13,2,13,4],[9,5,9,6],[9,2,10,2],[9,7,9,8],[9,9,9,10],[9,0,10,0],[9,1,10,1],[14,0,15,0],[14,1,15,1],[14,6,14,7],[14,14,14,15],[14,16,14,17],[14,18,14,19],[14,12,14,13],[9,12,9,13],[9,14,9,15],[9,16,9,17],[9,18,9,19]]}
[null,null,null,null,null,null,null,null,null,{"$f":"NOW()","v":"2018-09-23T16:52:10.770"},{"$f":"ADDRESS(COUNTA(A17:A2000)+17,29)","v":"$AC$17"},null,null,null,null,null,null,null,null,{"$f":"ADDRESS(COUNTA(A17:A2000)+17,29)","v":"$AC$17"},null,null,null,null,null,"سندات قبض","سندات صرف",null,null,null,null,null,null,null,null,null,null,null,null,null,null,null,null,null,null,null,null,null,null,null,null,null,null,null,null,"سند قبض"]
[null,null,null,null,null,null,null,null,null,null,null,null,null,null,null,null,null,null,null,null,null,null,null,null,null,15005,20011,null,null,null,null,null,null,null,null,null,null,null,null,null,null,null,null,null,null,null,null,null,null,null,null,null,null,null,null,"سند صرف"]
[]
[]
[]
[]
[]
[]
["من","الى"]
["التاريخ","التاريخ","رقم الاذن",null,null,"رصيد أول المدة   Start Balance",null,"حركة الفترة   Turnover of Period",null,"رصيد أخر المدة Balance  ",null,null,null,null,"رصيد أول المدة ",null,"سيد",null,"رصيد أخر المدة Balance  ",null,null,null,null,"رصيد أول المدة   ",null,"الحركة النقدية للمندوب",null,"رصيد أخر المدة   ",null,null,null,null,null,null,null,null,null,null,null,null,"حركة المخزن للمندوب","اليوم"]
[null,null,null,"كود المورد ","أسم المــورد ","مدين  ","دائن ","مدين  ","دائن ","مدين  ","دائن ",null,"كود العميل ","أسم العميل     ","مدين   ","دائن ","مبيعات","سدادات","باقي","سداد",null,"كود المندوب","اسم المندوب","مديونية بره","تحصيلات","مبيعات المندوب","سدادات المندوب","مديونية بره","تحصيلات",null,null,null,"التاريخ","التاريخ","كود المندوب","إسم المندوب","كود الصنف ","اسم الصنف ","وحدة ألصنف","رصيد المندوب أول  اليوم","سحب","مرتجع","رصيد المندوب",null,null,"كود الصنف ","اسم الصنف ","الفئة الصنف ","كمية أول المدة","سعر اول","قيمة أول المدة"," المخزن- المخصص","مشتريات","عروض","مباع","رصيد أخرالمدة","حد الطلب","المطلوب","متوسط سعرالوحدة ","قيمة المخزون"]
[]
[null,null,null,null,null,null,null,null,null,null,null,null,null,null,null,null,null,null,null,null,null,null,null,null,null,null,null,null,null,null,null,null,null,null,null,"سيد ",null,null,null,null,null,null,null,null,null,"كود الصنف ","اسم الصنف ","الفئة الصنف ","رصيد أخرالمدة","متوسط سعرالوحدة "," المخزن- المخصص","حد الطلب","المطلوب"]
[null,null,null,null,null,null,null,null,null,null,null,null,null,null,null,null,null,null,null,null,null,null,null,null,null,null,null,null,null,null,null,null,null,null,null,null,null,null,null,null,null,null,null,null,null,null,null,null,null,null,null,null,"مطلوب"]
["التاريخ","رقم الاذن",null,null,"رصيد أول المدة   Start Balance",null,"حركة الفترة   Turnover of Period",null,"رصيد أخر المدة ",null,null,null,null,null,"رصيد أول المدة ",null,"حركة الفترة  ",null,"رصيد أخر المدة  ",null,null,null,null,"رصيد أول المدة   ",null,"الحركة النقدية للمندوب",null,"رصيد أخر المدة   ",null,null,null,null,null,null,null,null,null,null,null,null,null,"بتاريخ:/",{"$f":"NOW()","v":"2018-09-23T16:52:10.770"},null,null,{"$f":"Sheet2!CM3","v":"شركة  أبوفارس رمضان "},null,null,"نواقص المخزون",null,null,"بتاريخ:/",{"$f":"NOW()","v":"2018-09-23T16:52:10.770"}]
[null,null,"كود المورد ","أسم المــورد ","مدين  ","دائن ","مدين  ","دائن ","مدين  ","دائن ",null,null,"كود العميل ","أسم العميل     ","مدين   ","دائن ","مبيعات","سدادات","باقي","سداد",null,"كود المندوب","اسم المندوب","مديونية بره","تحصيلات","مبيعات المندوب","سدادات المندوب","مديونية بره","تحصيلات",null,null,null,null,null,"اسم العميل :/ ",{"$f":"IF(COUNTA(AJ18:AJ1004)=COUNTIF(AJ18:AJ1004,AJ18),AJ18,\"متعدد\")","v":"متعدد"},null,null,null,null,"حركة المخزن للمندوب","اليوم",null,null,null,"كود الصنف ","اسم الصنف ","الفئة الصنف ","رصيد أخرالمدة","متوسط سعرالوحدة "," المخزن- المخصص","حد الطلب","المطلوب"]
[null,null,1,"حموكشة",5200,null,5200,null,5200,null,null,null,2,"فارس رمضان",null,null,0,1500,"",1500,null,"000201","عباس فاروس",0,0,12,500,0,0,null,null,null,null,"التاريخ","كود المندوب","إسم المندوب","كود الصنف ","اسم الصنف ","وحدة ألصنف","رصيد المندوب أول  اليوم","سحب","مرتجع","رصيد المندوب",null,null,1010,"زيت شيل 9000","لتر",18,0,"مخزن  جملة",20,"مطلوب"]
[null,null,2,"سلمي",800,null,800,null,800,null,null,null,3,"حنين",null,null,600000,5230,594770,"",null,"000202","عبدالعال",20,12,0,780,20,12,null,null,null,null,"15/2/2018",222,"حموكشة",1,"مشمش","كيلو",1000,200,500,700,null,null,null,"عبش","لتر",20,1.25,"مخزن الحوامدية",40,"مطلوب"]
[null,null,2223,"أيمن حليتها",1000,null,1000,null,1000,null,null,null,4,"رمضان",null,null,15779,0,15779,"",null,"000203","محمد جابر",20,12,0,100,20,12,null,null,null,null,"15/2/2018",222,"حموكشة",222,"بطيخ","كيلو",50,20,30,40]
[null,null,23,"شركة أبو فرحة الاقمشة",200,null,200,null,200,null,null,null,5,"عبده",null,null,1050,0,1050,"",null,"000204","احمد صلاح ",200,52,0,780,200,52,null,null,null,null,"15/2/2018",222,"سيد ",1,"مشمش","كيلو",800,150,240,710]
[null,null,10000,"شركة الاحمدي",200,null,200,null,200,null,null,null,null,null,null,null,0,0,"","",null,"000205","ميدو الحاتي",1500,3200,0,780,1500,3200,null,null,null,null,"15/2/2018",222,"سيد ",222,"بطيخ","كيلو",20,30,11,39]
[null,null,null,"الديب للزيوت",120,null,120,null,120,null,null,null,null,null,null,null,0,0,"","",null,"206","hffdh",20,12,0,0,20,12]
[null,null,null,null,null,null,null,null,null,null,null,null,null,null,null,null,0,0,"","",null,"207","hgjfj",20,12,0,0,20,12]
[null,null,null,null,null,null,null,null,null,null,null,null,null,null,null,null,0,0,"","",null,"208","رمضان",200,52,0,0,200,52]
[null,null,null,null,null,null,null,null,null,null,null,null,null,null,null,null,0,0,"","",null,null,"أحمد الخزامي",1500,3200,0,0,1500,3200]
[null,null,null,null,null,null,null,null,null,null,null,null,null,null,null,null,0,0,"","",null,null,null,null,null,0,0,null,null,null,null,null,null,"2516-08-19","عباس فاروس",111,"شيش طاووك","بتر",1000,500,5,1495]
[null,null,null,null,null,null,null,null,null,null,null,null,null,null,null,null,0,0,"","",null,null,null,null,null,0,0,null,null,null,null,null,null,"1964-05-03","عبدالعال",22,"شاي أخضر","ك",1000,50,20,1030]
[null,null,null,null,null,null,null,null,null,null,null,null,null,null,null,null,0,0,"","",null,null,null,null,null,0,0]
[null,null,null,null,null,null,null,null,null,null,null,null,null,null,null,null,0,0,"","",null,null,null,null,null,0,0]
[null,null,null,null,null,null,null,null,null,null,null,null,null,null,null,null,null,null,null,null,null,null,null,null,null,0,0]
[null,null,null,null,null,null,null,null,null,null,null,null,null,null,null,null,null,null,null,null,null,null,null,null,null,0,0]
[null,null,null,null,null,null,null,null,null,null,null,null,null,null,null,null,null,null,null,null,null,null,null,null,null,0,0]
[null,null,null,null,null,null,null,null,null,null,null,null,null,null,null,null,null,null,null,null,null,null,null,null,null,0,0]
[null,null,null,null,null,null,null,null,null,null,null,null,null,null,null,null,null,null,null,null,null,null,null,null,null,0,0]
[null,null,null,null,null,null,null,null,null,null,null,null,null,null,null,null,null,null,null,null,null,null,null,null,null,0,0]
[null,null,null,null,null,null,null,null,null,null,null,null,null,null,null,null,null,null,null,null,null,null,null,null,null,0,0]
[null,null,null,null,null,null,null,null,null,null,null,null,null,null,null,null,null,null,null,null,null,null,null,null,null,0,0]
[null,null,null,null,null,null,null,null,null,null,null,null,null,null,null,null,null,null,null,null,null,null,null,null,null,0,0]
[]
[]
[null,null,null,null,null,null,null,null,null,null,null,null,null,null,null,null,null,null,null,null,null,null,null,null,null,null,null,null,null,null,null,null,null,null,null,null,null,null,null,null,null,null,null,44,45]
[]
[]
[]
[]
[]
[]
[null,null,null,null,null,null,null,null,null,null,11,12,null,null,null,null,null,null,null,null,21,null,null,null,null,null,null,null,null,30,31,32,33,null,null,null,null,null,null,null,null,null,null,44,45,null,null,null,null,null,null,null,null,null,null,null,null,null,null,null,61,62,63,64,65,66,67,68,69,70,71,72,73,74,75,76,77,78,79,80,81,82,83,84,85,86,87,88,89,90,91,92,93,94,95,96,97,98,99,100,101,102,103,104,105,106,107,108]

{"sheet":"Sheet5","index":4,"n_rows":544,"n_cols":29,"rows_kept":544,"cut":false,"hidden":true,"merged":[]}
[null,null,null,null,null,null,null,null,null,null,null,null,null,null,null,null,null,null,">=","<="]
["تاريخ",null,null,null,"اسم الصنف",null,null,"المخزن المخصص",null,null,null,null,"رصيد اول",{"$f":"SUMIF(Sheet2!$B$3:$B$1000,E3,Sheet2!$D$4:$D$1000)","v":0}]
["تاريخ",null,null,null,"شاي أخضر",null,null,"مخزن الدلتا",null,null,null,null,"رصيد الحالي",{"$f":"LOOKUP(99999999,$M$13:$M$2500)","v":-52}]
[]
[]
[]
["تاريخ","تاريخ","رقم الفاتورة","كود المورد","أسم المورد","كود الصنف","أسم الصنف","الفئة","كمية الوارد","كمية المنصرف","عرض مجاني","سعرالشراء","قيمة الفاتورة","قيمة الصنف","تغير السعر","متوسط المخزن","متوسط الوحدة علي الفاتورة","كود المندوب","اسم المندوب","كود العميل","أسم العميل","إجمالي القيمة الأصلية","جملة خصم الصنف","نسبة الخصم الممنوح","أسم المحاسب","المستلم","نوع الفاتورة","مخزن مخصص","مخزن محول"]
[]
[]
[]
[null,null,null,null,null,null,"الوراد","المنصرف",null,null,null,"بتاريخ:/",{"$f":"NOW()","v":"2018-09-23T16:52:10.770"}]
["تاريخ","نوع الفاتورة","رقم الفاتورة","كود الصنف","أسم الصنف","الفئة","كمية الوارد","كمية المنصرف","عرض مجاني","سعرالشراء","مخزن محول","مخزن مخصص","الرصيد ",null,"أسم المحاسب"]
["2018-03-01","مشتريات",null,22,"شيش طاووك","كيلو",500,null,0,21,null,"مخزن الدلتا",{"$f":"SUMPRODUCT(N2+G13-H13-K13)","v":500}]
["2018-03-02","مشتريات",223,22,"شاي أخضر","باكو",1820,null,null,36,null,"مخزن الدلتا",{"$f":"IF(E14<>\"\",SUMPRODUCT(N2+G13-H13-K13),\"\")","v":500}]
["2018-03-03","مبيعات",224,23,"شاي أخضر","باكو",null,23,null,21,null,"مخزن الدلتا",{"$f":"IF(E15<>\"\",SUMPRODUCT(N3+G14-H14-K14),\"\")","v":1768}]
["2018-03-04","مبيعات",225,111,"شيش طاووك",111,null,23,null,222,null,"مخزن الدلتا",-23]
["2018-03-05","مبيعات",226,111,"شيش طاووك","ك",null,23,null,45,null,"مخزن الدلتا",-23]
["2018-03-06","مبيعات",226,111,"شيش طاووك","طن",null,23,null,1000,null,"مخزن الدلتا",-23]
["2018-03-07","مبيعات",20001,111,"شيش طاووك","ك",null,23,null,23,null,"مخزن الدلتا",{"$error":"#VALUE!"}]
["2018-03-08",25,1,4,5,6,7,8,9,10,27,26,-23]
["2018-03-09","مبيعات",20001,"ك","شيش طاووك",111,null,23,null,20001,null,"ميدو",-28]
["2018-03-10","مبيعات",20001,1111,"شيش طاووك","كيلو",null,23,2,3,null,"ميدو",-23]
["2018-03-11","مبيعات",20001,"ك","شيش طاووك",111,null,23,null,20001,null,"كمال",-23]
["2018-03-12","مبيعات",20001,111,"شيش طاووك","ك",null,23,null,20001,null,"كمال",-23]
["2018-03-13","مبيعات",20001,111,"شيش طاووك","ك",null,23,null,20001,null,"كمال",-23]
["2018-03-21","مبيعات",20001,111,"شاي أخضر","باكو",null,23,0,18.5,null,"كمال",-23]
["2018-03-21","مشتريات",1500,110100,"زيت توتال 5000","لتر",null,480,0,52.192999999999998,null,"مخزن  جملة",-23]
["2018-03-22","مبيعات",20001,110100,"زيت توتال","لتر",null,4.5,0,52.912999999999997,null,"",-480]
["2018-03-23","مبيعات",20001,110100,"زيت توتال 5000","لتر",null,3,0,52.192999999999998,null,"مخزن  جملة",-4.5]
["2018-03-24","مشتريات",1500,110100,"زيت توتال 5000","لتر",null,40.5,0,52.192999999999998,null,"مخزن  جملة",-3]
["2019-02-08","مخزن الدلتا",222,"بطيخ","مخزن الدلتا","لترور",null,500,23,11500,null,"مخزن تجزئة",-40.5]
["2018-03-26","مخزن الحوامدية",555,null,"مخزن الحوامدية",null,650,null,3,1950,null,"مخزن  جملة",-500]
["29/3/2018","مخزن تجزئة",66666,null,"مشمش2",null,"مخزن تجزئة","لتر",85,null,null,"مخزن الدلتا",650]
["29/1/2019","مخزن الدلتا",33333,"بطيخ",null,null,null,88,null,2.2000000000000002,null,"مخزن  جملة",""]
["25/3/2018","مخزن الدلتا",3333,null,"بطخ",null,null,65,"كيلو",23,null,"مخزن  جملة",-88]
["2018-05-04","مخزن الدلتا",223,null,"كمتري","كيلو عرض",null,750,null,3,null,"مخزن  جملة",-65]
["2018-02-05","مخزن الدلتا",223,null,"lala22","لتر",null,475,null,23,null,"مخزن تجزئة",-750]
["2018-02-05","مخزن الدلتا",222,null,"مشمش","كيلو",null,850,null,22,null,"مخزن  جملة",-475]
["2018-02-05","مخزن الدلتا",333,null,"مشمش","كيلو",null,85,null,62,null,"مخزن  جملة",-850]
["23/3/2018","مبيعات",20001,23,"مشمش","كيلو",null,52,3,10,null,"كمال ",-85]
["23/3/2018","مبيعات",20001,22,"شاي أخضر","كيلو",null,120,null,20,null,"عباس فاروس",-52]
[null,null,null,null,null,null,null,null,null,null,null,null,""]
[null,null,null,null,null,null,null,null,null,null,null,null,""]
[null,null,null,null,null,null,null,null,null,null,null,null,""]
[null,null,null,null,null,null,null,null,null,null,null,null,""]
[null,null,null,null,null,null,null,null,null,null,null,null,""]
[null,null,null,null,null,null,null,null,null,null,null,null,""]
[null,null,null,null,null,null,null,null,null,null,null,null,""]
[null,null,null,null,null,null,null,null,null,null,null,null,""]
[null,null,null,null,null,null,null,null,null,null,null,null,""]
[null,null,null,null,null,null,null,null,null,null,null,null,""]
[null,null,null,null,null,null,null,null,null,null,null,null,""]
[null,null,null,null,null,null,null,null,null,null,null,null,""]
[null,null,null,null,null,null,null,null,null,null,null,null,""]
[null,null,null,null,null,null,null,null,null,null,null,null,""]
[null,null,null,null,null,null,null,null,null,null,null,null,""]
[null,null,null,null,null,null,null,null,null,null,null,null,""]
[null,null,null,null,null,null,null,null,null,null,null,null,""]
[null,null,null,null,null,null,null,null,null,null,null,null,""]
[null,null,null,null,null,null,null,null,null,null,null,null,""]
[null,null,null,null,null,null,null,null,null,null,null,null,""]
[null,null,null,null,null,null,null,null,null,null,null,null,""]
[null,null,null,null,null,null,null,null,null,null,null,null,""]
[null,null,null,null,null,null,null,null,null,null,null,null,""]
[null,null,null,null,null,null,null,null,null,null,null,null,""]
[null,null,null,null,null,null,null,null,null,null,null,null,""]
[null,null,null,null,null,null,null,null,null,null,null,null,""]
[null,null,null,null,null,null,null,null,null,null,null,null,""]
[null,null,null,null,null,null,null,null,null,null,null,null,""]
[null,null,null,null,null,null,null,null,null,null,null,null,""]
[null,null,null,null,null,null,null,null,null,null,null,null,""]
[null,null,null,null,null,null,null,null,null,null,null,null,""]
[null,null,null,null,null,null,null,null,null,null,null,null,""]
[null,null,null,null,null,null,null,null,null,null,null,null,""]
[null,null,null,null,null,null,null,null,null,null,null,null,""]
[null,null,null,null,null,null,null,null,null,null,null,null,""]
[null,null,null,null,null,null,null,null,null,null,null,null,""]
[null,null,null,null,null,null,null,null,null,null,null,null,""]
[null,null,null,null,null,null,null,null,null,null,null,null,{"$f":"IF(E79<>\"\",SUMPRODUCT(N67+G78-H78-K78),\"\")","v":""}]
[null,null,null,null,null,null,null,null,null,null,null,null,""]
[null,null,null,null,null,null,null,null,null,null,null,null,""]
[null,null,null,null,null,null,null,null,null,null,null,null,""]
[null,null,null,null,null,null,null,null,null,null,null,null,""]
[null,null,null,null,null,null,null,null,null,null,null,null,""]
[null,null,null,null,null,null,null,null,null,null,null,null,""]
[null,null,null,null,null,null,null,null,null,null,null,null,""]
[null,null,null,null,null,null,null,null,null,null,null,null,""]
[null,null,null,null,null,null,null,null,null,null,null,null,""]
[null,null,null,null,null,null,null,null,null,null,null,null,""]
[null,null,null,null,null,null,null,null,null,null,null,null,""]
[null,null,null,null,null,null,null,null,null,null,null,null,""]
[null,null,null,null,null,null,null,null,null,null,null,null,""]
[null,null,null,null,null,null,null,null,null,null,null,null,""]
[null,null,null,null,null,null,null,null,null,null,null,null,""]
[null,null,null,null,null,null,null,null,null,null,null,null,""]
[null,null,null,null,null,null,null,null,null,null,null,null,""]
[null,null,null,null,null,null,null,null,null,null,null,null,""]
[null,null,null,null,null,null,null,null,null,null,null,null,""]
[null,null,null,null,null,null,null,null,null,null,null,null,""]
[null,null,null,null,null,null,null,null,null,null,null,null,""]
[null,null,null,null,null,null,null,null,null,null,null,null,""]
[null,null,null,null,null,null,null,null,null,null,null,null,""]
[null,null,null,null,null,null,null,null,null,null,null,null,""]
[null,null,null,null,null,null,null,null,null,null,null,null,""]
[null,null,null,null,null,null,null,null,null,null,null,null,""]
[null,null,null,null,null,null,null,null,null,null,null,null,""]
[null,null,null,null,null,null,null,null,null,null,null,null,""]
[null,null,null,null,null,null,null,null,null,null,null,null,""]
[null,null,null,null,null,null,null,null,null,null,null,null,""]
[null,null,null,null,null,null,null,null,null,null,null,null,""]
[null,null,null,null,null,null,null,null,null,null,null,null,""]
[null,null,null,null,null,null,null,null,null,null,null,null,""]
[null,null,null,null,null,null,null,null,null,null,null,null,""]
[null,null,null,null,null,null,null,null,null,null,null,null,""]
[null,null,null,null,null,null,null,null,null,null,null,null,""]
[null,null,null,null,null,null,null,null,null,null,null,null,""]
[null,null,null,null,null,null,null,null,null,null,null,null,""]
[null,null,null,null,null,null,null,null,null,null,null,null,""]
[null,null,null,null,null,null,null,null,null,null,null,null,""]
[null,null,null,null,null,null,null,null,null,null,null,null,""]
[null,null,null,null,null,null,null,null,null,null,null,null,""]
[null,null,null,null,null,null,null,null,null,null,null,null,""]
[null,null,null,null,null,null,null,null,null,null,null,null,""]
[null,null,null,null,null,null,null,null,null,null,null,null,""]
[null,null,null,null,null,null,null,null,null,null,null,null,""]
[null,null,null,null,null,null,null,null,null,null,null,null,""]
[null,null,null,null,null,null,null,null,null,null,null,null,""]
[null,null,null,null,null,null,null,null,null,null,null,null,""]
[null,null,null,null,null,null,null,null,null,null,null,null,""]
[null,null,null,null,null,null,null,null,null,null,null,null,""]
[null,null,null,null,null,null,null,null,null,null,null,null,""]
[null,null,null,null,null,null,null,null,null,null,null,null,""]
[null,null,null,null,null,null,null,null,null,null,null,null,""]
[null,null,null,null,null,null,null,null,null,null,null,null,""]
[null,null,null,null,null,null,null,null,null,null,null,null,""]
[null,null,null,null,null,null,null,null,null,null,null,null,""]
[null,null,null,null,null,null,null,null,null,null,null,null,""]
[null,null,null,null,null,null,null,null,null,null,null,null,""]
[null,null,null,null,null,null,null,null,null,null,null,null,""]
[null,null,null,null,null,null,null,null,null,null,null,null,""]
[null,null,null,null,null,null,null,null,null,null,null,null,""]
[null,null,null,null,null,null,null,null,null,null,null,null,""]
[null,null,null,null,null,null,null,null,null,null,null,null,{"$f":"IF(E143<>\"\",SUMPRODUCT(N131+G142-H142-K142),\"\")","v":""}]
[null,null,null,null,null,null,null,null,null,null,null,null,""]
[null,null,null,null,null,null,null,null,null,null,null,null,""]
[null,null,null,null,null,null,null,null,null,null,null,null,""]
[null,null,null,null,null,null,null,null,null,null,null,null,""]
[null,null,null,null,null,null,null,null,null,null,null,null,""]
[null,null,null,null,null,null,null,null,null,null,null,null,""]
[null,null,null,null,null,null,null,null,null,null,null,null,""]
[null,null,null,null,null,null,null,null,null,null,null,null,""]
[null,null,null,null,null,null,null,null,null,null,null,null,""]
[null,null,null,null,null,null,null,null,null,null,null,null,""]
[null,null,null,null,null,null,null,null,null,null,null,null,""]
[null,null,null,null,null,null,null,null,null,null,null,null,""]
[null,null,null,null,null,null,null,null,null,null,null,null,""]
[null,null,null,null,null,null,null,null,null,null,null,null,""]
[null,null,null,null,null,null,null,null,null,null,null,null,""]
[null,null,null,null,null,null,null,null,null,null,null,null,""]
[null,null,null,null,null,null,null,null,null,null,null,null,""]
[null,null,null,null,null,null,null,null,null,null,null,null,""]
[null,null,null,null,null,null,null,null,null,null,null,null,""]
[null,null,null,null,null,null,null,null,null,null,null,null,""]
[null,null,null,null,null,null,null,null,null,null,null,null,""]
[null,null,null,null,null,null,null,null,null,null,null,null,""]
[null,null,null,null,null,null,null,null,null,null,null,null,""]
[null,null,null,null,null,null,null,null,null,null,null,null,""]
[null,null,null,null,null,null,null,null,null,null,null,null,""]
[null,null,null,null,null,null,null,null,null,null,null,null,""]
[null,null,null,null,null,null,null,null,null,null,null,null,""]
[null,null,null,null,null,null,null,null,null,null,null,null,""]
[null,null,null,null,null,null,null,null,null,null,null,null,""]
[null,null,null,null,null,null,null,null,null,null,null,null,""]
[null,null,null,null,null,null,null,null,null,null,null,null,""]
[null,null,null,null,null,null,null,null,null,null,null,null,""]
[null,null,null,null,null,null,null,null,null,null,null,null,""]
[null,null,null,null,null,null,null,null,null,null,null,null,""]
[null,null,null,null,null,null,null,null,null,null,null,null,""]
[null,null,null,null,null,null,null,null,null,null,null,null,""]
[null,null,null,null,null,null,null,null,null,null,null,null,""]
[null,null,null,null,null,null,null,null,null,null,null,null,""]
[null,null,null,null,null,null,null,null,null,null,null,null,""]
[null,null,null,null,null,null,null,null,null,null,null,null,""]
[null,null,null,null,null,null,null,null,null,null,null,null,""]
[null,null,null,null,null,null,null,null,null,null,null,null,""]
[null,null,null,null,null,null,null,null,null,null,null,null,""]
[null,null,null,null,null,null,null,null,null,null,null,null,""]
[null,null,null,null,null,null,null,null,null,null,null,null,""]
[null,null,null,null,null,null,null,null,null,null,null,null,""]
[null,null,null,null,null,null,null,null,null,null,null,null,""]
[null,null,null,null,null,null,null,null,null,null,null,null,""]
[null,null,null,null,null,null,null,null,null,null,null,null,""]
[null,null,null,null,null,null,null,null,null,null,null,null,""]
[null,null,null,null,null,null,null,null,null,null,null,null,""]
[null,null,null,null,null,null,null,null,null,null,null,null,""]
[null,null,null,null,null,null,null,null,null,null,null,null,""]
[null,null,null,null,null,null,null,null,null,null,null,null,""]
[null,null,null,null,null,null,null,null,null,null,null,null,""]
[null,null,null,null,null,null,null,null,null,null,null,null,""]
[null,null,null,null,null,null,null,null,null,null,null,null,""]
[null,null,null,null,null,null,null,null,null,null,null,null,""]
[null,null,null,null,null,null,null,null,null,null,null,null,""]
[null,null,null,null,null,null,null,null,null,null,null,null,""]
[null,null,null,null,null,null,null,null,null,null,null,null,""]
[null,null,null,null,null,null,null,null,null,null,null,null,""]
[null,null,null,null,null,null,null,null,null,null,null,null,""]
[null,null,null,null,null,null,null,null,null,null,null,null,{"$f":"IF(E207<>\"\",SUMPRODUCT(N195+G206-H206-K206),\"\")","v":""}]
[null,null,null,null,null,null,null,null,null,null,null,null,""]
[null,null,null,null,null,null,null,null,null,null,null,null,""]
[null,null,null,null,null,null,null,null,null,null,null,null,""]
[null,null,null,null,null,null,null,null,null,null,null,null,""]
[null,null,null,null,null,null,null,null,null,null,null,null,""]
[null,null,null,null,null,null,null,null,null,null,null,null,""]
[null,null,null,null,null,null,null,null,null,null,null,null,""]
[null,null,null,null,null,null,null,null,null,null,null,null,""]
[null,null,null,null,null,null,null,null,null,null,null,null,""]
[null,null,null,null,null,null,null,null,null,null,null,null,""]
[null,null,null,null,null,null,null,null,null,null,null,null,""]
[null,null,null,null,null,null,null,null,null,null,null,null,""]
[null,null,null,null,null,null,null,null,null,null,null,null,""]
[null,null,null,null,null,null,null,null,null,null,null,null,""]
[null,null,null,null,null,null,null,null,null,null,null,null,""]
[null,null,null,null,null,null,null,null,null,null,null,null,""]
[null,null,null,null,null,null,null,null,null,null,null,null,""]
[null,null,null,null,null,null,null,null,null,null,null,null,""]
[null,null,null,null,null,null,null,null,null,null,null,null,""]
[null,null,null,null,null,null,null,null,null,null,null,null,""]
[null,null,null,null,null,null,null,null,null,null,null,null,""]
[null,null,null,null,null,null,null,null,null,null,null,null,""]
[null,null,null,null,null,null,null,null,null,null,null,null,""]
[null,null,null,null,null,null,null,null,null,null,null,null,""]
[null,null,null,null,null,null,null,null,null,null,null,null,""]
[null,null,null,null,null,null,null,null,null,null,null,null,""]
[null,null,null,null,null,null,null,null,null,null,null,null,""]
[null,null,null,null,null,null,null,null,null,null,null,null,""]
[null,null,null,null,null,null,null,null,null,null,null,null,""]
[null,null,null,null,null,null,null,null,null,null,null,null,""]
[null,null,null,null,null,null,null,null,null,null,null,null,""]
[null,null,null,null,null,null,null,null,null,null,null,null,""]
[null,null,null,null,null,null,null,null,null,null,null,null,""]
[null,null,null,null,null,null,null,null,null,null,null,null,""]
[null,null,null,null,null,null,null,null,null,null,null,null,""]
[null,null,null,null,null,null,null,null,null,null,null,null,""]
[null,null,null,null,null,null,null,null,null,null,null,null,""]
[null,null,null,null,null,null,null,null,null,null,null,null,""]
[null,null,null,null,null,null,null,null,null,null,null,null,""]
[null,null,null,null,null,null,null,null,null,null,null,null,""]
[null,null,null,null,null,null,null,null,null,null,null,null,""]
[null,null,null,null,null,null,null,null,null,null,null,null,""]
[null,null,null,null,null,null,null,null,null,null,null,null,""]
[null,null,null,null,null,null,null,null,null,null,null,null,""]
[null,null,null,null,null,null,null,null,null,null,null,null,""]
[null,null,null,null,null,null,null,null,null,null,null,null,""]
[null,null,null,null,null,null,null,null,null,null,null,null,""]
[null,null,null,null,null,null,null,null,null,null,null,null,""]
[null,null,null,null,null,null,null,null,null,null,null,null,""]
[null,null,null,null,null,null,null,null,null,null,null,null,""]
[null,null,null,null,null,null,null,null,null,null,null,null,""]
[null,null,null,null,null,null,null,null,null,null,null,null,""]
[null,null,null,null,null,null,null,null,null,null,null,null,""]
[null,null,null,null,null,null,null,null,null,null,null,null,""]
[null,null,null,null,null,null,null,null,null,null,null,null,""]
[null,null,null,null,null,null,null,null,null,null,null,null,""]
[null,null,null,null,null,null,null,null,null,null,null,null,""]
[null,null,null,null,null,null,null,null,null,null,null,null,""]
[null,null,null,null,null,null,null,null,null,null,null,null,""]
[null,null,null,null,null,null,null,null,null,null,null,null,""]
[null,null,null,null,null,null,null,null,null,null,null,null,""]
[null,null,null,null,null,null,null,null,null,null,null,null,""]
[null,null,null,null,null,null,null,null,null,null,null,null,""]
[null,null,null,null,null,null,null,null,null,null,null,null,{"$f":"IF(E271<>\"\",SUMPRODUCT(N259+G270-H270-K270),\"\")","v":""}]
[null,null,null,null,null,null,null,null,null,null,null,null,""]
[null,null,null,null,null,null,null,null,null,null,null,null,""]
[null,null,null,null,null,null,null,null,null,null,null,null,""]
[null,null,null,null,null,null,null,null,null,null,null,null,""]
[null,null,null,null,null,null,null,null,null,null,null,null,""]
[null,null,null,null,null,null,null,null,null,null,null,null,""]
[null,null,null,null,null,null,null,null,null,null,null,null,""]
[null,null,null,null,null,null,null,null,null,null,null,null,""]
[null,null,null,null,null,null,null,null,null,null,null,null,""]
[null,null,null,null,null,null,null,null,null,null,null,null,""]
[null,null,null,null,null,null,null,null,null,null,null,null,""]
[null,null,null,null,null,null,null,null,null,null,null,null,""]
[null,null,null,null,null,null,null,null,null,null,null,null,""]
[null,null,null,null,null,null,null,null,null,null,null,null,""]
[null,null,null,null,null,null,null,null,null,null,null,null,""]
[null,null,null,null,null,null,null,null,null,null,null,null,""]
[null,null,null,null,null,null,null,null,null,null,null,null,""]
[null,null,null,null,null,null,null,null,null,null,null,null,""]
[null,null,null,null,null,null,null,null,null,null,null,null,""]
[null,null,null,null,null,null,null,null,null,null,null,null,""]
[null,null,null,null,null,null,null,null,null,null,null,null,""]
[null,null,null,null,null,null,null,null,null,null,null,null,""]
[null,null,null,null,null,null,null,null,null,null,null,null,""]
[null,null,null,null,null,null,null,null,null,null,null,null,""]
[null,null,null,null,null,null,null,null,null,null,null,null,""]
[null,null,null,null,null,null,null,null,null,null,null,null,""]
[null,null,null,null,null,null,null,null,null,null,null,null,""]
[null,null,null,null,null,null,null,null,null,null,null,null,""]
[null,null,null,null,null,null,null,null,null,null,null,null,""]
[null,null,null,null,null,null,null,null,null,null,null,null,""]
[null,null,null,null,null,null,null,null,null,null,null,null,""]
[null,null,null,null,null,null,null,null,null,null,null,null,""]
[null,null,null,null,null,null,null,null,null,null,null,null,""]
[null,null,null,null,null,null,null,null,null,null,null,null,""]
[null,null,null,null,null,null,null,null,null,null,null,null,""]
[null,null,null,null,null,null,null,null,null,null,null,null,""]
[null,null,null,null,null,null,null,null,null,null,null,null,""]
[null,null,null,null,null,null,null,null,null,null,null,null,""]
[null,null,null,null,null,null,null,null,null,null,null,null,""]
[null,null,null,null,null,null,null,null,null,null,null,null,""]
[null,null,null,null,null,null,null,null,null,null,null,null,""]
[null,null,null,null,null,null,null,null,null,null,null,null,""]
[null,null,null,null,null,null,null,null,null,null,null,null,""]
[null,null,null,null,null,null,null,null,null,null,null,null,""]
[null,null,null,null,null,null,null,null,null,null,null,null,""]
[null,null,null,null,null,null,null,null,null,null,null,null,""]
[null,null,null,null,null,null,null,null,null,null,null,null,""]
[null,null,null,null,null,null,null,null,null,null,null,null,""]
[null,null,null,null,null,null,null,null,null,null,null,null,""]
[null,null,null,null,null,null,null,null,null,null,null,null,""]
[null,null,null,null,null,null,null,null,null,null,null,null,""]
[null,null,null,null,null,null,null,null,null,null,null,null,""]
[null,null,null,null,null,null,null,null,null,null,null,null,""]
[null,null,null,null,null,null,null,null,null,null,null,null,""]
[null,null,null,null,null,null,null,null,null,null,null,null,""]
[null,null,null,null,null,null,null,null,null,null,null,null,""]
[null,null,null,null,null,null,null,null,null,null,null,null,""]
[null,null,null,null,null,null,null,null,null,null,null,null,""]
[null,null,null,null,null,null,null,null,null,null,null,null,""]
[null,null,null,null,null,null,null,null,null,null,null,null,""]
[null,null,null,null,null,null,null,null,null,null,null,null,""]
[null,null,null,null,null,null,null,null,null,null,null,null,""]
[null,null,null,null,null,null,null,null,null,null,null,null,""]
[null,null,null,null,null,null,null,null,null,null,null,null,{"$f":"IF(E335<>\"\",SUMPRODUCT(N323+G334-H334-K334),\"\")","v":""}]
[null,null,null,null,null,null,null,null,null,null,null,null,""]
[null,null,null,null,null,null,null,null,null,null,null,null,""]
[null,null,null,null,null,null,null,null,null,null,null,null,""]
[null,null,null,null,null,null,null,null,null,null,null,null,""]
[null,null,null,null,null,null,null,null,null,null,null,null,""]
[null,null,null,null,null,null,null,null,null,null,null,null,""]
[null,null,null,null,null,null,null,null,null,null,null,null,""]
[null,null,null,null,null,null,null,null,null,null,null,null,""]
[null,null,null,null,null,null,null,null,null,null,null,null,""]
[null,null,null,null,null,null,null,null,null,null,null,null,""]
[null,null,null,null,null,null,null,null,null,null,null,null,""]
[null,null,null,null,null,null,null,null,null,null,null,null,""]
[null,null,null,null,null,null,null,null,null,null,null,null,""]
[null,null,null,null,null,null,null,null,null,null,null,null,""]
[null,null,null,null,null,null,null,null,null,null,null,null,""]
[null,null,null,null,null,null,null,null,null,null,null,null,""]
[null,null,null,null,null,null,null,null,null,null,null,null,""]
[null,null,null,null,null,null,null,null,null,null,null,null,""]
[null,null,null,null,null,null,null,null,null,null,null,null,""]
[null,null,null,null,null,null,null,null,null,null,null,null,""]
[null,null,null,null,null,null,null,null,null,null,null,null,""]
[null,null,null,null,null,null,null,null,null,null,null,null,""]
[null,null,null,null,null,null,null,null,null,null,null,null,""]
[null,null,null,null,null,null,null,null,null,null,null,null,""]
[null,null,null,null,null,null,null,null,null,null,null,null,""]
[null,null,null,null,null,null,null,null,null,null,null,null,""]
[null,null,null,null,null,null,null,null,null,null,null,null,""]
[null,null,null,null,null,null,null,null,null,null,null,null,""]
[null,null,null,null,null,null,null,null,null,null,null,null,""]
[null,null,null,null,null,null,null,null,null,null,null,null,""]
[null,null,null,null,null,null,null,null,null,null,null,null,""]
[null,null,null,null,null,null,null,null,null,null,null,null,""]
[null,null,null,null,null,null,null,null,null,null,null,null,""]
[null,null,null,null,null,null,null,null,null,null,null,null,""]
[null,null,null,null,null,null,null,null,null,null,null,null,""]
[null,null,null,null,null,null,null,null,null,null,null,null,""]
[null,null,null,null,null,null,null,null,null,null,null,null,""]
[null,null,null,null,null,null,null,null,null,null,null,null,""]
[null,null,null,null,null,null,null,null,null,null,null,null,""]
[null,null,null,null,null,null,null,null,null,null,null,null,""]
[null,null,null,null,null,null,null,null,null,null,null,null,""]
[null,null,null,null,null,null,null,null,null,null,null,null,""]
[null,null,null,null,null,null,null,null,null,null,null,null,""]
[null,null,null,null,null,null,null,null,null,null,null,null,""]
[null,null,null,null,null,null,null,null,null,null,null,null,""]
[null,null,null,null,null,null,null,null,null,null,null,null,""]
[null,null,null,null,null,null,null,null,null,null,null,null,""]
[null,null,null,null,null,null,null,null,null,null,null,null,""]
[null,null,null,null,null,null,null,null,null,null,null,null,""]
[null,null,null,null,null,null,null,null,null,null,null,null,""]
[null,null,null,null,null,null,null,null,null,null,null,null,""]
[null,null,null,null,null,null,null,null,null,null,null,null,""]
[null,null,null,null,null,null,null,null,null,null,null,null,""]
[null,null,null,null,null,null,null,null,null,null,null,null,""]
[null,null,null,null,null,null,null,null,null,null,null,null,""]
[null,null,null,null,null,null,null,null,null,null,null,null,""]
[null,null,null,null,null,null,null,null,null,null,null,null,""]
[null,null,null,null,null,null,null,null,null,null,null,null,""]
[null,null,null,null,null,null,null,null,null,null,null,null,""]
[null,null,null,null,null,null,null,null,null,null,null,null,""]
[null,null,null,null,null,null,null,null,null,null,null,null,""]
[null,null,null,null,null,null,null,null,null,null,null,null,""]
[null,null,null,null,null,null,null,null,null,null,null,null,""]
[null,null,null,null,null,null,null,null,null,null,null,null,{"$f":"IF(E399<>\"\",SUMPRODUCT(N387+G398-H398-K398),\"\")","v":""}]
[null,null,null,null,null,null,null,null,null,null,null,null,""]
[null,null,null,null,null,null,null,null,null,null,null,null,""]
[null,null,null,null,null,null,null,null,null,null,null,null,""]
[null,null,null,null,null,null,null,null,null,null,null,null,""]
[null,null,null,null,null,null,null,null,null,null,null,null,""]
[null,null,null,null,null,null,null,null,null,null,null,null,""]
[null,null,null,null,null,null,null,null,null,null,null,null,""]
[null,null,null,null,null,null,null,null,null,null,null,null,""]
[null,null,null,null,null,null,null,null,null,null,null,null,""]
[null,null,null,null,null,null,null,null,null,null,null,null,""]
[null,null,null,null,null,null,null,null,null,null,null,null,""]
[null,null,null,null,null,null,null,null,null,null,null,null,""]
[null,null,null,null,null,null,null,null,null,null,null,null,""]
[null,null,null,null,null,null,null,null,null,null,null,null,""]
[null,null,null,null,null,null,null,null,null,null,null,null,""]
[null,null,null,null,null,null,null,null,null,null,null,null,""]
[null,null,null,null,null,null,null,null,null,null,null,null,""]
[null,null,null,null,null,null,null,null,null,null,null,null,""]
[null,null,null,null,null,null,null,null,null,null,null,null,""]
[null,null,null,null,null,null,null,null,null,null,null,null,""]
[null,null,null,null,null,null,null,null,null,null,null,null,""]
[null,null,null,null,null,null,null,null,null,null,null,null,""]
[null,null,null,null,null,null,null,null,null,null,null,null,""]
[null,null,null,null,null,null,null,null,null,null,null,null,""]
[null,null,null,null,null,null,null,null,null,null,null,null,""]
[null,null,null,null,null,null,null,null,null,null,null,null,""]
[null,null,null,null,null,null,null,null,null,null,null,null,""]
[null,null,null,null,null,null,null,null,null,null,null,null,""]
[null,null,null,null,null,null,null,null,null,null,null,null,""]
[null,null,null,null,null,null,null,null,null,null,null,null,""]
[null,null,null,null,null,null,null,null,null,null,null,null,""]
[null,null,null,null,null,null,null,null,null,null,null,null,""]
[null,null,null,null,null,null,null,null,null,null,null,null,""]
[null,null,null,null,null,null,null,null,null,null,null,null,""]
[null,null,null,null,null,null,null,null,null,null,null,null,""]
[null,null,null,null,null,null,null,null,null,null,null,null,""]
[null,null,null,null,null,null,null,null,null,null,null,null,""]
[null,null,null,null,null,null,null,null,null,null,null,null,""]
[null,null,null,null,null,null,null,null,null,null,null,null,""]
[null,null,null,null,null,null,null,null,null,null,null,null,""]
[null,null,null,null,null,null,null,null,null,null,null,null,""]
[null,null,null,null,null,null,null,null,null,null,null,null,""]
[null,null,null,null,null,null,null,null,null,null,null,null,""]
[null,null,null,null,null,null,null,null,null,null,null,null,""]
[null,null,null,null,null,null,null,null,null,null,null,null,""]
[null,null,null,null,null,null,null,null,null,null,null,null,""]
[null,null,null,null,null,null,null,null,null,null,null,null,""]
[null,null,null,null,null,null,null,null,null,null,null,null,""]
[null,null,null,null,null,null,null,null,null,null,null,null,""]
[null,null,null,null,null,null,null,null,null,null,null,null,""]
[null,null,null,null,null,null,null,null,null,null,null,null,""]
[null,null,null,null,null,null,null,null,null,null,null,null,""]
[null,null,null,null,null,null,null,null,null,null,null,null,""]
[null,null,null,null,null,null,null,null,null,null,null,null,""]
[null,null,null,null,null,null,null,null,null,null,null,null,""]
[null,null,null,null,null,null,null,null,null,null,null,null,""]
[null,null,null,null,null,null,null,null,null,null,null,null,""]
[null,null,null,null,null,null,null,null,null,null,null,null,""]
[null,null,null,null,null,null,null,null,null,null,null,null,""]
[null,null,null,null,null,null,null,null,null,null,null,null,""]
[null,null,null,null,null,null,null,null,null,null,null,null,""]
[null,null,null,null,null,null,null,null,null,null,null,null,""]
[null,null,null,null,null,null,null,null,null,null,null,null,""]
[null,null,null,null,null,null,null,null,null,null,null,null,{"$f":"IF(E463<>\"\",SUMPRODUCT(N451+G462-H462-K462),\"\")","v":""}]
[null,null,null,null,null,null,null,null,null,null,null,null,""]
[null,null,null,null,null,null,null,null,null,null,null,null,""]
[null,null,null,null,null,null,null,null,null,null,null,null,""]
[null,null,null,null,null,null,null,null,null,null,null,null,""]
[null,null,null,null,null,null,null,null,null,null,null,null,""]
[null,null,null,null,null,null,null,null,null,null,null,null,""]
[null,null,null,null,null,null,null,null,null,null,null,null,""]
[null,null,null,null,null,null,null,null,null,null,null,null,""]
[null,null,null,null,null,null,null,null,null,null,null,null,""]
[null,null,null,null,null,null,null,null,null,null,null,null,""]
[null,null,null,null,null,null,null,null,null,null,null,null,""]
[null,null,null,null,null,null,null,null,null,null,null,null,""]
[null,null,null,null,null,null,null,null,null,null,null,null,""]
[null,null,null,null,null,null,null,null,null,null,null,null,""]
[null,null,null,null,null,null,null,null,null,null,null,null,""]
[null,null,null,null,null,null,null,null,null,null,null,null,""]
[null,null,null,null,null,null,null,null,null,null,null,null,""]
[null,null,null,null,null,null,null,null,null,null,null,null,""]
[null,null,null,null,null,null,null,null,null,null,null,null,""]
[null,null,null,null,null,null,null,null,null,null,null,null,""]
[null,null,null,null,null,null,null,null,null,null,null,null,""]
[null,null,null,null,null,null,null,null,null,null,null,null,""]
[null,null,null,null,null,null,null,null,null,null,null,null,""]
[null,null,null,null,null,null,null,null,null,null,null,null,""]
[null,null,null,null,null,null,null,null,null,null,null,null,""]
[null,null,null,null,null,null,null,null,null,null,null,null,""]
[null,null,null,null,null,null,null,null,null,null,null,null,""]
[null,null,null,null,null,null,null,null,null,null,null,null,""]
[null,null,null,null,null,null,null,null,null,null,null,null,""]
[null,null,null,null,null,null,null,null,null,null,null,null,""]
[null,null,null,null,null,null,null,null,null,null,null,null,""]
[null,null,null,null,null,null,null,null,null,null,null,null,""]
[null,null,null,null,null,null,null,null,null,null,null,null,""]
[null,null,null,null,null,null,null,null,null,null,null,null,""]
[null,null,null,null,null,null,null,null,null,null,null,null,""]
[null,null,null,null,null,null,null,null,null,null,null,null,""]
[null,null,null,null,null,null,null,null,null,null,null,null,""]
[null,null,null,null,null,null,null,null,null,null,null,null,""]
[null,null,null,null,null,null,null,null,null,null,null,null,""]
[null,null,null,null,null,null,null,null,null,null,null,null,""]
[null,null,null,null,null,null,null,null,null,null,null,null,""]
[null,null,null,null,null,null,null,null,null,null,null,null,""]
[null,null,null,null,null,null,null,null,null,null,null,null,""]
[null,null,null,null,null,null,null,null,null,null,null,null,""]
[null,null,null,null,null,null,null,null,null,null,null,null,""]
[null,null,null,null,null,null,null,null,null,null,null,null,""]
[null,null,null,null,null,null,null,null,null,null,null,null,""]
[null,null,null,null,null,null,null,null,null,null,null,null,""]
[null,null,null,null,null,null,null,null,null,null,null,null,""]
[null,null,null,null,null,null,null,null,null,null,null,null,""]
[null,null,null,null,null,null,null,null,null,null,null,null,""]
[null,null,null,null,null,null,null,null,null,null,null,null,""]
[null,null,null,null,null,null,null,null,null,null,null,null,""]
[null,null,null,null,null,null,null,null,null,null,null,null,""]
[null,null,null,null,null,null,null,null,null,null,null,null,""]
[null,null,null,null,null,null,null,null,null,null,null,null,""]
[null,null,null,null,null,null,null,null,null,null,null,null,""]
[null,null,null,null,null,null,null,null,null,null,null,null,""]
[null,null,null,null,null,null,null,null,null,null,null,null,""]
[null,null,null,null,null,null,null,null,null,null,null,null,""]
[null,null,null,null,null,null,null,null,null,null,null,null,""]
[null,null,null,null,null,null,null,null,null,null,null,null,""]
[null,null,null,null,null,null,null,null,null,null,null,null,""]
[null,null,null,null,null,null,null,null,null,null,null,null,{"$f":"IF(E527<>\"\",SUMPRODUCT(N515+G526-H526-K526),\"\")","v":""}]
[null,null,null,null,null,null,null,null,null,null,null,null,""]
[null,null,null,null,null,null,null,null,null,null,null,null,""]
[null,null,null,null,null,null,null,null,null,null,null,null,""]
[null,null,null,null,null,null,null,null,null,null,null,null,""]
[null,null,null,null,null,null,null,null,null,null,null,null,""]
[null,null,null,null,null,null,null,null,null,null,null,null,""]
[null,null,null,null,null,null,null,null,null,null,null,null,""]
[null,null,null,null,null,null,null,null,null,null,null,null,""]
[null,null,null,null,null,null,null,null,null,null,null,null,""]
[null,null,null,null,null,null,null,null,null,null,null,null,""]
[null,null,null,null,null,null,null,null,null,null,null,null,""]
[null,null,null,null,null,null,null,null,null,null,null,null,""]
[null,null,null,null,null,null,null,null,null,null,null,null,""]
[null,null,null,null,null,null,null,null,null,null,null,null,""]
[null,null,null,null,null,null,null,null,null,null,null,null,""]
[null,null,null,null,null,null,null,null,null,null,null,null,""]
[null,null,null,null,null,null,null,null,null,null,null,null,""]

{"sheet":"Sheet6","index":5,"n_rows":1,"n_cols":1,"rows_kept":1,"cut":false,"hidden":false,"merged":[]}
[3]

{"sheet":"sheet8","index":6,"n_rows":4,"n_cols":26,"rows_kept":4,"cut":false,"hidden":true,"merged":[]}
["اسم المستخدم","رقم السري","ادخال ","النكويد","كارت الصنف","تقرير موازنة","مراقبة المخزون","طلب الشراء","تقرير استعلام مخزن","تقرير العهدة","طباعة","مستخدمين",null,"اسم المستخدم","تكويد الاصناف","اذن اصافة","اذن صرف","تقرير متابعة صيانة","مراقبة المخزون","طلب الشراء","تقرير استعلام مخزن","تقرير العهدة","طباعة","مستخدمين",null,"yes"]
["رمضان",123,"yes","no","no","no","no","no","no","no","no","no",null,"رمضان",{"$f":"IF(N2=\"\",\"\",VLOOKUP(N2,A2:K9,3,FALSE))","v":"yes"},{"$f":"IF(N2=\"\",\"\",VLOOKUP(N2,A2:K9,4,FALSE))","v":"no"},{"$f":"IF(N2=\"\",\"\",VLOOKUP(N2,$A$2:$K$9,5,FALSE))","v":"no"},{"$f":"IF(N2=\"\",\"\",VLOOKUP(N2,$A$2:$K$9,6,FALSE))","v":"no"},{"$f":"IF(N2=\"\",\"\",VLOOKUP(N2,$A$2:$K$9,7,FALSE))","v":"no"},{"$f":"IF($N$2=\"\",\"\",VLOOKUP($N$2,$A$2:$K$9,8,FALSE))","v":"no"},{"$f":"IF($N$2=\"\",\"\",VLOOKUP($N$2,$A$2:$K$9,9,FALSE))","v":"no"},{"$f":"IF($N$2=\"\",\"\",VLOOKUP($N$2,$A$2:$K$9,10,FALSE))","v":"no"},{"$f":"IF($N$2=\"\",\"\",VLOOKUP($N$2,$A$2:$K$9,11,FALSE))","v":"no"},{"$f":"IF($N$2=\"\",\"\",VLOOKUP($N$2,$A$2:$L$9,12,FALSE))","v":"no"},null,"no"]
["فارس",111,"no","no","no","no","no","no","no","no","no","no"]
["حنين",222]

{"sheet":"Index","index":7,"n_rows":0,"n_cols":0,"rows_kept":0,"cut":false,"hidden":true,"merged":[]}

{"sheet":"تقرير موازنة","index":8,"n_rows":17,"n_cols":6,"rows_kept":17,"cut":false,"hidden":true,"merged":[[16,3,16,4]]}
[]
[]
[]
[]
[null,null,null,null,null,"2018-04-02T20:42:52"]
[null,{"$f":"Sheet2!CM3","v":"شركة  أبوفارس رمضان "}]
[null,null," تقارير المخزن والموازنة"]
[null,null,null,null,{"$f":"NOW()","v":"2018-09-23T16:52:10.770"}]
[null," رصيد العملاء",{"$f":"Sheet2!AP1","v":0}," سعر منتج المخازن بيع"]
[null," رصيد الموردين",{"$f":"Sheet2!AG1","v":0}," سعر منتج المخازن شراء"]
[null," اجمالي فواتير المبيعات",null," الارباح المتوقعه لمنتج المخازن"]
[null," اجمالي فواتير المشتريات",{"$f":"Sheet2!H1","v":0}," أرباح المبيعات نقدي & الاجل"]
[null," فرق فواتير البيع والشراء",{"$f":"C12-C11","v":0}]
[null," اجمالي مبالغ سندات القبض",{"$f":"Sheet2!BA1","v":0}]
[null," اجمالي مبالغ سندات الصرف",{"$f":"B20","v":0}]
[null," فرق سندات القبض والصرف",{"$f":"C14-C15","v":0}]
[null,null,null,"يعتمد:/ ............................"]