{"text_format":"1","workbook":"xlsx","n_sheets":6,"sheets":["أساسيات","أسماء الطلاب","تفقد","الإحصائية","الكادر","كادر احتياطي"],"not_rendered":{"charts":0,"images":0,"macros":1,"external_links":0,"defined_names":1,"comments":0,"pivot_tables":0},"unopened":[],"bounds":{"document_bytes":16777216,"sheet_cells":100000,"rows_first":2000,"rows_last":500,"rows_between":2000,"halvings":0,"cell_chars":16384,"cell_head_chars":4096},"cells_cut":0,"cells_raw":0,"read":"whole","date_system":"1900"}

{"sheet":"أساسيات","index":0,"n_rows":12,"n_cols":4,"rows_kept":12,"cut":false,"hidden":false,"merged":[]}
["الرمز","الصف","الشعبة","المشرف"]
["الأول","الأول","الأولى","منى جغل"]
["الثاني1","الثاني","الأولى","هند"]
["الثاني2","الثاني","الثانية","ب"]
["الثالث1","الثالث","الأولى","ج"]
["الثالث2","الثالث","الثانية","ف"]
["الرابع","الرابع","الأولى","ى"]
["الخامس","الخامس","الأولى","خ"]
["السادس","السادس","الأولى","ك"]
["السابع","السابع","الأولى","ب"]
["الثامن","الثامن","الأولى","ن"]
["التاسع","التاسع","الأولى","ي"]

{"sheet":"أسماء الطلاب","index":1,"n_rows":300,"n_cols":19,"rows_kept":300,"cut":false,"hidden":false,"merged":[]}
["سجل","الرقم","الاسم والنسبة","الاسم","النسبة","الأب","الأم","سكن سابق","السكن","سابق","الصف","مكان","تاريخ التولد","يوم","شهر","عام","رقم التواصل","النوع","ملاحظات"]
[231,null,"رهام حدادة","رهام","حدادة","هلال",null,null,null,"التاسع",null,null,"1905-06-24",24,6,2002,null,"أنثى"]
[152,16,"محمد باروتجي","محمد","باروتجي",null,null,null,null,"الثاني","الثالث2",null,"1905-07-02",2,7,2010,null,"ذكر"]
[163,null,"طيبة تيت","طيبة","تيت",null,null,null,null,"الأول",null,null,"1905-07-02",2,7,2010,null,"أنثى"]
[170,null,"محمد زراع","محمد","زراع",null,"رهف",null,null,"الأول","نقل",null,"1905-07-04",4,7,2012,null,"ذكر"]
[211,null,"أحمد شقروق","أحمد","شقروق",null,null,null,null,"التاسع",null,null,"1997-01-03",3,1,1997,null,"ذكر"]
[223,null,"هبة الله صالح","هبة الله","صالح",null,null,null,null,"التاسع",null,null,"1998-01-29",29,1,1998,null,"أنثى"]
[225,null,"آلاء زيدان","آلاء","زيدان",null,null,null,null,"التاسع",null,null,"1999-01-08",8,1,1999,null,"أنثى"]
[126,null,"أمل قافو","أمل","قافو","عبد القادر","كميلة","المشهد",null,"التاسع",null,"حلب","2000-01-19",19,1,2000,null,"أنثى"]
[222,null,"هبة الله صباغ","هبة الله","صباغ",null,null,null,null,"التاسع",null,null,"2001-01-01",1,1,2001,null,"أنثى"]
[125,null,"براءة عقاد","براءة","عقاد","مصطفى","دنيا","الفردوس",null,"التاسع",null,"حلب","2001-01-15",15,1,2001,null,"أنثى"]
[232,null,"فاطمة صباغ","فاطمة","صباغ",null,null,null,null,"التاسع",null,null,"2001-06-23",23,6,2001,null,"أنثى"]
[221,null,"شهد خياط نقو","شهد","خياط نقو","رضوان",null,null,null,"التاسع",null,null,"2002-01-12",12,1,2002,null,"أنثى"]
[197,null,"آية قصير","آية","قصير",null,null,null,null,"السادس",null,null,"2002-01-21",21,1,2002,null,"أنثى"]
[131,null,"أحمد ريحاوي","أحمد","ريحاوي","فائز","فادية",null,"النهضة","الخامس",null,null,"2002-03-22",22,3,2002,null,"ذكر"]
[1,null,"إبراهيم مدلل","إبراهيم","مدلل","حافظ","رانية","بستان القصر",null,"التاسع",null,"حلب","2003-01-11",11,1,2004,null,"ذكر"]
[120,null,"إسراء خاروف","إسراء","خاروف","محمد","امينة","الكلاسة",null,"السابع",null,"حلب","2003-01-28",28,1,2003,null,"أنثى"]
[124,null,"ريم مشاعل","ريم","مشاعل","أحمد","نور الهدى","الأنصاري",null,"الثامن",null,"حلب","2003-01-30",30,1,2003,null,"أنثى"]
[2,null,"إبراهيم بابللي","إبراهيم","بابللي","محي الدين","نوره","المشهد",null,"السادس",null,"حلب","2003-03-02",2,3,3,null,"ذكر"]
[116,4,"دانية عقاد","دانية","عقاد","مازن","أمل","الفردوس","بدلها","السادس","الثامن",null,"2003-06-29",29,6,2003,955561771,"أنثى"]
[212,null,"فواز الدبيس","فواز","الدبيس",null,null,null,null,"التاسع",null,null,"2003-09-15",15,9,2003,null,"ذكر"]
[216,null,"محمد القاسم","محمد","القاسم",null,null,null,null,"التاسع",null,null,"2003-10-05",5,10,2003,null,"ذكر"]
[177,null,"آمنة السفان","آمنة","السفان","مهدي","فاطمة",null,"الإيمان","الثالث",null,"اللطامنة","2004-01-01",1,1,2004,null,"أنثى"]
[206,null,"أمينة بابللي","أمينة","بابللي",null,null,null,null,"السابع",null,null,"2004-01-01",1,1,2004,null,"أنثى"]
[209,null,"محمد نور طباخ","محمد نور","طباخ",null,null,null,null,"التاسع",null,null,"2004-01-01",1,1,2004,null,"ذكر"]
[215,null,"عادل خطيب","عادل","خطيب",null,null,null,null,"التاسع",null,null,"2004-01-10",10,1,2004,null,"ذكر"]
[210,null,"محمد سندة","محمد","سندة",null,null,null,null,"التاسع",null,null,"2004-01-12",12,1,2004,null,"ذكر"]
[127,1,"محمود قافو","محمود","قافو","عبد القادر","كميلة",null,"بدلها","الرابع",null,null,"2004-01-14",14,4,2004,956920193,"ذكر"]
[null,1,"اسراء حارس","إسراء","حارس","طالب","إيمان",null,"بدلها",null,"السادس",null,"2004-01-16",16,1,2004,943922183,"أنثى"]
[123,null,"جودي الموسى","جودي","الموسى","عادل","حسناء","الكلاسة",null,"الثامن",null,"حلب","2004-03-15",15,3,2004,null,"أنثى"]
[121,null,"بيان صالح","بيان","صالح","أحمد","فاطمة","المشهد",null,"الثامن",null,"حلب","2004-03-31",31,3,2004,null,"أنثى"]
[122,null,"ريان صالح","ريان","صالح","أحمد","فاطمة","المشهد",null,"الثامن",null,"حلب","2004-03-31",31,3,2004,null,"أنثى"]
[111,5,"روان أول","روان","أول","محمد هشام","غيثاء","الكلاسة","بدلها","السادس","الثامن",null,"2005-01-01",1,1,2005,954397871,"أنثى"]
[118,null,"سحر حجازي","سحر","حجازي","مصطفى","شذى","الكلاسة",null,"السابع",null,"حلب","2005-01-01",1,1,2005,null,"أنثى"]
[115,null,"حلا عقاد","حلا","عقاد","مصطفى","دنيا","الفردوس",null,"السادس",null,"حلب","2005-01-02",2,1,2005,null,"أنثى"]
[129,null,"إبراهيم سباط","إبراهيم","سباط","محمد","نادرة",null,"المخيم","الخامس",null,null,"2005-01-10",10,1,2005,null,"ذكر"]
[200,10,"وئام أوسو","وئام","أوسو","بلال","وفاء",null,"بدلها","السادس","السابع",null,"2005-01-12",12,1,2005,963957423,"أنثى"]
[117,7,"شهد حردان","شهد","حردان","غسان","هيفاء",null,"بدلها",null,"الثامن",null,"2005-01-23",23,1,2005,960968267,"أنثى"]
[119,null,"سدرة المنتهى جزماتي","سدرة المنتهى","جزماتي","صالح","سحر","المشهد",null,"السابع",null,"حلب","2005-01-27",27,1,2005,null,"أنثى"]
[114,3,"جلنار مراد","جلنار","مراد","أحمد","إبتسام",null,"بدلها","السادس","الثامن",null,"2005-02-22",22,2,2005,959707649,"أنثى"]
[null,null,"أحمد الحسن","أحمد","الحسن","حمود","فوزة","حمص","النور","الخامس",null,"حمص","2005-03-01",1,3,2005,null,"ذكر"]
[72,null,"محمد مدلل","محمد","مدلل","ماهر","فاطمة","بستان القصر",null,"الخامس",null,"حلب","2005-04-17",17,4,2005,null,"ذكر"]
[null,9,"مصطفى عفش","مصطفى","عفش","إبراهيم","أسماء",null,"النهضة",null,"السابع",null,"2005-05-06","6",5,2005,null,"ذكر"]
[113,1,"آية مراد","آية","مراد","أحمد","فاطمة",null,"بدلها","السادس","الثامن",null,"2005-05-09",9,5,2005,null,"أنثى"]
[91,null,"مصطفى شريمو","مصطفى","شريمو","محمد ديب","سامية","السكري",null,"الثاني",null,"حلب","2005-05-20",20,5,2005,null,"ذكر"]
[109,20,"صفاء قمقم","صفاء","قمقم","جمال","فاطمة","الكلاسة","بدلها",null,"بطل",null,"2005-07-21",21,7,2005,947203679,"أنثى"]
[30,7,"حسن بساطة","حسن","بساطة","مصطفى","هدى","السكري","بدلها","الرابع","السادس",null,"2005-12-18",18,12,2005,968091005,"ذكر"]
[8,null,"أحمد قصير","أحمد","قصير","حسن","صباح","الكلاسة",null,"الثاني",null,"حلب","2006-01-01",1,1,2006,null,"ذكر"]
[35,8,"حمزة خاروف","حمزة","خاروف","ماهر","بشرى","المغاير","بدلها","الرابع","السادس",null,"2006-01-01",1,1,2006,963962282,"ذكر"]
[53,12,"عبد الله مدلل","عبد الله","مدلل","محمود","سميرة","بستان القصر","بدلها","الثاني","الخامس",null,"2006-01-01",1,1,2006,956570798,"ذكر"]
[74,16,"محمد نجاة عقاد","محمد نجاة","عقاد","مازن","أمل","الفردوس","بدلها","الرابع","السادس",null,"2006-01-01",1,1,2006,955561771,"ذكر"]
[198,2,"بسمة خانطوماني","بسمة","خانطوماني",null,null,null,null,"السابع","الثامن",null,"2006-01-01",1,1,2006,null,"أنثى"]
[205,13,"يوسف خطيب","يوسف","خطيب","محمد","مبنية",null,"النهضة",null,"السابع",null,"2006-01-01",1,1,2006,945267228,"ذكر"]
["ج",13,"عبد الله السعيد","عبد الله","السعيد","سعيد","دلال",null,null,null,"الرابع","حمص","2006-01-01","1",1,2006,null,"ذكر"]
[null,8,"محمد نصر الدين زيدان","محمد نصر الدين","زيدان","أحمد","درية",null,"بدلها",null,"السابع",null,"2006-01-01",1,1,2006,null,"ذكر"]
[110,3,"حلا جسري","حلا","جسري","محمد","وفاء","الزبدية",null,"الخامس","السابع","حلب","2006-01-16",16,1,2006,null,"أنثى"]
[145,18,"غيث طباخ","غيث","طباخ","إبراهيم","رباح",null,"بدلها",null,"الثالث1",null,"2006-01-16",16,1,2006,null,"ذكر"]
[201,12,"يامن طباخ","يامن","طباخ","إبراهيم","رباح",null,"بدلها","السادس","السابع",null,"2006-01-16",16,1,2006,null,"ذكر"]
[140,15,"محمد نور حميدي","محمد نور","حميدي","عبد الحميد","فطوم",null,"بدلها","الثالث","الخامس",null,"2006-01-20",20,1,2006,null,"ذكر"]
[112,null,"دانية نجار","دانية","نجار","عبد الخالق","صفاء","القاطرجي",null,"السادس",null,"حلب","2006-03-01",1,3,2006,null,"أنثى"]
[106,2,"تسنيم الموسى","تسنيم","الموسى","عادل","حسناء",null,"بدلها","الخامس","السابع",null,"2006-03-25",25,3,2006,948871661,"أنثى"]
[105,15,"مايا مشاعل","مايا","مشاعل","أحمد","نور الهدى","الأنصاري",null,"الرابع","السادس","حلب","2006-04-17",null,null,2006,null,"أنثى"]
[130,null,"نجيب سباط","نجيب","سباط","محمد","نادرة",null,"المخيم","الخامس",null,null,"2006-06-07",7,6,2006,null,"ذكر"]
[52,11,"عبد الله المصري","عبد الله","المصري","زكريا","دلال",null,"بدلها","الثالث","الخامس",null,"2007-01-01",1,1,2007,945107091,"ذكر"]
[null,21,"ولاء المحمد","ولاء","المحمد","محمود","هدى",null,"النايف",null,"الثاني2",null,"2007-01-01",1,1,2007,null,"أنثى"]
[43,10,"زكريا دروبي","زكريا","دروبي","عبد القادر","منتهى","الأنصاري","بدلها","الرابع","السادس",null,"2007-01-03",3,1,2007,951526993,"ذكر"]
[15,4,"آمنة ملحم","آمنة","ملحم","محمد","نهى","كرم النزهة","بدلها","الرابع","السادس",null,"2007-01-07",7,1,2007,null,"أنثى"]
[45,11,"سلمى بساطة","سلمى","بساطة","محمد","رهف","السكري","بدلها","الرابع","السادس",null,"2007-01-07",7,1,2007,943962712,"أنثى"]
[203,4,"زهراء خطيب","زهراء","خطيب","محمد","مبنية",null,"النهضة",null,"السابع",null,"2007-01-10",10,1,2007,945267448,"أنثى"]
[108,4,"فاطمة أحمد","فاطمة","أحمد","خالد","سامية","المشهد","بدلها",null,"نقل",null,"2007-01-12",12,1,2007,949221635,"أنثى"]
[23,5,"تسنيم ميمة","تسنيم","ميمة","أحمد","سوسن","الكلاسة",null,"الثاني","الثالث1","حلب","2007-01-14",14,1,2007,null,"أنثى","تسرب"]
[93,18,"ناديا بركات","ناديا","بركات","محمد أسامة","راضية","الكلاسة","بدلها","الثالث","الخامس",null,"2007-01-26",26,1,2007,967285973,"أنثى"]
[62,15,"ماهر حلاق","ماهر","حلاق","يوسف","درية","المشهد","بدلها",null,"الرابع",null,"2007-01-29",29,1,2007,941186618,"ذكر"]
[84,18,"محمد حلاق","محمد","حلاق","يوسف","درية","المشهد","بدلها","الثاني","الرابع",null,"2007-01-29",29,1,2007,941186618,"ذكر"]
[17,3,"بتول حدادة","بتول","حدادة","محمد","روعة","الأنصاري","بدلها","الثالث","الخامس",null,"2007-01-31",31,1,2007,null,"أنثى"]
[139,22,"وسيم عقاد","وسيم","عقاد","مازن","أمل",null,"بدلها","الثالث","الرابع",null,"2007-02-10",10,2,2007,955561771,"ذكر"]
[146,19,"محمد خير ستر","محمد خير","ستر","أحمد","ناهد",null,"بدلها",null,"الرابع",null,"2007-05-05",5,5,2007,947045195,"ذكر"]
[65,7,"محمد مراد","محمد","مراد","أحمد","فاطمة",null,"بدلها",null,"السابع",null,"2007-06-01",1,6,2007,null,"ذكر"]
[null,null,"عبد الله شله","عبد الله","شله","محمد","هدى",null,"النهضة","السادس",null,"حرستا","2007-07-23",23,7,2007,952344361,"ذكر"]
[107,11,"ياسمين مراد","ياسمين","مراد","أحمد","إبتسام",null,"بدلها","الخامس","السابع",null,"2007-09-22",22,9,2007,959707649,"أنثى"]
{"$rows_left_out":221}
{"sheet":"تفقد","index":2,"n_rows":33,"n_cols":33,"rows_kept":33,"cut":false,"hidden":false,"merged":[[1,1,2,1]]}
["الخامس","مدرسة الجيل المسلم",null,null,null,null,null,null,null,null,null,"تفقد الطلاب عن شهر:............................",null,null,null,null,null,null,"الصف:",{"$f":"VLOOKUP($A$1,أساسيات!A2:D12,2,0)","v":"الخامس"},null,null,null,"الشعبة:",{"$f":"VLOOKUP($A$1,أساسيات!A2:D12,3,0)","v":"الأولى"},null,"المشرف:",null,{"$f":"VLOOKUP($A$1,أساسيات!A2:D12,4,0)","v":"خ"}]
[null,"الاســـــــم"]
["الرقم",null,1,2,3,4,5,6,7,8,9,10,11,12,13,14,15,16,17,18,19,20,21,22,23,24,25,26,27,28,29,30,31]
[{"$f":"IFERROR(INDEX('أسماء الطلاب'!$B:$B,MATCH(B4,'أسماء الطلاب'!$C:$C,0)),\"\")","v":12},{"$f":"IFERROR(INDEX('أسماء الطلاب'!$C:$C,SMALL(IF('أسماء الطلاب'!$K:$K=$A$1,ROW($A$2:$A$2262)-ROW($A$2)+1),ROWS($B$4:B4))),\"\")","v":"عبد الله مدلل"}]
[{"$f":"IFERROR(INDEX('أسماء الطلاب'!$B:$B,MATCH(B5,'أسماء الطلاب'!$C:$C,0)),\"\")","v":15},{"$f":"IFERROR(INDEX('أسماء الطلاب'!$C:$C,SMALL(IF('أسماء الطلاب'!$K:$K=$A$1,ROW($A$2:$A$2262)-ROW($A$2)+1),ROWS($B$4:B5))),\"\")","v":"محمد نور حميدي"}]
[{"$f":"IFERROR(INDEX('أسماء الطلاب'!$B:$B,MATCH(B6,'أسماء الطلاب'!$C:$C,0)),\"\")","v":11},{"$f":"IFERROR(INDEX('أسماء الطلاب'!$C:$C,SMALL(IF('أسماء الطلاب'!$K:$K=$A$1,ROW($A$2:$A$2262)-ROW($A$2)+1),ROWS($B$4:B6))),\"\")","v":"عبد الله المصري"}]
[{"$f":"IFERROR(INDEX('أسماء الطلاب'!$B:$B,MATCH(B7,'أسماء الطلاب'!$C:$C,0)),\"\")","v":18},{"$f":"IFERROR(INDEX('أسماء الطلاب'!$C:$C,SMALL(IF('أسماء الطلاب'!$K:$K=$A$1,ROW($A$2:$A$2262)-ROW($A$2)+1),ROWS($B$4:B7))),\"\")","v":"ناديا بركات"}]
[{"$f":"IFERROR(INDEX('أسماء الطلاب'!$B:$B,MATCH(B8,'أسماء الطلاب'!$C:$C,0)),\"\")","v":3},{"$f":"IFERROR(INDEX('أسماء الطلاب'!$C:$C,SMALL(IF('أسماء الطلاب'!$K:$K=$A$1,ROW($A$2:$A$2262)-ROW($A$2)+1),ROWS($B$4:B8))),\"\")","v":"بتول حدادة"}]
[{"$f":"IFERROR(INDEX('أسماء الطلاب'!$B:$B,MATCH(B9,'أسماء الطلاب'!$C:$C,0)),\"\")","v":6},{"$f":"IFERROR(INDEX('أسماء الطلاب'!$C:$C,SMALL(IF('أسماء الطلاب'!$K:$K=$A$1,ROW($A$2:$A$2262)-ROW($A$2)+1),ROWS($B$4:B9))),\"\")","v":"رضوان خياط نقو"}]
[{"$f":"IFERROR(INDEX('أسماء الطلاب'!$B:$B,MATCH(B10,'أسماء الطلاب'!$C:$C,0)),\"\")","v":10},{"$f":"IFERROR(INDEX('أسماء الطلاب'!$C:$C,SMALL(IF('أسماء الطلاب'!$K:$K=$A$1,ROW($A$2:$A$2262)-ROW($A$2)+1),ROWS($B$4:B10))),\"\")","v":"ظلال الإيمان صباغ"}]
[{"$f":"IFERROR(INDEX('أسماء الطلاب'!$B:$B,MATCH(B11,'أسماء الطلاب'!$C:$C,0)),\"\")","v":8},{"$f":"IFERROR(INDEX('أسماء الطلاب'!$C:$C,SMALL(IF('أسماء الطلاب'!$K:$K=$A$1,ROW($A$2:$A$2262)-ROW($A$2)+1),ROWS($B$4:B11))),\"\")","v":"سمى العبسي"}]
[{"$f":"IFERROR(INDEX('أسماء الطلاب'!$B:$B,MATCH(B12,'أسماء الطلاب'!$C:$C,0)),\"\")","v":2},{"$f":"IFERROR(INDEX('أسماء الطلاب'!$C:$C,SMALL(IF('أسماء الطلاب'!$K:$K=$A$1,ROW($A$2:$A$2262)-ROW($A$2)+1),ROWS($B$4:B12))),\"\")","v":"أمل ريحاوي"}]
[{"$f":"IFERROR(INDEX('أسماء الطلاب'!$B:$B,MATCH(B13,'أسماء الطلاب'!$C:$C,0)),\"\")","v":16},{"$f":"IFERROR(INDEX('أسماء الطلاب'!$C:$C,SMALL(IF('أسماء الطلاب'!$K:$K=$A$1,ROW($A$2:$A$2262)-ROW($A$2)+1),ROWS($B$4:B13))),\"\")","v":"محمود بساطة"}]
[{"$f":"IFERROR(INDEX('أسماء الطلاب'!$B:$B,MATCH(B14,'أسماء الطلاب'!$C:$C,0)),\"\")","v":1},{"$f":"IFERROR(INDEX('أسماء الطلاب'!$C:$C,SMALL(IF('أسماء الطلاب'!$K:$K=$A$1,ROW($A$2:$A$2262)-ROW($A$2)+1),ROWS($B$4:B14))),\"\")","v":"إيلاف أول"}]
[{"$f":"IFERROR(INDEX('أسماء الطلاب'!$B:$B,MATCH(B15,'أسماء الطلاب'!$C:$C,0)),\"\")","v":13},{"$f":"IFERROR(INDEX('أسماء الطلاب'!$C:$C,SMALL(IF('أسماء الطلاب'!$K:$K=$A$1,ROW($A$2:$A$2262)-ROW($A$2)+1),ROWS($B$4:B15))),\"\")","v":"محمد أول"}]
[{"$f":"IFERROR(INDEX('أسماء الطلاب'!$B:$B,MATCH(B16,'أسماء الطلاب'!$C:$C,0)),\"\")","v":5},{"$f":"IFERROR(INDEX('أسماء الطلاب'!$C:$C,SMALL(IF('أسماء الطلاب'!$K:$K=$A$1,ROW($A$2:$A$2262)-ROW($A$2)+1),ROWS($B$4:B16))),\"\")","v":"خديجة مراد"}]
[{"$f":"IFERROR(INDEX('أسماء الطلاب'!$B:$B,MATCH(B17,'أسماء الطلاب'!$C:$C,0)),\"\")","v":14},{"$f":"IFERROR(INDEX('أسماء الطلاب'!$C:$C,SMALL(IF('أسماء الطلاب'!$K:$K=$A$1,ROW($A$2:$A$2262)-ROW($A$2)+1),ROWS($B$4:B17))),\"\")","v":"محمد ملحم"}]
[{"$f":"IFERROR(INDEX('أسماء الطلاب'!$B:$B,MATCH(B18,'أسماء الطلاب'!$C:$C,0)),\"\")","v":7},{"$f":"IFERROR(INDEX('أسماء الطلاب'!$C:$C,SMALL(IF('أسماء الطلاب'!$K:$K=$A$1,ROW($A$2:$A$2262)-ROW($A$2)+1),ROWS($B$4:B18))),\"\")","v":"سدرة المنتهى صباغ"}]
[{"$f":"IFERROR(INDEX('أسماء الطلاب'!$B:$B,MATCH(B19,'أسماء الطلاب'!$C:$C,0)),\"\")","v":9},{"$f":"IFERROR(INDEX('أسماء الطلاب'!$C:$C,SMALL(IF('أسماء الطلاب'!$K:$K=$A$1,ROW($A$2:$A$2262)-ROW($A$2)+1),ROWS($B$4:B19))),\"\")","v":"صالح قمقم"}]
[{"$f":"IFERROR(INDEX('أسماء الطلاب'!$B:$B,MATCH(B20,'أسماء الطلاب'!$C:$C,0)),\"\")","v":4},{"$f":"IFERROR(INDEX('أسماء الطلاب'!$C:$C,SMALL(IF('أسماء الطلاب'!$K:$K=$A$1,ROW($A$2:$A$2262)-ROW($A$2)+1),ROWS($B$4:B20))),\"\")","v":"بسملة خاروف"}]
[{"$f":"IFERROR(INDEX('أسماء الطلاب'!$B:$B,MATCH(B21,'أسماء الطلاب'!$C:$C,0)),\"\")","v":17},{"$f":"IFERROR(INDEX('أسماء الطلاب'!$C:$C,SMALL(IF('أسماء الطلاب'!$K:$K=$A$1,ROW($A$2:$A$2262)-ROW($A$2)+1),ROWS($B$4:B21))),\"\")","v":"مهند الخلف"}]
[{"$f":"IFERROR(INDEX('أسماء الطلاب'!$B:$B,MATCH(B22,'أسماء الطلاب'!$C:$C,0)),\"\")","v":""},{"$f":"IFERROR(INDEX('أسماء الطلاب'!$C:$C,SMALL(IF('أسماء الطلاب'!$K:$K=$A$1,ROW($A$2:$A$2262)-ROW($A$2)+1),ROWS($B$4:B22))),\"\")","v":""}]
[{"$f":"IFERROR(INDEX('أسماء الطلاب'!$B:$B,MATCH(B23,'أسماء الطلاب'!$C:$C,0)),\"\")","v":""},{"$f":"IFERROR(INDEX('أسماء الطلاب'!$C:$C,SMALL(IF('أسماء الطلاب'!$K:$K=$A$1,ROW($A$2:$A$2262)-ROW($A$2)+1),ROWS($B$4:B23))),\"\")","v":""}]
[{"$f":"IFERROR(INDEX('أسماء الطلاب'!$B:$B,MATCH(B24,'أسماء الطلاب'!$C:$C,0)),\"\")","v":""},{"$f":"IFERROR(INDEX('أسماء الطلاب'!$C:$C,SMALL(IF('أسماء الطلاب'!$K:$K=$A$1,ROW($A$2:$A$2262)-ROW($A$2)+1),ROWS($B$4:B24))),\"\")","v":""}]
[{"$f":"IFERROR(INDEX('أسماء الطلاب'!$B:$B,MATCH(B25,'أسماء الطلاب'!$C:$C,0)),\"\")","v":""},{"$f":"IFERROR(INDEX('أسماء الطلاب'!$C:$C,SMALL(IF('أسماء الطلاب'!$K:$K=$A$1,ROW($A$2:$A$2262)-ROW($A$2)+1),ROWS($B$4:B25))),\"\")","v":""}]
[{"$f":"IFERROR(INDEX('أسماء الطلاب'!$B:$B,MATCH(B26,'أسماء الطلاب'!$C:$C,0)),\"\")","v":""},{"$f":"IFERROR(INDEX('أسماء الطلاب'!$C:$C,SMALL(IF('أسماء الطلاب'!$K:$K=$A$1,ROW($A$2:$A$2262)-ROW($A$2)+1),ROWS($B$4:B26))),\"\")","v":""}]
[{"$f":"IFERROR(INDEX('أسماء الطلاب'!$B:$B,MATCH(B27,'أسماء الطلاب'!$C:$C,0)),\"\")","v":""},{"$f":"IFERROR(INDEX('أسماء الطلاب'!$C:$C,SMALL(IF('أسماء الطلاب'!$K:$K=$A$1,ROW($A$2:$A$2262)-ROW($A$2)+1),ROWS($B$4:B27))),\"\")","v":""}]
[{"$f":"IFERROR(INDEX('أسماء الطلاب'!$B:$B,MATCH(B28,'أسماء الطلاب'!$C:$C,0)),\"\")","v":""},{"$f":"IFERROR(INDEX('أسماء الطلاب'!$C:$C,SMALL(IF('أسماء الطلاب'!$K:$K=$A$1,ROW($A$2:$A$2262)-ROW($A$2)+1),ROWS($B$4:B28))),\"\")","v":""}]
[{"$f":"IFERROR(INDEX('أسماء الطلاب'!$B:$B,MATCH(B29,'أسماء الطلاب'!$C:$C,0)),\"\")","v":""},{"$f":"IFERROR(INDEX('أسماء الطلاب'!$C:$C,SMALL(IF('أسماء الطلاب'!$K:$K=$A$1,ROW($A$2:$A$2262)-ROW($A$2)+1),ROWS($B$4:B29))),\"\")","v":""}]
[{"$f":"IFERROR(INDEX('أسماء الطلاب'!$B:$B,MATCH(B30,'أسماء الطلاب'!$C:$C,0)),\"\")","v":""},{"$f":"IFERROR(INDEX('أسماء الطلاب'!$C:$C,SMALL(IF('أسماء الطلاب'!$K:$K=$A$1,ROW($A$2:$A$2262)-ROW($A$2)+1),ROWS($B$4:B30))),\"\")","v":""}]
[{"$f":"IFERROR(INDEX('أسماء الطلاب'!$B:$B,MATCH(B31,'أسماء الطلاب'!$C:$C,0)),\"\")","v":""},{"$f":"IFERROR(INDEX('أسماء الطلاب'!$C:$C,SMALL(IF('أسماء الطلاب'!$K:$K=$A$1,ROW($A$2:$A$2262)-ROW($A$2)+1),ROWS($B$4:B31))),\"\")","v":""}]
[{"$f":"IFERROR(INDEX('أسماء الطلاب'!$B:$B,MATCH(B32,'أسماء الطلاب'!$C:$C,0)),\"\")","v":""},{"$f":"IFERROR(INDEX('أسماء الطلاب'!$C:$C,SMALL(IF('أسماء الطلاب'!$K:$K=$A$1,ROW($A$2:$A$2262)-ROW($A$2)+1),ROWS($B$4:B32))),\"\")","v":""}]
[{"$f":"IFERROR(INDEX('أسماء الطلاب'!$B:$B,MATCH(B33,'أسماء الطلاب'!$C:$C,0)),\"\")","v":""},{"$f":"IFERROR(INDEX('أسماء الطلاب'!$C:$C,SMALL(IF('أسماء الطلاب'!$K:$K=$A$1,ROW($A$2:$A$2262)-ROW($A$2)+1),ROWS($B$4:B33))),\"\")","v":""}]

{"sheet":"الإحصائية","index":3,"n_rows":14,"n_cols":12,"rows_kept":14,"cut":false,"hidden":false,"merged":[[13,2,13,8],[1,1,6,1],[1,3,1,5],[1,6,1,8],[1,9,1,11],[8,1,12,1]]}
[null,null,null,null,null,null,"إحصائية الطلاب"]
[null,"الحلقة الأولى","الشعبة","الأولى",null,null,"الثانية",null,null,"المجموع"]
[null,null,"الصف","ذكور","إناث","مج","ذكور","إناث","مج","ذكور","إناث","مج"]
[null,null,"الأول",{"$f":"COUNTIFS('أسماء الطلاب'!K:K,\"الأول\",'أسماء الطلاب'!R:R,\"ذكر\")","v":14},{"$f":"COUNTIFS('أسماء الطلاب'!K:K,\"الأول\",'أسماء الطلاب'!R:R,\"أنثى\")","v":13},{"$f":"D4+E4","v":27},{"$f":"COUNTIFS('أسماء الطلاب'!K:K,\"الأول2\",'أسماء الطلاب'!R:R,\"ذكر\")","v":0},{"$f":"COUNTIFS('أسماء الطلاب'!K:K,\"الأول2\",'أسماء الطلاب'!R:R,\"أنثى\")","v":0},{"$f":"G4+H4","v":0},{"$f":"D4+G4","v":14},{"$f":"E4+H4","v":13},{"$f":"J4+K4","v":27}]
[null,null,"الثاني",{"$f":"COUNTIFS('أسماء الطلاب'!K:K,\"الثاني1\",'أسماء الطلاب'!R:R,\"ذكر\")","v":17},{"$f":"COUNTIFS('أسماء الطلاب'!K:K,\"الثاني1\",'أسماء الطلاب'!R:R,\"أنثى\")","v":3},{"$f":"D5+E5","v":20},{"$f":"COUNTIFS('أسماء الطلاب'!K:K,\"الثاني2\",'أسماء الطلاب'!R:R,\"ذكر\")","v":11},{"$f":"COUNTIFS('أسماء الطلاب'!K:K,\"الثاني2\",'أسماء الطلاب'!R:R,\"أنثى\")","v":10},{"$f":"G5+H5","v":21},{"$f":"D5+G5","v":28},13,{"$f":"J5+K5","v":41}]
[null,null,"الثالث",{"$f":"COUNTIFS('أسماء الطلاب'!K:K,\"الثالث1\",'أسماء الطلاب'!R:R,\"ذكر\")","v":10},{"$f":"COUNTIFS('أسماء الطلاب'!K:K,\"الثالث1\",'أسماء الطلاب'!R:R,\"أنثى\")","v":13},{"$f":"D6+E6","v":23},{"$f":"COUNTIFS('أسماء الطلاب'!K:K,\"الثالث2\",'أسماء الطلاب'!R:R,\"ذكر\")","v":13},{"$f":"COUNTIFS('أسماء الطلاب'!K:K,\"الثالث2\",'أسماء الطلاب'!R:R,\"أنثى\")","v":9},{"$f":"G6+H6","v":22},23,22,45]
[null,null,"الرابع",{"$f":"COUNTIFS('أسماء الطلاب'!K:K,\"الرابع\",'أسماء الطلاب'!R:R,\"ذكر\")","v":16},{"$f":"COUNTIFS('أسماء الطلاب'!K:K,\"الرابع\",'أسماء الطلاب'!R:R,\"أنثى\")","v":7},23,{"$f":"COUNTIFS('أسماء الطلاب'!K:K,\"الرابع2\",'أسماء الطلاب'!R:R,\"أنثى\")","v":0},{"$f":"COUNTIFS('أسماء الطلاب'!N:N,\"الرابع\",'أسماء الطلاب'!T:T,\"أنثى\")","v":0},0,16,7,23]
[]
[null,"الحلقة الثانية","الخامس",{"$f":"COUNTIFS('أسماء الطلاب'!K:K,\"الخامس\",'أسماء الطلاب'!R:R,\"ذكر\")","v":9},{"$f":"COUNTIFS('أسماء الطلاب'!K:K,\"الخامس\",'أسماء الطلاب'!R:R,\"أنثى\")","v":9},{"$f":"D9+E9","v":18},{"$f":"COUNTIFS('أسماء الطلاب'!K:K,\"الخامس2\",'أسماء الطلاب'!R:R,\"ذكر\")","v":0},{"$f":"COUNTIFS('أسماء الطلاب'!N:N,\"الخامس\",'أسماء الطلاب'!T:T,\"أنثى\")","v":0},{"$f":"G9+H9","v":0},9,9,18]
[null,null,"السادس",{"$f":"COUNTIFS('أسماء الطلاب'!K:K,\"السادس\",'أسماء الطلاب'!R:R,\"ذكر\")","v":10},{"$f":"COUNTIFS('أسماء الطلاب'!K:K,\"السادس\",'أسماء الطلاب'!R:R,\"أنثى\")","v":9},19,{"$f":"COUNTIFS('أسماء الطلاب'!N:N,\"السادس\",'أسماء الطلاب'!T:T,\"ذكر\")","v":0},{"$f":"COUNTIFS('أسماء الطلاب'!K:K,\"الخامس2\",'أسماء الطلاب'!R:R,\"أنثى\")","v":0},0,10,9,19]
[null,null,"السابع",{"$f":"COUNTIFS('أسماء الطلاب'!K:K,\"السابع\",'أسماء الطلاب'!R:R,\"ذكر\")","v":8},{"$f":"COUNTIFS('أسماء الطلاب'!K:K,\"السابع\",'أسماء الطلاب'!R:R,\"أنثى\")","v":5},13,{"$f":"COUNTIFS('أسماء الطلاب'!K:K,\"السابع2\",'أسماء الطلاب'!R:R,\"ذكر\")","v":0},{"$f":"COUNTIFS('أسماء الطلاب'!K:K,\"السابع2\",'أسماء الطلاب'!R:R,\"أنثى\")","v":0},0,8,5,13]
[null,null,"الثامن",{"$f":"COUNTIFS('أسماء الطلاب'!K:K,\"الثامن\",'أسماء الطلاب'!R:R,\"ذكر\")","v":0},{"$f":"COUNTIFS('أسماء الطلاب'!K:K,\"الثامن\",'أسماء الطلاب'!R:R,\"أنثى\")","v":7},7,{"$f":"COUNTIFS('أسماء الطلاب'!K:K,\"الثامن2\",'أسماء الطلاب'!R:R,\"ذكر\")","v":0},{"$f":"COUNTIFS('أسماء الطلاب'!N:N,\"الثامن\",'أسماء الطلاب'!T:T,\"أنثى\")","v":0},0,0,7,7]
[null,null,"التاسع",{"$f":"COUNTIFS('أسماء الطلاب'!K:K,\"التاسع\",'أسماء الطلاب'!R:R,\"ذكر\")","v":0},{"$f":"COUNTIFS('أسماء الطلاب'!K:K,\"التاسع\",'أسماء الطلاب'!R:R,\"أنثى\")","v":0},0,{"$f":"COUNTIFS('أسماء الطلاب'!K:K,\"2التاسع\",'أسماء الطلاب'!R:R,\"ذكر\")","v":0},{"$f":"COUNTIFS('أسماء الطلاب'!K:K,\"التاسع\",'أسماء الطلاب'!R:R,\"أنثى\")","v":0},0,0,0,0]
[null,null,"المجموع",null,null,null,null,null,null,{"$f":"SUM(J4:J13)","v":108},{"$f":"SUM(K4:K13)","v":85},193]

{"sheet":"الكادر","index":4,"n_rows":11,"n_cols":10,"rows_kept":11,"cut":false,"hidden":false,"merged":[]}
["الرقم","الاسم","الأب","الأم","الرقم الوطني","عدد أفراد الأسرة","الشهادة","تاريخ المنح","الوظيفة","ملاحظات"]
[1,"عبد الله صباغ","محمد","بدرية",2040001114,6,"دبلوم تربوي",2002,"مدير"]
[2,"عبد الله عقيل","أحمد","ربيعة",2040361647,4,"مساعد مهندس",1984,"أمين السر"]
[3,"عبد المنعم بنان","أحمد","إبتسام",2040177913,3,"إجازة شريعة",2010,"صف رابع"]
[4,"بتول راجح","وليد","صفاء",2120027520,3,"س4شريعة","-","صف ثالث"]
[5,"منى جغل","عبد الرزاق","سهام",2040366856,4,"أهلية تعليم",1991,"صف أول ش1"]
[6,"نسرين جغل","عبد الرزاق","سهام",2040514298,1,"معهد تجاري",2002,"صف أول ش2"]
[7,"حنان جغل","عبد الرزاق","سهام",2040256073,1,"كلية تربية",2007,"صف ثاني ش1"]
[8,"راما نعناعي","أحمد","فاطمة",2010022485,3,"س2تربية","-","صف ثاني ش2"]
[9,"علياء ملحم","عبدالحميد","فاطمة",2040398014,5,"إجازة لغة انكليزية",2010,"لغة انكليزي"]
[10,"محمد ريحاوي","حسن","أمل",2040235973,5,"ابتدائي","-","مستخدم"]

{"sheet":"كادر احتياطي","index":5,"n_rows":21,"n_cols":8,"rows_kept":21,"cut":false,"hidden":false,"merged":[]}
["الرقم","الاسم  والكنية","الأب","الأم","تاريخ الولادة","الشهادة","رقم التواصل","ملاحظات"]
[1,"محمد خليفة","جاسم","فأزية","الرقة1988","س4لغةك",992213090]
[2,"عبد الرحمن فتوح","غازي",null,"حلب1985","س4شريعة",947063789]
[3,"أسامة خياط","رضوان","فضيلة","حلب1967","س5حاسوب",945656726]
[4,"راما نعناعي","أحمد","فاطمة","حلب1991","س2تربية",949896639]
[5,"فاطمة عزيزي","أحمد","حنان","حلب1992","س1شريعة",957526645]
[6,"مها كريمة","علاء ",null,"حلب1987","س1محاسبة",940646778]
[7,"محمد خوجة","أحمد",null,"حلب1991","س2تقني",948385361]
[8,"أبو بكر زهيراتي","احمد",null,"حلب1989","س1شريعة",951465671]
[9,"رهف حدادة",null,null,null,"ثانوية",958219204]
[10,"فاتن حدادة",null,null,null,"ثانوية",969411087]
[11,"محمد عزوز","عبد الناصر","علية","حلب1991","معهد شرعي ولغة عربية",964326791]
[12,"نور إسماعيل","عبد المجيد","أميرة","حلب1992","ٍ",943528979]
[13,"ريمة الأحمد","نضال","أنيسة","ادلب1991","اجازة حقوق",959862012]
[14,"انور عبود","عبدالاله","غازية","ادلب1985","س3آثار",947720883]
[15]
[16]
[17]
[18]
[19]
[20]