{"text_format":"1","workbook":"xlsx","n_sheets":3,"sheets":["Sheet1","Sheet2","Sheet3"],"not_rendered":{"charts":0,"images":0,"macros":0,"external_links":1,"defined_names":2,"comments":0,"pivot_tables":0},"unopened":[],"bounds":{"document_bytes":16777216,"sheet_cells":100000,"rows_first":2000,"rows_last":500,"rows_between":2000,"halvings":0,"cell_chars":16384,"cell_head_chars":4096},"cells_cut":0,"cells_raw":0,"read":"whole","date_system":"1900"}

{"sheet":"Sheet1","index":0,"n_rows":2158,"n_cols":11,"rows_kept":2158,"cut":false,"hidden":false,"merged":[[3,9,3,10],[2,2,2,3],[2,4,3,4],[2,5,3,5],[2,6,3,6],[2,7,3,7],[2,8,3,8]]}
[]
[]
[null,null,"الحساب",null,"رقم القيد","التاريــخ","حساب فرعي مدين","حساب فرعي دائن "]
[null,null,"المدين ","الدائن",null,null,null,null,null,"المطلوب نقلهم هنا "]
[null,null,"الصندوق","الايرادات",1,"2018-07-01","الصندوق","حسن فلاح عبد الكاظم",5000,{"$f":"IF(H5<>\"\",INDEX($H$5:$H$6000,MATCH(0,COUNTIF($J$4:J4,$H$5:$H$6000),0)),\"\")","v":{"$error":"#N/A"}},{"$f":"SUMPRODUCT(--(#REF!=J5),$I$5:$I$22)","v":{"$error":"#REF!"}}]
[null,null,"الصندوق","الايرادات",2,"2018-07-01","الصندوق","كاظم فلاح عبد الكاظم",6000,{"$f":"IF(#REF!<>\"\",INDEX(#REF!,MATCH(0,COUNTIF($J$4:J5,#REF!),0)),\"\")","v":{"$error":"#REF!"}},{"$f":"SUMPRODUCT(--(#REF!=J6),$I$5:$I$22)","v":{"$error":"#REF!"}}]
[null,null,"الصندوق","الايرادات",3,"2018-07-25","الصندوق","زيد منقذ سلمان",600,{"$f":"IF(#REF!<>\"\",INDEX(#REF!,MATCH(0,COUNTIF($J$4:J6,#REF!),0)),\"\")","v":{"$error":"#REF!"}},{"$f":"SUMPRODUCT(--(#REF!=J7),$I$5:$I$22)","v":{"$error":"#REF!"}}]
[null,null,"الصندوق","الايرادات",4,"2018-07-25","الصندوق","مصطفى صباح عبد الهادي",800,{"$f":"IF(#REF!<>\"\",INDEX(#REF!,MATCH(0,COUNTIF($J$4:J7,#REF!),0)),\"\")","v":{"$error":"#REF!"}},{"$f":"SUMPRODUCT(--(#REF!=J8),$I$5:$I$22)","v":{"$error":"#REF!"}}]
[null,null,"الصندوق","الايرادات",5,"2018-03-01","الصندوق","مرتضى ارؤكان بديوي",5000,{"$f":"IF(#REF!<>\"\",INDEX(#REF!,MATCH(0,COUNTIF($J$4:J8,#REF!),0)),\"\")","v":{"$error":"#REF!"}},{"$f":"SUMPRODUCT(--(#REF!=J9),$I$5:$I$22)","v":{"$error":"#REF!"}}]
[null,null,"الصندوق","الايرادات",6,"2018-04-01","الصندوق","سجاد مشتاق حافظ",4000,{"$f":"IF(#REF!<>\"\",INDEX(#REF!,MATCH(0,COUNTIF($J$4:J9,#REF!),0)),\"\")","v":{"$error":"#REF!"}},{"$f":"SUMPRODUCT(--(#REF!=J10),$I$5:$I$22)","v":{"$error":"#REF!"}}]
[null,null,"الصندوق","الايرادات",7,"2018-05-01","الصندوق","عبد الل..كاظم هاتف",11000,{"$f":"IF(#REF!<>\"\",INDEX(#REF!,MATCH(0,COUNTIF($J$4:J10,#REF!),0)),\"\")","v":{"$error":"#REF!"}},{"$f":"SUMPRODUCT(--(#REF!=J11),$I$5:$I$22)","v":{"$error":"#REF!"}}]
[null,null,"الصندوق","الايرادات",8,"2018-05-01","الصندوق","حسن هيثم جابر محمود",3000,{"$f":"IF(#REF!<>\"\",INDEX(#REF!,MATCH(0,COUNTIF($J$4:J11,#REF!),0)),\"\")","v":{"$error":"#REF!"}},{"$f":"SUMPRODUCT(--(#REF!=J12),$I$5:$I$22)","v":{"$error":"#REF!"}}]
[null,null,"الصندوق","الايرادات",9,"2018-06-03","الصندوق","نبأ فائز كامل",16000,{"$f":"IF(#REF!<>\"\",INDEX(#REF!,MATCH(0,COUNTIF($J$4:J12,#REF!),0)),\"\")","v":{"$error":"#REF!"}},{"$f":"SUMPRODUCT(--(#REF!=J13),$I$5:$I$22)","v":{"$error":"#REF!"}}]
[null,null,"الصندوق","الايرادات",10,"2018-07-02","الصندوق","علي عبد الكريم مهدي",1500,{"$f":"IF(#REF!<>\"\",INDEX(#REF!,MATCH(0,COUNTIF($J$4:J13,#REF!),0)),\"\")","v":{"$error":"#REF!"}},{"$f":"SUMPRODUCT(--(#REF!=J14),$I$5:$I$22)","v":{"$error":"#REF!"}}]
[null,null,"الصندوق","الايرادات",11,"2018-07-02","الصندوق","حسين اغار صبيح",300,{"$f":"IF(#REF!<>\"\",INDEX(#REF!,MATCH(0,COUNTIF($J$4:J14,#REF!),0)),\"\")","v":{"$error":"#REF!"}},{"$f":"SUMPRODUCT(--(#REF!=J15),$I$5:$I$22)","v":{"$error":"#REF!"}}]
[null,null,"الصندوق","الايرادات",12,"2018-07-02","الصندوق","احمد يعسوب  صبيح",1100,{"$f":"IF(#REF!<>\"\",INDEX(#REF!,MATCH(0,COUNTIF($J$4:J15,#REF!),0)),\"\")","v":{"$error":"#REF!"}},{"$f":"SUMPRODUCT(--(#REF!=J16),$I$5:$I$22)","v":{"$error":"#REF!"}}]
[null,null,"الصندوق","الايرادات",13,"2018-07-02","الصندوق","الكرار محمد رضا تركي",650,{"$f":"IF(#REF!<>\"\",INDEX(#REF!,MATCH(0,COUNTIF($J$4:J16,#REF!),0)),\"\")","v":{"$error":"#REF!"}},{"$f":"SUMPRODUCT(--(#REF!=J17),$I$5:$I$22)","v":{"$error":"#REF!"}}]
[null,null,"الصندوق","الايرادات",14,"2018-07-02","الصندوق","يوسف مكي شاكر",7500,{"$f":"IF(#REF!<>\"\",INDEX(#REF!,MATCH(0,COUNTIF($J$4:J17,#REF!),0)),\"\")","v":{"$error":"#REF!"}},{"$f":"SUMPRODUCT(--(#REF!=J18),$I$5:$I$22)","v":{"$error":"#REF!"}}]
[null,null,"الصندوق","الايرادات",15,"2018-07-03","الصندوق","رضا كاظم ناصر ",600,{"$f":"IF(#REF!<>\"\",INDEX(#REF!,MATCH(0,COUNTIF($J$4:J18,#REF!),0)),\"\")","v":{"$error":"#REF!"}},{"$f":"SUMPRODUCT(--(#REF!=J19),$I$5:$I$22)","v":{"$error":"#REF!"}}]
[null,null,"الصندوق","الايرادات",16,"2018-07-03","الصندوق","مرتضى رحيم حسين",300,{"$f":"IF(#REF!<>\"\",INDEX(#REF!,MATCH(0,COUNTIF($J$4:J19,#REF!),0)),\"\")","v":{"$error":"#REF!"}},{"$f":"SUMPRODUCT(--(#REF!=J20),$I$5:$I$22)","v":{"$error":"#REF!"}}]
[null,null,"الصندوق","الايرادات",17,"2018-07-01","الصندوق","حسن المضي جبار زامل",1000,{"$f":"IF(#REF!<>\"\",INDEX(#REF!,MATCH(0,COUNTIF($J$4:J20,#REF!),0)),\"\")","v":{"$error":"#REF!"}},{"$f":"SUMPRODUCT(--(#REF!=J21),$I$5:$I$22)","v":{"$error":"#REF!"}}]
[null,null,"الصندوق","الايرادات",18,"2018-06-01","الصندوق","مرتجى تحرير حميد",1500,{"$f":"IF(#REF!<>\"\",INDEX(#REF!,MATCH(0,COUNTIF($J$4:J21,#REF!),0)),\"\")","v":{"$error":"#REF!"}},{"$f":"SUMPRODUCT(--(#REF!=J22),$I$5:$I$22)","v":{"$error":"#REF!"}}]
[null,null,"الصندوق","الايرادات",19,"2018-06-01","الصندوق","محمد حسن قنان",1500]
[null,null,"الصندوق","الايرادات",20,"2018-06-01","الصندوق","منتظر عبد الرحيم",1500]
[null,null,"الصندوق","الايرادات",21,"2018-06-01","الصندوق","كرار جاسم جواد",1500]
[null,null,"الصندوق","الايرادات",22,"2018-06-01","الصندوق","منتظر احمد هاشم",1500]
[null,null,"الصندوق","الايرادات",23,"2018-06-01","الصندوق","علي نوري خضير",1500]
[null,null,"الصندوق","الايرادات",24,"2018-06-01","الصندوق","علي حسين رشيد",1500]
[null,null,"الصندوق","الايرادات",25,"2018-06-01","الصندوق","مريم ضياء شسعيد",1500]
[null,null,"الصندوق","الايرادات",26,"2018-06-01","الصندوق","محمد رضا فائز مرتضى",1500]
[null,null,"الصندوق","الايرادات",27,"2018-06-01","الصندوق","عمار علي خيون",1500]
[null,null,"الصندوق","الايرادات",28,"2018-07-07","الصندوق","محمد علي حسين صالح",1500]
[null,null,"الصندوق","الايرادات",29,"2018-07-07","الصندوق","رزاق حيدر رزاق",1500]
[null,null,"الصندوق","الايرادات",30,"2018-07-07","الصندوق","علي عامر محمد موسى كاظم",1500]
[null,null,"الصندوق","الايرادات",31,"2018-07-07","الصندوق","محمد حسن عبد الهادي",1500]
[null,null,"الصندوق","الايرادات",32,"2018-07-01","الصندوق","علاء الدين حسين اسماعيل",1500]
[null,null,"الصندوق","الايرادات",33,"2018-07-24","الصندوق","صفاء الدين حسين اسماعيل",1500]
[null,null,"الصندوق","الايرادات",34,"2018-07-01","الصندوق","علي الكرار حيدر علي",1500]
[null,null,"الصندوق","الايرادات",35,"2018-07-09","الصندوق","يوسف حيدر محمد  رضا",1500]
[null,null,"الصندوق","الايرادات",36,"2018-07-09","الصندوق","محمد رضا حيدر محمد رضا",1500]
[null,null,"الصندوق","الايرادات",37,"2018-07-01","الصندوق","محمد علي سيف حسين",1500]
[null,null,"الصندوق","الايرادات",38,"2018-07-01","الصندوق","حسن صلاح حسن",1500]
[null,null,"الصندوق","الايرادات",39,"2018-07-01","الصندوق","علي نبيل عبد الهادي",1500]
[null,null,"الصندوق","الايرادات",40,"2018-07-01","الصندوق","محمد رضا علي حسين",1500]
[null,null,"الصندوق","الايرادات",41,"2018-07-01","الصندوق","محمد رضا مصطفى سعد",1500]
[null,null,"الصندوق","الايرادات",42,"2018-07-01","الصندوق","زيد مجيد عبد الكاظم",1500]
[null,null,"الصندوق","الايرادات",43,"2018-07-01","الصندوق","علي الرضا فلاح حسن",1500]
[null,null,"الصندوق","الايرادات",44,"2018-07-01","الصندوق","حسين عماد هاشم",1500]
[null,null,"الصندوق","الايرادات",45,"2018-07-01","الصندوق","زيد سعيد جبار ",1500]
[null,null,"الصندوق","الايرادات",46,"2018-08-01","الصندوق","مهدي حيدر محمد جلاب ",1500]
[null,null,"الصندوق","الايرادات",47,"2018-08-05","الصندوق","مقتدى نعمان محمد",1500]
[null,null,"الصندوق","الايرادات",48,"2018-06-08","الصندوق","محمد رضا محمد مطلب",1500]
[null,null,"الصندوق","الايرادات",49,"2018-07-08","الصندوق","مهيمن فراس سليم",1500]
[null,null,"الصندوق","الايرادات",50,"2018-07-08","الصندوق","محمد سعيد عامر كاظم ",1500]
[null,null,"الصندوق","الايرادات",51,"2018-07-08","الصندوق","يوسف محمد صالح ",1500]
[null,null,"الصندوق","الايرادات",52,"2018-08-08","الصندوق","محمد حسن جواد كاظم ",1500]
[null,null,"الصندوق","الايرادات",53,"2018-08-01","الصندوق","حسن محمد ناجي ",1500]
[null,null,"الصندوق","الايرادات",54,"2018-08-04","الصندوق","مرتضى محمد علي حسن ",1500]
[null,null,"الصندوق","الايرادات",55,"2018-08-12","الصندوق","حسين نوماس نبهان",1500]
[null,null,"الصندوق","الايرادات",56,"2018-08-12","الصندوق","حسنين حسين محسن",1500]
[null,null,"الصندوق","الايرادات",57,"2018-07-01","الصندوق","علي حسن نجم",1500]
[null,null,"الصندوق","الايرادات",58,"2018-07-01","الصندوق","عز الدين مشتاق عبد المطلب",1500]
[null,null,"الصندوق","الايرادات",59,"2018-07-01","الصندوق","امير محمد رضا مهدي",1500]
[null,null,"الصندوق","الايرادات",60,"2018-08-04","الصندوق","حسين عباس كريم",1500]
[null,null,"الصندوق","الايرادات",61,"2018-08-06","الصندوق","محمد مهدي منتظر",1500]
[null,null,"الصندوق","الايرادات",62,"2018-08-08","الصندوق","علي سعد وحيد",1500]
[null,null,"الصندوق","الايرادات",63,"2018-08-05","الصندوق","علي عبد المحسن ",1500]
[null,null,"الصندوق","الايرادات",64,"2018-08-05","الصندوق","علي درع جبار",1500]
[null,null,"الصندوق","الايرادات",65,"2018-07-01","الصندوق","محمد باقر درع جبار",1500]
[null,null,"الصندوق","الايرادات",66,"2018-08-01","الصندوق","فضل الله عبد الحسين ناهي",1500]
[null,null,"الصندوق","الايرادات",67,"2018-08-01","الصندوق","سالم قاسم محسن ",1500]
[null,null,"الصندوق","الايرادات",68,"2018-08-01","الصندوق","يزن ازار محمد رضا",1500]
[null,null,"الصندوق","الايرادات",69,"2018-08-01","الصندوق","مسلم عمار عبد ال...",1500]
[null,null,"الصندوق","الايرادات",70,"2018-08-01","الصندوق","علي اكبر علي ابراهيم ",1500]
[null,null,"الصندوق","الايرادات",71,"2018-08-01","الصندوق","مهدي ستار عبد الساده ",1500]
[null,null,"الصندوق","الايرادات",72,"2018-08-01","الصندوق","سجاد ماجد عكله ",1500]
[null,null,"الصندوق","الايرادات",73,"2018-08-01","الصندوق","علي ماجد عكله ",1500]
[null,null,"الصندوق","الايرادات",74,"2018-08-01","الصندوق","احمد ماجد عكله",1500]
[null,null,"الصندوق","الايرادات",75,"2018-08-01","الصندوق","ضرغام عبد المنعم عبد الرحيم ",1500]
[null,null,"الصندوق","الايرادات",76,"2018-08-01","الصندوق","ظافر حسين كريم ",1500]
[null,null,"الصندوق","الايرادات",77,"2018-08-01","الصندوق","احمد وسيم كفاح ",1500]
[null,null,"الصندوق","الايرادات",78,"2018-08-01","الصندوق","رسول محمد عبد الله",1500]
[null,null,"الصندوق","الايرادات",79,"2018-08-01","الصندوق","ليث محمد عبد الله",1500]
[null,null,"الصندوق","الايرادات",80,"2018-08-01","الصندوق","عبد الله حيدر عبد كاضم",1500]
[null,null,"الصندوق","الايرادات",81,"2018-08-01","الصندوق","عباس نوفل منتضر",1500]
[null,null,"الصندوق","الايرادات",82,"2018-08-01","الصندوق","حسين صفاء عبد الله",1500]
[null,null,"الصندوق","الايرادات",83,"2018-08-01","الصندوق","حسين شاكر عوده",1500]
[null,null,"الصندوق","الايرادات",84,"2018-08-19","الصندوق","محمد اياد محمد",1500]
[null,null,"الصندوق","الايرادات",85,"2018-08-01","الصندوق","محمد نبيل مرعي حسن",1500]
[null,null,"الصندوق","الايرادات",86,"2018-08-01","الصندوق","مصطفى حيدر فرحان ",1500]
[null,null,"الصندوق","الايرادات",87,"2018-08-01","الصندوق","محمد جميل رحيم ",1500]
[null,null,"الصندوق","الايرادات",88,"2018-08-01","الصندوق","عباس حيدر جودي ",1500]
[null,null,"الصندوق","الايرادات",89,"2018-08-01","الصندوق","مصطفى موسى جعفر ",1500]
[null,null,"الصندوق","الايرادات",90,"2018-08-01","الصندوق","امير عبد الله عبيد ",1500]
[null,null,"الصندوق","الايرادات",91,"2018-08-01","الصندوق","محمد حسن مجتبى محمد رضا ",1500]
[null,null,"الصندوق","الايرادات",92,"2018-08-01","الصندوق","بنين منذر صاحب محمد ",1500]
[null,null,"الصندوق","الايرادات",93,"2018-08-01","الصندوق","نهى حسن سودي ",1500]
[null,null,"الصندوق","الايرادات",94,"2018-08-01","الصندوق","جمانه حسن سودي ",1500]
[null,null,"الصندوق","الايرادات",95,"2018-08-01","الصندوق","فضه سلام عباس ",1500]
[null,null,"الصندوق","الايرادات",96,"2018-08-01","الصندوق","حسين يحي عبد الحسين ",1500]
[null,null,"الصندوق","الايرادات",97,"2018-08-01","الصندوق","محمود سعد عبود ",1500]
[null,null,"الصندوق","الايرادات",98,"2018-08-01","الصندوق","يوسف حسين حمودي ",1500]
[null,null,"الصندوق","الايرادات",99,"2018-08-01","الصندوق","ضياء كريم رسول ",1500]
[null,null,"الصندوق","الايرادات",100,"2018-09-01","الصندوق","محمد رضا منذر نعمان ",1500]
[null,null,"الصندوق","الايرادات",101,"2018-09-01","الصندوق","امير محمد مايح ",1500]
[null,null,"الصندوق","الايرادات",102,"2018-09-02","الصندوق","حسين رحيم حسين ",1500]
[null,null,"الصندوق","الايرادات",103,"2018-09-02","الصندوق","مسلم عقيل ابراهيم ",1500]
[null,null,"الصندوق","الايرادات",104,"2018-09-02","الصندوق","حسين عقيل ابراهيم ",1500]
[null,null,"الصندوق","الايرادات",105,"2018-09-02","الصندوق","عبد الله عقيل ابراهيم ",1500]
[null,null,"الصندوق","الايرادات",106,"2018-09-02","الصندوق","منتظر عبد العباس عبد الله ",1500]
[null,null,"الصندوق","الايرادات",107,"2018-09-02","الصندوق","حسن قاسم خلف ",1500]
[null,null,"الصندوق","الايرادات",108,"2018-09-02","الصندوق","فاطمه عباس حسن ",1500]
[null,null,"الصندوق","الايرادات",109,"2018-09-02","الصندوق","محمد باقر عباس ",1500]
[null,null,"الصندوق","الايرادات",110,"2018-09-02","الصندوق","جعفر عباس حسن ",1500]
[null,null,"الصندوق","الايرادات",111,"2018-09-02","الصندوق","همام قصي نعمه حسون ",1500]
[null,null,"الصندوق","الايرادات",112,"2018-09-02","الصندوق","مؤمل قصي نعمه حسون ",1500]
[null,null,"الصندوق","الايرادات",113,"2018-09-03","الصندوق","رضا نبيل محمد حسن ",1500]
[null,null,"الصندوق","الايرادات",114,"2018-09-03","الصندوق","محمد رضا بهاء محمد علي ",1500]
[null,null,"الصندوق","الايرادات",115,"2018-09-03","الصندوق","محمد علي حيدر صباح ",1500]
[null,null,"الصندوق","الايرادات",116,"2018-09-03","الصندوق","حسين علي رحيم ",1500]
[null,null,"الصندوق","الايرادات",117,"2018-09-03","الصندوق","حسن احمد علي محمد ",1500]
[null,null,"الصندوق","الايرادات",118,"2018-09-10","الصندوق","مجتبى باسم مرهون ",1500]
[null,null,"الصندوق","الايرادات",119,"2018-09-10","الصندوق","مهدي منتظر رعد ",1500]
[null,null,"الصندوق","الايرادات",120,"2018-09-10","الصندوق","حسين جبار عبد الحسين ",1500]
[null,null,"الصندوق","الايرادات",121,"2018-09-10","الصندوق","عباس حسن عبد الله ",1500]
[null,null,"الصندوق","الايرادات",122,"2018-09-10","الصندوق","رضا حسين عبد الله ",1500]
[null,null,"الصندوق","الايرادات",123,"2018-09-10","الصندوق","عبد الله علي محمد ",1500]
[null,null,"الصندوق","الايرادات",124,"2018-09-10","الصندوق","رضا حيدر هادي ",1500]
[null,null,"الصندوق","الايرادات",125,"2018-06-09","الصندوق","مجتبى حسن جاسم ",1500]
[null,null,"الصندوق","الايرادات",126,"2018-05-09","الصندوق","محمد مهنا حمود حمادي ",1500]
[null,null,"الصندوق","الايرادات",127,"2018-05-09","الصندوق","مصطفى توفيق عبد الرحيم ",1500]
[null,null,"الصندوق","الايرادات",128,"2018-05-09","الصندوق","شهد محمد مهدي محي الدين ",1500]
[null,null,"الصندوق","الايرادات",129,"2018-05-09","الصندوق","ضرغام مهند محمد زاير ",1500]
[null,null,"الصندوق","الايرادات",130,"2018-05-09","الصندوق","عباس اسعد قاسم ",1500]
[null,null,"الصندوق","الايرادات",131,"2018-05-09","الصندوق","روح الله اسامه سلمان ",1500]
[null,null,"الصندوق","الايرادات",132,"2018-09-09","الصندوق","اسد ضرغام رزاق ",1500]
[null,null,"الصندوق","الايرادات",133,"2018-09-09","الصندوق","محمد رؤوف محمد",1500]
[null,null,"الصندوق","الايرادات",134,"2018-09-09","الصندوق","المصطفى كرار فاضل ",1500]
[null,null,"الصندوق","الايرادات",135,"2018-09-09","الصندوق","حسن احمد جبار ",1500]
[null,null,"الصندوق","الايرادات",136,"2018-09-09","الصندوق","محمد حيدر مسافر ",1500]
[null,null,"الصندوق","الايرادات",137,"2018-09-09","الصندوق","مهدي منتظر محمد ",1500]
[null,null,"الصندوق","الايرادات",138,"2018-09-09","الصندوق","منتظر احمد عبد الرحمن ",1500]
[null,null,"الصندوق","الايرادات",139,"2018-09-11","الصندوق","محمد حسين طيب ",1500]
[null,null,"الصندوق","الايرادات",140,"2018-09-15","الصندوق","حسن علي صاحب ",1500]
[null,null,"الصندوق","الايرادات",141,"2018-09-15","الصندوق","زهراء علي صاحب ",1500]
[null,null,"الصندوق","الايرادات",142,"2018-09-13","الصندوق","حسنين علي عبد الزهره ",1500]
[null,null,"الصندوق","الايرادات",143,"2018-09-13","الصندوق","حوراء حيدر محمد موسى ",1500]
[null,null,"الصندوق","الايرادات",144,"2018-09-13","الصندوق","حذيفه حيدر عليوي ",1500]
[null,null,"الصندوق","الايرادات",145,"2018-09-13","الصندوق","عليوي حيدر عليوي ",1500]
[null,null,"الصندوق","الايرادات",146,"2018-09-13","الصندوق","سراء عبد الرسول صالح ",1500]
[null,null,"الصندوق","الايرادات",147,"2018-09-13","الصندوق","مصطفى حيدر ميثم عبد الله ",1500]
[null,null,"الصندوق","الايرادات",148,"2018-09-13","الصندوق","رقيه حيدر ميثم عبد الله ",1500]
[null,null,"الصندوق","الايرادات",149,"2018-09-13","الصندوق","محمد باقر حيدر اسماعيل ",1500]
[null,null,"الصندوق","الايرادات",150,"2018-09-13","الصندوق","ملك عبد الله عبد الكريم بلال ",1500]
[null,null,"الصندوق","الايرادات",151,"2018-09-13","الصندوق","مهدي عبد الكريم بلال ",1500]
[null,null,"الصندوق","الايرادات",152,"2018-09-13","الصندوق","نرجس عبد الله عبد الكريم بلال ",1500]
[null,null,"الصندوق","الايرادات",153,"2018-09-13","الصندوق","جعفر مهدي ابراهيم ",1500]
[null,null,"الصندوق","الايرادات",154,"2018-09-13","الصندوق","صادق حيدر ابراهيم ",1500]
[null,null,"الصندوق","الايرادات",155,"2018-09-13","الصندوق","علي خليل ابراهيم ",1500]
[null,null,"الصندوق","الايرادات",156,"2018-09-13","الصندوق","ميار اجود محسن عبد الصاحب",1500]
[null,null,"الصندوق","الايرادات",157,"2018-09-13","الصندوق","ياسين اجود محسن عبد الصاحب",1500]
[null,null,"الصندوق","الايرادات",158,"2018-09-13","الصندوق","فاطمه منتظر هدي صاحب ",1500]
[null,null,"الصندوق","الايرادات",159,"2018-09-13","الصندوق","رويده علاء رحيم ",1500]
[null,null,"الصندوق","الايرادات",160,"2018-09-15","الصندوق","مقداد اسعد رشاد ",1500]
[null,null,"الصندوق","الايرادات",161,"2018-09-16","الصندوق","محمد عقيل حسن ",1500]
[null,null,"الصندوق","الايرادات",162,"2018-09-16","الصندوق","رضا اثير يوسف ",1500]
[null,null,"الصندوق","الايرادات",163,"2018-09-16","الصندوق","علي رضا مسلم طالب ",1500]
[null,null,"الصندوق","الايرادات",164,"2018-09-16","الصندوق","امين ناجي محسن ",1500]
[null,null,"الصندوق","الايرادات",165,"2018-09-13","الصندوق","كميل زيد عباس ",1500]
[null,null,"الصندوق","الايرادات",166,"2018-09-13","الصندوق","ذو الفقار علي وميض حامد ",1500]
[null,null,"الصندوق","الايرادات",167,"2018-09-13","الصندوق","حوراء محمد علي هاشم ",1500]
[null,null,"الصندوق","الايرادات",168,"2018-09-13","الصندوق","هاشم محمد علي هاشم ",1500]
[null,null,"الصندوق","الايرادات",169,"2018-09-13","الصندوق","حسين محمد عبد الحمزه مهدي ",1500]
[null,null,"الصندوق","الايرادات",170,"2018-09-13","الصندوق","بنين احمد عبد الامير ",1500]
[null,null,"الصندوق","الايرادات",171,"2018-09-13","الصندوق","نرجس احمد عبد الامير ",1500]
[null,null,"الصندوق","الايرادات",172,"2018-09-13","الصندوق","محمد احمد عبد الامير ",1500]
[null,null,"الصندوق","الايرادات",173,"2018-09-13","الصندوق","حسين نصير جبر ",1500]
[null,null,"الصندوق","الايرادات",174,"2018-09-13","الصندوق","رضا ميثم حسن ",1500]
[null,null,"الصندوق","الايرادات",175,"2018-09-13","الصندوق","كميل ميثم حسن راضي ",1500]
[null,null,"الصندوق","الايرادات",176,"2018-09-13","الصندوق","عباس ميثم حسن راضي ",1500]
[null,null,"الصندوق","الايرادات",177,"2018-09-12","الصندوق","زهراء راهي منصور ",1500]
[null,null,"الصندوق","الايرادات",178,"2018-09-12","الصندوق","علي هادي راهي ",1500]
[null,null,"الصندوق","الايرادات",179,"2018-09-12","الصندوق","حسين راهي منصور ",1500]
[null,null,"الصندوق","الايرادات",180,"2018-09-12","الصندوق","غيث عمار عبد علي ",1500]
[null,null,"الصندوق","الايرادات",181,"2018-09-12","الصندوق","علي بهاء مهدي ",1500]
[null,null,"الصندوق","الايرادات",182,"2018-09-12","الصندوق","نرجس عباس جاسم حسن ",1500]
[null,null,"الصندوق","الايرادات",183,"2018-09-12","الصندوق","نور الهدى عباس جاسم ",1500]
[null,null,"الصندوق","الايرادات",184,"2018-09-12","الصندوق","حوراء عباس جاسم ",1500]
[null,null,"الصندوق","الايرادات",185,"2018-09-12","الصندوق","زهراء عباس جاسم حسن ",1500]
[null,null,"الصندوق","الايرادات",186,"2018-09-12","الصندوق","محمد اياد محمد",1500]
[null,null,"الصندوق","الايرادات",187,"2018-09-12","الصندوق","علي عادل محمد ",1500]
[null,null,"الصندوق","الايرادات",188,"2018-09-12","الصندوق","محمد عادل محمد ",1500]
[null,null,"الصندوق","الايرادات",189,"2018-09-12","الصندوق","طارق هشام حميد ",1500]
[null,null,"الصندوق","الايرادات",190,"2018-09-12","الصندوق","مصطفى رائد لطيف ",1500]
[null,null,"الصندوق","الايرادات",191,"2018-09-12","الصندوق","ايسار يوسف حمود عبد الامير ",1500]
[null,null,"الصندوق","الايرادات",192,"2018-09-12","الصندوق","حيدر يوسف حمود عبد الامير ",1500]
[null,null,"الصندوق","الايرادات",193,"2018-09-12","الصندوق","محمد باقر سعد هاتف ",1500]
[null,null,"الصندوق","الايرادات",194,"2018-09-12","الصندوق","محمد رضا يوسف حمود ",1500]
[null,null,"الصندوق","الايرادات",195,"2018-09-12","الصندوق","جعفر محمد باقر ياسين ",1500]
[null,null,"الصندوق","الايرادات",196,"2018-09-12","الصندوق","مريم حيدر ابراهيم ",1500]
{"$rows_left_out":1959}
{"sheet":"Sheet2","index":1,"n_rows":0,"n_cols":0,"rows_kept":0,"cut":false,"hidden":false,"merged":[]}

{"sheet":"Sheet3","index":2,"n_rows":0,"n_cols":0,"rows_kept":0,"cut":false,"hidden":false,"merged":[]}