{"text_format":"1","workbook":"xlsx","n_sheets":3,"sheets":["بيانات","ورقة1","بحث عن الافراد"],"not_rendered":{"charts":0,"images":2,"macros":1,"external_links":0,"defined_names":3,"comments":0,"pivot_tables":0},"unopened":[],"bounds":{"document_bytes":16777216,"sheet_cells":100000,"rows_first":2000,"rows_last":500,"rows_between":2000,"halvings":0,"cell_chars":16384,"cell_head_chars":4096},"cells_cut":0,"cells_raw":0,"read":"whole","date_system":"1900"}

{"sheet":"بيانات","index":0,"n_rows":20,"n_cols":7,"rows_kept":20,"cut":false,"hidden":false,"merged":[]}
["الحسابات","نوع السند","marhla","mblgh"]
["الايرادات","قبض","الاول ابتدائي ",900000,null,null,"محمد "]
["الصندوق","ذمم","الثاني ابتدائي ",900000,null,null,"كريم"]
["الذمم",null,"الثالث ابتدائي ",900000,null,null,"اسعد "]
[null,null,"الرابع ابتدائي ",900000,null,null,"اسعد حسن"]
[null,null,"الخامس ابتدائي ",950000,null,null,"علي ناصر"]
[null,null,"السادس ابتدائي ",950000,null,null,"عبد المطلب عبد القهار"]
[null,null,"الاول متوسط ",1000000,null,null,"حسين حسن "]
[null,null,"الثاني متوسط ",1000000,null,null,"محمد صلاح"]
[null,null,"الثالث متوسط ",1050000,null,null,"كمال عبد السميع"]
[null,null,"الرابع اعدادي ",1350000,null,null,"حسين حسن "]
[null,null,"الخامس اعدادي ",1350000,null,null,"محمد صلاح"]
[null,null,"السادس اعدادي ",2000000,null,null,"كمال عبد السميع"]
[null,null,null,null,null,null,"حسين حسن "]
[null,null,null,null,null,null,"محمد صلاح"]
[null,null,null,null,null,null,"كمال عبد السميع"]
[null,null,null,null,null,null,"حسين حسن "]
[null,null,null,null,null,null,"كريم"]
[null,null,null,null,null,null,"اسعد "]
[null,null,null,null,null,null,"اسعد حسن"]

{"sheet":"ورقة1","index":1,"n_rows":5,"n_cols":9,"rows_kept":5,"cut":false,"hidden":false,"merged":[]}
[]
[]
[]
[null,"علي نوري خضير",null,"مبلغ القسط الواصل","اسم المدرسة","المرحلة","المبلغ الكلي للقسط","مجموع مادفعه من اقساط","الباقي بالذمة"]
[null,null,null,{"$f":"VLOOKUP($B$4,#REF!,COLUMNS($H$1:H1)+2,0)","v":{"$error":"#REF!"}},{"$f":"VLOOKUP($B$4,#REF!,COLUMNS($H$1:H1)+5,0)","v":{"$error":"#REF!"}},{"$f":"VLOOKUP($B$4,#REF!,COLUMNS($H$1:H1)+6,0)","v":{"$error":"#REF!"}},{"$f":"VLOOKUP($B$4,#REF!,COLUMNS($H$1:H1)+7,0)","v":{"$error":"#REF!"}},{"$f":"SUMIF(#REF!,$B$4,#REF!)","v":{"$error":"#REF!"}},{"$f":"G5-H5","v":{"$error":"#REF!"}}]

{"sheet":"بحث عن الافراد","index":2,"n_rows":2,"n_cols":9,"rows_kept":2,"cut":false,"hidden":false,"merged":[]}
[null,null,null,null,"علي نوري خضير"]
[null,"رقم الوصل","التاريخ","القسط المدفوع","المدرسة","المرحلة","القسط الكلي","مجموع مادفعه","الباقي"]