{"text_format":"1","workbook":"xlsx","n_sheets":3,"sheets":["شيت الرابع","شهادات الرابع","شهادات الأوائل"],"not_rendered":{"charts":0,"images":6,"macros":1,"external_links":1,"defined_names":4,"comments":0,"pivot_tables":0},"unopened":[],"bounds":{"document_bytes":16777216,"sheet_cells":100000,"rows_first":2000,"rows_last":500,"rows_between":2000,"halvings":0,"cell_chars":16384,"cell_head_chars":4096},"cells_cut":0,"cells_raw":0,"read":"whole","date_system":"1900"}

{"sheet":"شيت الرابع","index":0,"n_rows":618,"n_cols":142,"rows_kept":618,"cut":false,"hidden":false,"merged":[[0,36,0,40],[1,36,1,37],[1,39,1,40],[1,43,1,44],[4,5,5,6],[0,22,0,26],[1,22,1,23],[1,25,1,26],[1,29,1,30],[3,8,6,8],[1,13,6,14],[1,10,6,11],[0,15,0,19],[1,15,1,16],[0,5,1,6],[0,8,2,8],[2,5,3,6],[0,13,0,14],[1,18,1,19],[1,32,1,33],[0,29,0,33],[1,46,1,47],[0,78,0,82],[1,78,1,79],[1,81,1,82],[0,50,0,53],[0,55,0,58],[9,120,9,130],[7,65,7,68],[9,102,9,111],[8,45,8,46],[7,54,10,54],[8,80,8,81],[7,60,7,63],[7,64,10,64],[8,62,9,62],[8,63,9,63],[0,65,0,68],[0,70,0,73],[0,60,0,63],[7,78,7,83],[7,70,7,73],[0,43,0,47],[33,110,33,111],[28,106,29,108],[8,102,8,111],[10,88,10,93],[26,103,27,103],[13,102,13,111],[27,110,27,111],[30,110,30,111],[26,104,27,104],[32,110,32,111],[29,110,29,111],[8,34,9,34],[7,35,10,35],[7,2,10,2],[7,3,10,3],[7,8,10,8],[7,7,10,7],[7,6,10,6],[8,15,8,16],[8,67,9,67],[7,12,9,14],[8,27,9,27],[7,21,10,21],[8,17,8,18],[8,53,9,53],[7,29,7,34],[8,22,8,23],[7,49,10,49],[8,48,9,48],[7,43,7,48],[8,31,8,32],[8,33,9,33],[7,15,7,20],[10,12,10,14],[8,20,9,20],[8,19,9,19],[7,132,8,141],[7,69,10,69],[7,74,10,74],[7,86,10,86],[7,76,10,76],[7,50,7,53],[7,85,9,85],[8,72,9,72],[8,113,8,117],[9,113,9,117],[7,55,7,58],[8,58,9,58],[8,57,9,57],[7,59,10,59],[8,68,9,68],[7,84,10,84],[8,52,9,52],[8,83,9,83],[7,77,9,77],[8,82,9,82],[7,75,9,75],[8,73,9,73],[8,78,8,79],[25,113,25,117],[26,113,26,117],[7,9,9,11],[7,0,10,0],[7,1,10,1],[8,43,8,44],[8,24,8,25],[7,36,7,41],[7,4,10,4],[7,28,10,28],[7,5,10,5],[7,22,7,27],[8,26,9,26],[8,41,9,41],[8,38,8,39],[7,42,10,42],[8,40,9,40],[8,47,9,47],[17,102,17,111],[26,106,27,108],[23,102,24,111],[26,110,26,111],[8,29,8,30],[8,36,8,37]]}
["غ",null,"                          إدارة قويسنا التعليمية0 ",null,null,{"$f":"TEXT(F3,\"dddd\")","v":"Wednesday"},null,null,"بداية رقم الجلوس","عدد التلاميذ",null,null,null,"منقطعين",null,"لغة عربية",null,null,null,null,null,null,"رياضيات",null,null,null,null,null,null,"لغة إنجليزية",null,null,null,null,null,null,"دراسات",null,null,null,null,null,null,"علــــــوم",null,null,null,null,null,null,"نشاط (فنى)",null,null,null,null,"نشاط (رياضى)",null,null,null,null,"نشاط (حاسب آلى)",null,null,null,null,"نشاط (1)",null,null,null,null,"نشاط (2)",null,null,null,null,null,null,null,"التربية الدينية"]
[null,null,"                                  مدرسة عرب الرمال الإبتدائية سكة حديد0",null,null,null,null,null,null,null,{"$f":"COUNT(G12:G300)","v":125},null,null,{"$f":"COUNTIF(BX12:BX117,\"غ\")","v":2},null,"نصف العام",null,null,"آخر العام",null,null,null,"نصف العام",null,null,"آخر العام",null,null,null,"نصف العام",null,null,"آخر العام",null,null,null,"نصف العام",null,null,"آخر العام",null,null,null,"نصف العام",null,null,"آخر العام",null,null,null,null,"ناجح",null,{"$f":"BB4-BB3","v":123},null,null,"ناجح",null,{"$f":"BG4-BG3","v":123},null,null,"ناجح",null,{"$f":"BL4-BL3","v":123},null,null,"ناجح",null,{"$f":"BQ4-BQ3","v":123},null,null,"ناجح",null,{"$f":"BV4-BV3","v":123},null,null,null,null,"نصف العام",null,null,"آخر العام"]
[null,null,null,null,null,{"$f":"TODAY()","v":"2018-10-10"},null,null,null,null,null,null,null,null,null,"ناجح",{"$f":"Q5-Q4","v":117},null,"ناجح",{"$f":"T5-T4","v":117},"دون المستوى",null,"ناجح",{"$f":"X5-X4","v":118},null,"ناجح",{"$f":"AA5-AA4","v":121},"دون المستوى",null,"ناجح",{"$f":"AE5-AE4","v":120},null,"ناجح",{"$f":"AH5-AH4","v":123},"دون المستوى",null,"ناجح",{"$f":"AL5-AL4","v":115},null,"ناجح",{"$f":"AO5-AO4","v":118},"دون المستوى",null,"ناجح",{"$f":"AS5-AS4","v":121},null,"ناجح",{"$f":"AV5-AV4","v":123},"دون المستوى",null,null,"راسب",null,{"$f":"COUNTIF(BC12:BC117,\"دون المستوى\")","v":0},null,null,"راسب",null,{"$f":"COUNTIF(BH12:BH117,\"دون المستوى\")","v":0},null,null,"راسب",null,{"$f":"COUNTIF(BM12:BM117,\"دون المستوى\")","v":0},null,null,"راسب",null,{"$f":"COUNTIF(BR12:BR117,\"دون المستوى\")","v":0},null,null,"راسب",null,{"$f":"COUNTIF(BW12:BW117,\"دون المستوى\")","v":0},null,null,null,null,"ناجح",{"$f":"CB5-CB4","v":117},null,"ناجح",{"$f":"CE5-CE4","v":118},"دون المستوى"]
[null,null,null,null,null,null,null,"دمج ( 3 )",1,null,null,null,null,null,null,"راسب",{"$f":"SUMPRODUCT(--(Q12:Q136<20)+(Q12:Q136=\"غ\"))","v":6},null,"راسب",{"$f":"COUNTIF(V12:V136,\"دون المستوى\")","v":6},{"$f":"COUNTIF(V12:V118,\"دون المستوى\")","v":6},null,"راسب",{"$f":"SUMPRODUCT(--(X12:X136<20)+(X12:X136=\"غ\"))","v":5},null,"راسب",{"$f":"COUNTIF(AC12:AC136,\"دون المستوى\")","v":2},{"$f":"COUNTIF(AC12:AC118,\"دون المستوى\")","v":2},null,"راسب",{"$f":"SUMPRODUCT(--(AE12:AE136<20)+(AE12:AE136=\"غ\"))","v":3},null,"راسب",{"$f":"COUNTIF(AJ12:AJ136,\"دون المستوى\")","v":0},{"$f":"COUNTIF(AJ12:AJ118,\"دون المستوى\")","v":0},null,"راسب",{"$f":"SUMPRODUCT(--(AL12:AL136<20)+(AL12:AL136=\"غ\"))","v":8},null,"راسب",{"$f":"COUNTIF(AQ12:AQ136,\"دون المستوى\")","v":5},{"$f":"COUNTIF(AQ12:AQ118,\"دون المستوى\")","v":5},null,"راسب",{"$f":"SUMPRODUCT(--(AS12:AS136<20)+(AS12:AS136=\"غ\"))","v":2},null,"راسب",{"$f":"COUNTIF(AX12:AX136,\"دون المستوى\")","v":0},{"$f":"COUNTIF(AX12:AX118,\"دون المستوى\")","v":0},null,null,"حاضر",null,{"$f":"$K$2-BB5","v":123},null,null,"حاضر",null,{"$f":"$K$2-BG5","v":123},null,null,"حاضر",null,{"$f":"$K$2-BL5","v":123},null,null,"حاضر",null,{"$f":"$K$2-BQ5","v":123},null,null,"حاضر",null,{"$f":"$K$2-BV5","v":123},null,null,null,null,"راسب",{"$f":"SUMPRODUCT(--(CB12:CB136<20)+(CB12:CB136=\"غ\"))","v":6},null,"راسب",{"$f":"COUNTIF(CG12:CG136,\"دون المستوى\")","v":5},{"$f":"COUNTIF(CG12:CG118,\"دون المستوى\")","v":5}]
[null,null,null,null,null,{"$f":"TODAY()","v":"2018-10-10"},null,"باقى للإعاده ( عاطف محمد السيد يوسف )",null,null,null,null,null,null,null,"حاضر",{"$f":"K2-Q6","v":123},null,"حاضر",{"$f":"$K$2-T6","v":123},null,null,"حاضر",{"$f":"$K$2-X6","v":123},null,"حاضر",{"$f":"$K$2-AA6","v":123},null,null,"حاضر",{"$f":"$K$2-AE6","v":123},null,"حاضر",{"$f":"$K$2-AH6","v":123},null,null,"حاضر",{"$f":"$K$2-AL6","v":123},null,"حاضر",{"$f":"$K$2-AO6","v":123},null,null,"حاضر",{"$f":"$K$2-AS6","v":123},null,"حاضر",{"$f":"$K$2-AV6","v":123},null,null,"غياب",{"$f":"COUNTIF(AZ12:AZ135,\"غ\")","v":3},null,{"$f":"COUNTIF(BB12:BB136,\"غ\")","v":2},null,"غياب",{"$f":"COUNTIF(BE12:BE135,\"غ\")","v":3},null,{"$f":"COUNTIF(BG12:BG136,\"غ\")","v":2},null,"غياب",{"$f":"COUNTIF(BJ12:BJ135,\"غ\")","v":3},null,{"$f":"COUNTIF(BL12:BL136,\"غ\")","v":2},null,"غياب",{"$f":"COUNTIF(BO12:BO135,\"غ\")","v":3},null,{"$f":"COUNTIF(BQ12:BQ136,\"غ\")","v":2},null,"غياب",{"$f":"COUNTIF(BT12:BT135,\"غ\")","v":3},null,{"$f":"COUNTIF(BV12:BV136,\"غ\")","v":2},null,null,null,null,"حاضر",{"$f":"$K$2-CB6","v":123},null,"حاضر",{"$f":"$K$2-CE6","v":123}]
[null,null,null,null,null,null,null,null,null,null,null,null,null,null,null,"غياب",{"$f":"COUNTIF(Q12:Q136,\"غ\")","v":2},null,"غياب",{"$f":"COUNTIF(S12:S136,\"غ\")","v":2},null,null,"غياب",{"$f":"COUNTIF(X12:X136,\"غ\")","v":2},null,"غياب",{"$f":"COUNTIF(Z12:Z136,\"غ\")","v":2},null,null,"غياب",{"$f":"COUNTIF(AE12:AE136,\"غ\")","v":2},null,"غياب",{"$f":"COUNTIF(AG12:AG136,\"غ\")","v":2},null,null,"غياب",{"$f":"COUNTIF(AL12:AL136,\"غ\")","v":2},null,"غياب",{"$f":"COUNTIF(AN12:AN136,\"غ\")","v":2},null,null,"غياب",{"$f":"COUNTIF(AS12:AS136,\"غ\")","v":2},null,"غياب",{"$f":"COUNTIF(AU12:AU136,\"غ\")","v":2},null,null,"النسبة المئوية",null,null,{"$f":"BB2/BB4","v":1},null,"النسبة المئوية",null,null,{"$f":"BG2/BG4","v":1},null,"النسبة المئوية",null,null,{"$f":"BL2/BL4","v":1},null,"النسبة المئوية",null,null,{"$f":"BQ2/BQ4","v":1},null,"النسبة المئوية",null,null,{"$f":"BV2/BV4","v":1},null,null,null,null,"غياب",{"$f":"COUNTIF(CB12:CB117,\"غ\")","v":2},null,"غياب",{"$f":"COUNTIF(CD12:CD117,\"غ\")","v":2}]
[null,null,null,null,null,null,null,null,null,null,null,null,null,null,null,"النسبة ",{"$f":"Q3/Q5","v":0.95121951219512191},null,"النسبة ",{"$f":"T3/T5","v":0.95121951219512191},null,null,"النسبة ",{"$f":"X3/X5","v":0.95934959349593496},null,"النسبة ",{"$f":"AA3/AA5","v":0.98373983739837401},null,null,"النسبة ",{"$f":"AE3/AE5","v":0.97560975609756095},null,"النسبة ",{"$f":"AH3/AH5","v":1},null,null,"النسبة ",{"$f":"AL3/AL5","v":0.93495934959349591},null,"النسبة ",{"$f":"AO3/AO5","v":0.95934959349593496},null,null,"النسبة ",{"$f":"AS3/AS5","v":0.98373983739837401},null,"النسبة ",{"$f":"AV3/AV5","v":1},null,null,null,null,null,null,null,null,null,null,null,null,null,null,null,null,null,null,null,null,null,null,null,null,null,null,null,null,null,null,"النسبة ",{"$f":"CB3/CB5","v":0.95121951219512191},null,"النسبة ",{"$f":"CE3/CE5","v":0.95934959349593496}]
["الرقم القومى","تاريخ الميلاد","سرى ترم أول","سرى ترم ثان","الرقم السرى ترم أول","الرقم السرى ترم ثان","م","إســــــــم التلميذ","رقم الجلوس","تاريخ الميلاد",null,null,"السن فى أول أكتوبر   ",null,null,"لغة عربية",null,null,null,null,null,"المستوى","رياضيات",null,null,null,null,null,"المستوى","لغة إنجليزية",null,null,null,null,null,"المستوى","دراسات",null,null,null,null,null,"المستوى","علوم",null,null,null,null,null,"المستوى","نشاط (فنى)",null,null,null,"المستوى","نشاط (رياضى)",null,null,null,"المستوى","نشاط (حاسب آلى)",null,null,null,"المستوى","نشاط (1)",null,null,null,"المستوى","نشاط (2)",null,null,null,"المستوى","    المجموع الكلى","المستوى","المجموع بدون أنشطة     ","التربية الدينية",null,null,null,null,null,"المستوى","المجموع الإعتبارى","الترتيب",null,null,null,null,null,null,null,null,null,null,null,null,null,null,null,null,null,null,null,null,null,null,null,null,null,null,null,null,null,null,null,null,null,null,null,null,null,null,null,null,null,null,null,null,null,"نسبة 65 "]
[null,null,null,null,null,null,null,null,null,null,null,null,null,null,null,"نصف العام",null,"آخر العام",null,"مجموع","الدرجة",null,"نصف العام",null,"آخر العام",null,"مجموع","الدرجة",null,"نصف العام",null,"آخر العام",null,"مجموع","الدرجة",null,"نصف العام",null,"آخر العام",null,"مجموع","الدرجة",null,"نصف العام",null,"آخر العام",null,"مجموع","الدرجة",null,"نصف العام","آخر العام","مجموع","الدرجة",null,"نصف العام","آخر العام","مجموع","الدرجة",null,"نصف العام","آخر العام","مجموع","الدرجة",null,"نصف العام","آخر العام","مجموع","الدرجة",null,"نصف العام","آخر العام","مجموع","الدرجة",null,null,null,null,"نصف العام",null,"آخر العام",null,"مجموع","الدرجة",null,null,null,null,null,null,null,null,null,null,null,null,null,null,null,null,null,null,"الصف الخامس  2017/2016",null,null,null,null,null,null,null,null,null,null,"الصف الرابع 2018/2017"]
[null,null,null,null,null,null,null,null,null,null,null,null,null,null,null,"تقويم شامل","إختبار","ملف","إختبار",null,null,null,"تقويم شامل","إختبار","تقويم شامل","إختبار",null,null,null,"تقويم شامل","إختبار","تقويم شامل","إختبار",null,null,null,"تقويم شامل","إختبار","تقويم شامل","إختبار",null,null,null,"تقويم شامل","إختبار","تقويم شامل","إختبار",null,null,null,"تقويم شامل","تقويم شامل",null,null,null,"تقويم شامل","تقويم شامل",null,null,null,"تقويم شامل","تقويم شامل",null,null,null,"تقويم شامل","تقويم شامل",null,null,null,"تقويم شامل","تقويم شامل",null,null,null,null,null,null,"تقويم شامل","إختبار","ملف","إختبار",null,null,null,null,null,null,null,null,null,null,null,null,null,null,null,null,null,"ناجح",{"$f":"COUNTIF(CV12:CV217,\"ناجح\")","v":115},null,"إحصاء الناجحون",null,null,null,null,null,null,null,null,null,null,"الأوائــــــــــــــل بدون الأنشطه آخر العام",null,null,null,null,null,null,"درجـــــــــــــات الأوائــــــــــــــل",null,null,null,null,null,null,null,null,null,null,null,"عربى","رياضيات","إنجليزى","دراسات","علوم","فنى","رياضى","نشاط1","نشاط2","دين"]
{"$rows_left_out":609}
{"sheet":"شهادات الرابع","index":1,"n_rows":347,"n_cols":29,"rows_kept":347,"cut":false,"hidden":false,"merged":[[298,9,299,9],[286,9,287,9],[262,9,262,12],[263,9,264,9],[261,0,261,2],[251,9,252,9],[284,0,284,2],[285,9,285,12],[297,9,297,12],[273,9,273,12],[296,0,296,2],[274,9,275,9],[272,0,272,2],[262,5,262,6],[213,0,213,2],[225,0,225,2],[190,5,190,6],[201,5,201,6],[249,0,249,2],[189,0,189,2],[237,0,237,2],[250,5,250,6],[200,0,200,2],[214,5,214,6],[226,5,226,6],[238,5,238,6],[178,5,178,6],[191,9,192,9],[179,9,180,9],[131,5,131,6],[155,9,155,12],[178,9,178,12],[144,9,145,9],[132,9,133,9],[143,9,143,12],[190,9,190,12],[250,9,250,12],[202,9,203,9],[215,9,216,9],[226,9,226,12],[239,9,240,9],[227,9,228,9],[214,9,214,12],[238,9,238,12],[201,9,201,12],[177,0,177,2],[156,9,157,9],[166,5,166,6],[120,9,120,12],[131,9,131,12],[166,9,166,12],[46,10,46,11],[85,10,85,11],[73,10,73,11],[72,10,72,11],[60,10,60,11],[59,10,59,11],[47,10,47,11],[96,5,96,6],[142,0,142,2],[130,0,130,2],[18,13,18,15],[84,9,84,12],[19,9,19,12],[20,9,21,9],[46,9,47,9],[19,5,19,6],[108,9,108,12],[34,10,34,11],[33,10,33,11],[18,0,18,2],[83,0,83,2],[107,0,107,2],[120,5,120,6],[167,9,168,9],[109,9,110,9],[108,5,108,6],[121,9,122,9],[119,0,119,2],[97,9,98,9],[45,9,45,12],[95,0,95,2],[70,0,70,2],[33,9,34,9],[31,0,31,2],[47,2,47,8],[57,0,57,2],[84,5,84,6],[86,10,86,11],[44,0,44,2],[143,5,143,6],[155,5,155,6],[165,0,165,2],[154,0,154,2],[6,8,7,9],[71,9,71,12],[58,9,58,12],[96,9,96,12],[85,9,86,9],[59,9,60,9],[72,9,73,9],[32,9,32,12],[21,10,21,11],[20,10,20,11]]}
[null,null,null,null,null,null,null,null,null,null,null,null,"نور مصطفى عبد الرازق عبد الغنى "]
[]
[]
[]
[]
[]
[null,null,null,null,null,null,null,null," الرئيسية"]
[]
[]
[]
{"$rows_left_out":338}
{"sheet":"شهادات الأوائل","index":2,"n_rows":39,"n_cols":28,"rows_kept":39,"cut":false,"hidden":true,"merged":[[1,15,2,17],[18,9,19,9],[30,4,30,5],[2,4,2,5],[10,2,10,4],[3,1,3,3],[9,14,10,14],[31,9,32,9],[25,2,25,4],[38,2,38,4],[17,4,17,5],[18,1,18,3],[31,1,31,3]]}
[]
["إدارة قويسنا التعليمية",null,null,null,null,null,null,null,null,null,null,null,null,null,null,"الــرابـــــــــــــع"]
["  مدرسة /  منشاة دملو الإبتدائية0",null,null,null,"رقم الجلوس",null,{"$f":"LOOKUP(F4,AB7:AB23,'شيت الرابع'!DJ12:DJ23)","v":123},null,null,null,{"$f":"IF(L5>=90%,\"بارك الله لك\",\"\")","v":""}]
["الاســـم/ ",{"$f":"LOOKUP(F4,AB7:AB22,'شيت الرابع'!DK12:DK23)","v":"هنا أحمد محمد عبد العليم فرج"},null,null,null,1,null,null,null,{"$f":"LOOKUP(F4,AB7:AB23,'شيت الرابع'!DO12:DO23)","v":" ناجح "},"الترتيب","النسبة "]
["الصف الرابع",null,null,"نتيجة امتحان اخرالعام 2013/2012",null,null,null,null,null,null,{"$f":"LOOKUP(F4,AB7:AB23,'شيت الرابع'!DM12:DM23)","v":"الأول"},{"$f":"K9/K7","v":0.8839473684210527}]
["النهاية","عربي","حساب","انجليزي","علوم ","دراسات","فنى","رياضى","نشاط1","نشاط2","المجموع","دين"]
["الكبرى",100,80,40,40,40,20,20,20,20,380,40,null,null,null,null,"الرئيسية",null,null,null,null,null,null,null,null,null,null,1]
["الصغرى",50,40,20,20,20,10,10,10,10,190,20,null,null,null,null,null,null,null,null,null,null,null,null,null,null,null,2]
["الدرجة",{"$f":"LOOKUP(F4,AB7:AB23,'شيت الرابع'!DQ12:DQ23)","v":100},{"$f":"LOOKUP(F4,AB7:AB23,'شيت الرابع'!DR12:DR23)","v":77.599999999999994},{"$f":"LOOKUP(F4,AB7:AB23,'شيت الرابع'!DS12:DS23)","v":40},{"$f":"LOOKUP(F4,AB7:AB23,'شيت الرابع'!DU12:DU23)","v":39.6},{"$f":"LOOKUP(F4,AB7:AB23,'شيت الرابع'!DT12:DT23)","v":39.6},{"$f":"LOOKUP(F4,AB7:AB23,'شيت الرابع'!DW12:DW23)","v":19.600000000000001},{"$f":"LOOKUP(F4,AB7:AB23,'شيت الرابع'!DX12:DX23)","v":19.5},{"$f":"LOOKUP(F4,AB7:AB23,'شيت الرابع'!DY12:DY23)","v":19.600000000000001},{"$f":"LOOKUP(F4,AB7:AB23,'شيت الرابع'!DZ12:DZ23)","v":19.5},{"$f":"LOOKUP(F4,AB7:AB23,'شيت الرابع'!DV12:DV23)","v":335.90000000000003},{"$f":"LOOKUP(F4,AB7:AB23,'شيت الرابع'!EA12:EA23)","v":39.6},null,null,null,null,null,null,null,null,null,null,null,null,null,null,null,3]
["ش / ط ",null,null,"وكيل المدرسة",null,null,null,null,null,null,"مديرة المدرسة",null,null,null,"الإســـــــــــم",null,null,null,null,null,null,null,null,null,null,null,null,4]
{"$rows_left_out":29}