{"text_format":"1","workbook":"xlsx","n_sheets":53,"sheets":["البيانات","الشيت الرئيسي","R100","R101","R102","R103","R104","R105","R106","R107","R108","R109","R1010","R1011","R1012","R113","R114","R115","R116","R117","R118","R119","R120","R121","R122","R123","R124","R125","R126","R127","R128","R129","R130","R131","R132","R133","R134","R135","R136","R137","R138","R139","R140","R141","R142","R143","R144","R145","R146","R147","R148","R149","R150"],"not_rendered":{"charts":0,"images":0,"macros":1,"external_links":0,"defined_names":0,"comments":0,"pivot_tables":0},"unopened":[],"bounds":{"document_bytes":16777216,"sheet_cells":100000,"rows_first":2000,"rows_last":500,"rows_between":2000,"halvings":0,"cell_chars":16384,"cell_head_chars":4096},"cells_cut":0,"cells_raw":0,"read":"whole","date_system":"1900"}

{"sheet":"البيانات","index":0,"n_rows":52,"n_cols":7,"rows_kept":52,"cut":false,"hidden":false,"merged":[]}
["رقم الحافلة ","رقم الرحلة ","نوع الرحلة ","تاريخ الرحلة ","اسم المرشد ","فندق المدينة المنورة ","فندق مكة المكرمة "]
[1,"R100","طيران ","25-9-2018","محمود"]
[1,"R101","حافلات VIP",null,"حذيفه"]
[1,"R102","حافلات سياحية ",null,"علي"]
[2,"R103","طيران ",null,"حذيفه"]
[5,"R104",null,null,"علي"]
[null,"R105"]
[null,"R106"]
{"$rows_left_out":45}
{"sheet":"الشيت الرئيسي","index":1,"n_rows":45,"n_cols":12,"rows_kept":45,"cut":false,"hidden":false,"merged":[[44,0,44,9],[10,5,10,6],[5,5,5,6],[6,5,6,6],[8,5,8,6],[9,5,9,6]]}
[]
[]
[]
[]
[]
[null,null,null,null,null,"رقم الحافلة"]
[null,null,"حساب الرحلة ",null,null,{"$f":"IFERROR(INDEX(البيانات!$A$2:$A$320,MATCH($B$9,البيانات!$B$2:$B$320,0)),\"\")","v":1}]
[]
{"$rows_left_out":38}
{"sheet":"R100","index":2,"n_rows":45,"n_cols":12,"rows_kept":45,"cut":false,"hidden":false,"merged":[[44,0,44,9],[5,5,5,6],[6,5,6,6],[8,5,8,6],[9,5,9,6],[10,5,10,6]]}
[]
[]
[]
[]
[]
[null,null,null,null,null,"رقم الحافلة"]
[null,null,"حساب الرحلة ",null,null,{"$f":"IFERROR(INDEX(البيانات!$A$2:$A$320,MATCH($B$9,البيانات!$B$2:$B$320,0)),\"\")","v":1}]
[]
{"$rows_left_out":38}
{"sheet":"R101","index":3,"n_rows":45,"n_cols":12,"rows_kept":45,"cut":false,"hidden":false,"merged":[[44,0,44,9],[5,5,5,6],[6,5,6,6],[8,5,8,6],[9,5,9,6],[10,5,10,6]]}
[]
[]
[]
[]
[]
[null,null,null,null,null,"رقم الحافلة"]
[null,null,"حساب الرحلة ",null,null,{"$f":"IFERROR(INDEX(البيانات!$A$2:$A$320,MATCH($B$9,البيانات!$B$2:$B$320,0)),\"\")","v":1}]
[]
{"$rows_left_out":38}
{"sheet":"R102","index":4,"n_rows":45,"n_cols":12,"rows_kept":45,"cut":false,"hidden":false,"merged":[[44,0,44,9],[5,5,5,6],[6,5,6,6],[8,5,8,6],[9,5,9,6],[10,5,10,6]]}
[]
[]
[]
[]
[]
[null,null,null,null,null,"رقم الحافلة"]
[null,null,"حساب الرحلة ",null,null,{"$f":"IFERROR(INDEX(البيانات!$A$2:$A$320,MATCH($B$9,البيانات!$B$2:$B$320,0)),\"\")","v":1}]
[]
{"$rows_left_out":38}
{"sheet":"R103","index":5,"n_rows":45,"n_cols":12,"rows_kept":45,"cut":false,"hidden":false,"merged":[[44,0,44,9],[5,5,5,6],[6,5,6,6],[8,5,8,6],[9,5,9,6],[10,5,10,6]]}
[]
[]
[]
[]
[]
[null,null,null,null,null,"رقم الحافلة"]
[null,null,"حساب الرحلة ",null,null,{"$f":"IFERROR(INDEX(البيانات!$A$2:$A$320,MATCH($B$9,البيانات!$B$2:$B$320,0)),\"\")","v":2}]
[]
{"$rows_left_out":38}
{"sheet":"R104","index":6,"n_rows":45,"n_cols":12,"rows_kept":45,"cut":false,"hidden":false,"merged":[[44,0,44,9],[5,5,5,6],[6,5,6,6],[8,5,8,6],[9,5,9,6],[10,5,10,6]]}
[]
[]
[]
[]
[]
[null,null,null,null,null,"رقم الحافلة"]
[null,null,"حساب الرحلة ",null,null,{"$f":"IFERROR(INDEX(البيانات!$A$2:$A$320,MATCH($B$9,البيانات!$B$2:$B$320,0)),\"\")","v":5}]
[]
{"$rows_left_out":38}
{"sheet":"R105","index":7,"n_rows":45,"n_cols":12,"rows_kept":45,"cut":false,"hidden":false,"merged":[[44,0,44,9],[5,5,5,6],[6,5,6,6],[8,5,8,6],[9,5,9,6],[10,5,10,6]]}
[]
[]
[]
[]
[]
[null,null,null,null,null,"رقم الحافلة"]
[null,null,"حساب الرحلة ",null,null,{"$f":"IFERROR(INDEX(البيانات!$A$2:$A$320,MATCH($B$9,البيانات!$B$2:$B$320,0)),\"\")","v":0}]
[]
{"$rows_left_out":38}
{"sheet":"R106","index":8,"n_rows":45,"n_cols":12,"rows_kept":45,"cut":false,"hidden":false,"merged":[[44,0,44,9],[5,5,5,6],[6,5,6,6],[8,5,8,6],[9,5,9,6],[10,5,10,6]]}
[]
[]
[]
[]
[]
[null,null,null,null,null,"رقم الحافلة"]
[null,null,"حساب الرحلة ",null,null,{"$f":"IFERROR(INDEX(البيانات!$A$2:$A$320,MATCH($B$9,البيانات!$B$2:$B$320,0)),\"\")","v":0}]
[]
{"$rows_left_out":38}
{"sheet":"R107","index":9,"n_rows":45,"n_cols":12,"rows_kept":45,"cut":false,"hidden":false,"merged":[[44,0,44,9],[5,5,5,6],[6,5,6,6],[8,5,8,6],[9,5,9,6],[10,5,10,6]]}
[]
[]
[]
[]
[]
[null,null,null,null,null,"رقم الحافلة"]
[null,null,"حساب الرحلة ",null,null,{"$f":"IFERROR(INDEX(البيانات!$A$2:$A$320,MATCH($B$9,البيانات!$B$2:$B$320,0)),\"\")","v":0}]
[]
{"$rows_left_out":38}
{"sheet":"R108","index":10,"n_rows":45,"n_cols":12,"rows_kept":45,"cut":false,"hidden":false,"merged":[[44,0,44,9],[5,5,5,6],[6,5,6,6],[8,5,8,6],[9,5,9,6],[10,5,10,6]]}
[]
[]
[]
[]
[]
[null,null,null,null,null,"رقم الحافلة"]
[null,null,"حساب الرحلة ",null,null,{"$f":"IFERROR(INDEX(البيانات!$A$2:$A$320,MATCH($B$9,البيانات!$B$2:$B$320,0)),\"\")","v":0}]
[]
{"$rows_left_out":38}
{"sheet":"R109","index":11,"n_rows":45,"n_cols":12,"rows_kept":45,"cut":false,"hidden":false,"merged":[[44,0,44,9],[5,5,5,6],[6,5,6,6],[8,5,8,6],[9,5,9,6],[10,5,10,6]]}
[]
[]
[]
[]
[]
[null,null,null,null,null,"رقم الحافلة"]
[null,null,"حساب الرحلة ",null,null,{"$f":"IFERROR(INDEX(البيانات!$A$2:$A$320,MATCH($B$9,البيانات!$B$2:$B$320,0)),\"\")","v":0}]
[]
{"$rows_left_out":38}
{"sheet":"R1010","index":12,"n_rows":45,"n_cols":12,"rows_kept":45,"cut":false,"hidden":false,"merged":[[44,0,44,9],[5,5,5,6],[6,5,6,6],[8,5,8,6],[9,5,9,6],[10,5,10,6]]}
[]
[]
[]
[]
[]
[null,null,null,null,null,"رقم الحافلة"]
[null,null,"حساب الرحلة ",null,null,{"$f":"IFERROR(INDEX(البيانات!$A$2:$A$320,MATCH($B$9,البيانات!$B$2:$B$320,0)),\"\")","v":0}]
[]
{"$rows_left_out":38}
{"sheet":"R1011","index":13,"n_rows":45,"n_cols":12,"rows_kept":45,"cut":false,"hidden":false,"merged":[[44,0,44,9],[5,5,5,6],[6,5,6,6],[8,5,8,6],[9,5,9,6],[10,5,10,6]]}
[]
[]
[]
[]
[]
[null,null,null,null,null,"رقم الحافلة"]
[null,null,"حساب الرحلة ",null,null,{"$f":"IFERROR(INDEX(البيانات!$A$2:$A$320,MATCH($B$9,البيانات!$B$2:$B$320,0)),\"\")","v":0}]
[]
{"$rows_left_out":38}
{"sheet":"R1012","index":14,"n_rows":45,"n_cols":12,"rows_kept":45,"cut":false,"hidden":false,"merged":[[44,0,44,9],[5,5,5,6],[6,5,6,6],[8,5,8,6],[9,5,9,6],[10,5,10,6]]}
[]
[]
[]
[]
[]
[null,null,null,null,null,"رقم الحافلة"]
[null,null,"حساب الرحلة ",null,null,{"$f":"IFERROR(INDEX(البيانات!$A$2:$A$320,MATCH($B$9,البيانات!$B$2:$B$320,0)),\"\")","v":0}]
[]
{"$rows_left_out":38}
{"sheet":"R113","index":15,"n_rows":45,"n_cols":12,"rows_kept":45,"cut":false,"hidden":false,"merged":[[44,0,44,9],[5,5,5,6],[6,5,6,6],[8,5,8,6],[9,5,9,6],[10,5,10,6]]}
[]
[]
[]
[]
[]
[null,null,null,null,null,"رقم الحافلة"]
[null,null,"حساب الرحلة ",null,null,{"$f":"IFERROR(INDEX(البيانات!$A$2:$A$320,MATCH($B$9,البيانات!$B$2:$B$320,0)),\"\")","v":0}]
[]
{"$rows_left_out":38}
{"sheet":"R114","index":16,"n_rows":45,"n_cols":12,"rows_kept":45,"cut":false,"hidden":false,"merged":[[44,0,44,9],[5,5,5,6],[6,5,6,6],[8,5,8,6],[9,5,9,6],[10,5,10,6]]}
[]
[]
[]
[]
[]
[null,null,null,null,null,"رقم الحافلة"]
[null,null,"حساب الرحلة ",null,null,{"$f":"IFERROR(INDEX(البيانات!$A$2:$A$320,MATCH($B$9,البيانات!$B$2:$B$320,0)),\"\")","v":0}]
[]
{"$rows_left_out":38}
{"sheet":"R115","index":17,"n_rows":45,"n_cols":12,"rows_kept":45,"cut":false,"hidden":false,"merged":[[44,0,44,9],[5,5,5,6],[6,5,6,6],[8,5,8,6],[9,5,9,6],[10,5,10,6]]}
[]
[]
[]
[]
[]
[null,null,null,null,null,"رقم الحافلة"]
[null,null,"حساب الرحلة ",null,null,{"$f":"IFERROR(INDEX(البيانات!$A$2:$A$320,MATCH($B$9,البيانات!$B$2:$B$320,0)),\"\")","v":0}]
[]
{"$rows_left_out":38}
{"sheet":"R116","index":18,"n_rows":45,"n_cols":12,"rows_kept":45,"cut":false,"hidden":false,"merged":[[44,0,44,9],[5,5,5,6],[6,5,6,6],[8,5,8,6],[9,5,9,6],[10,5,10,6]]}
[]
[]
[]
[]
[]
[null,null,null,null,null,"رقم الحافلة"]
[null,null,"حساب الرحلة ",null,null,{"$f":"IFERROR(INDEX(البيانات!$A$2:$A$320,MATCH($B$9,البيانات!$B$2:$B$320,0)),\"\")","v":0}]
[]
{"$rows_left_out":38}
{"sheet":"R117","index":19,"n_rows":45,"n_cols":12,"rows_kept":45,"cut":false,"hidden":false,"merged":[[44,0,44,9],[5,5,5,6],[6,5,6,6],[8,5,8,6],[9,5,9,6],[10,5,10,6]]}
[]
[]
[]
[]
[]
[null,null,null,null,null,"رقم الحافلة"]
[null,null,"حساب الرحلة ",null,null,{"$f":"IFERROR(INDEX(البيانات!$A$2:$A$320,MATCH($B$9,البيانات!$B$2:$B$320,0)),\"\")","v":0}]
[]
{"$rows_left_out":38}
{"sheet":"R118","index":20,"n_rows":45,"n_cols":12,"rows_kept":45,"cut":false,"hidden":false,"merged":[[44,0,44,9],[5,5,5,6],[6,5,6,6],[8,5,8,6],[9,5,9,6],[10,5,10,6]]}
[]
[]
[]
[]
[]
[null,null,null,null,null,"رقم الحافلة"]
[null,null,"حساب الرحلة ",null,null,{"$f":"IFERROR(INDEX(البيانات!$A$2:$A$320,MATCH($B$9,البيانات!$B$2:$B$320,0)),\"\")","v":0}]
[]
{"$rows_left_out":38}
{"sheet":"R119","index":21,"n_rows":45,"n_cols":12,"rows_kept":45,"cut":false,"hidden":false,"merged":[[44,0,44,9],[5,5,5,6],[6,5,6,6],[8,5,8,6],[9,5,9,6],[10,5,10,6]]}
[]
[]
[]
[]
[]
[null,null,null,null,null,"رقم الحافلة"]
[null,null,"حساب الرحلة ",null,null,{"$f":"IFERROR(INDEX(البيانات!$A$2:$A$320,MATCH($B$9,البيانات!$B$2:$B$320,0)),\"\")","v":0}]
[]
{"$rows_left_out":38}
{"sheet":"R120","index":22,"n_rows":45,"n_cols":12,"rows_kept":45,"cut":false,"hidden":false,"merged":[[44,0,44,9],[5,5,5,6],[6,5,6,6],[8,5,8,6],[9,5,9,6],[10,5,10,6]]}
[]
[]
[]
[]
[]
[null,null,null,null,null,"رقم الحافلة"]
[null,null,"حساب الرحلة ",null,null,{"$f":"IFERROR(INDEX(البيانات!$A$2:$A$320,MATCH($B$9,البيانات!$B$2:$B$320,0)),\"\")","v":0}]
[]
{"$rows_left_out":38}
{"sheet":"R121","index":23,"n_rows":45,"n_cols":12,"rows_kept":45,"cut":false,"hidden":false,"merged":[[44,0,44,9],[5,5,5,6],[6,5,6,6],[8,5,8,6],[9,5,9,6],[10,5,10,6]]}
[]
[]
[]
[]
[]
[null,null,null,null,null,"رقم الحافلة"]
[null,null,"حساب الرحلة ",null,null,{"$f":"IFERROR(INDEX(البيانات!$A$2:$A$320,MATCH($B$9,البيانات!$B$2:$B$320,0)),\"\")","v":0}]
[]
{"$rows_left_out":38}
{"sheet":"R122","index":24,"n_rows":45,"n_cols":12,"rows_kept":45,"cut":false,"hidden":false,"merged":[[44,0,44,9],[5,5,5,6],[6,5,6,6],[8,5,8,6],[9,5,9,6],[10,5,10,6]]}
[]
[]
[]
[]
[]
[null,null,null,null,null,"رقم الحافلة"]
[null,null,"حساب الرحلة ",null,null,{"$f":"IFERROR(INDEX(البيانات!$A$2:$A$320,MATCH($B$9,البيانات!$B$2:$B$320,0)),\"\")","v":0}]
[]
{"$rows_left_out":38}
{"sheet":"R123","index":25,"n_rows":45,"n_cols":12,"rows_kept":45,"cut":false,"hidden":false,"merged":[[44,0,44,9],[5,5,5,6],[6,5,6,6],[8,5,8,6],[9,5,9,6],[10,5,10,6]]}
[]
[]
[]
[]
[]
[null,null,null,null,null,"رقم الحافلة"]
[null,null,"حساب الرحلة ",null,null,{"$f":"IFERROR(INDEX(البيانات!$A$2:$A$320,MATCH($B$9,البيانات!$B$2:$B$320,0)),\"\")","v":0}]
[]
{"$rows_left_out":38}
{"sheet":"R124","index":26,"n_rows":45,"n_cols":12,"rows_kept":45,"cut":false,"hidden":false,"merged":[[44,0,44,9],[5,5,5,6],[6,5,6,6],[8,5,8,6],[9,5,9,6],[10,5,10,6]]}
[]
[]
[]
[]
[]
[null,null,null,null,null,"رقم الحافلة"]
[null,null,"حساب الرحلة ",null,null,{"$f":"IFERROR(INDEX(البيانات!$A$2:$A$320,MATCH($B$9,البيانات!$B$2:$B$320,0)),\"\")","v":0}]
[]
{"$rows_left_out":38}
{"sheet":"R125","index":27,"n_rows":45,"n_cols":12,"rows_kept":45,"cut":false,"hidden":false,"merged":[[44,0,44,9],[5,5,5,6],[6,5,6,6],[8,5,8,6],[9,5,9,6],[10,5,10,6]]}
[]
[]
[]
[]
[]
[null,null,null,null,null,"رقم الحافلة"]
[null,null,"حساب الرحلة ",null,null,{"$f":"IFERROR(INDEX(البيانات!$A$2:$A$320,MATCH($B$9,البيانات!$B$2:$B$320,0)),\"\")","v":0}]
[]
{"$rows_left_out":38}
{"sheet":"R126","index":28,"n_rows":45,"n_cols":12,"rows_kept":45,"cut":false,"hidden":false,"merged":[[44,0,44,9],[5,5,5,6],[6,5,6,6],[8,5,8,6],[9,5,9,6],[10,5,10,6]]}
[]
[]
[]
[]
[]
[null,null,null,null,null,"رقم الحافلة"]
[null,null,"حساب الرحلة ",null,null,{"$f":"IFERROR(INDEX(البيانات!$A$2:$A$320,MATCH($B$9,البيانات!$B$2:$B$320,0)),\"\")","v":0}]
[]
{"$rows_left_out":38}
{"sheet":"R127","index":29,"n_rows":45,"n_cols":12,"rows_kept":45,"cut":false,"hidden":false,"merged":[[44,0,44,9],[5,5,5,6],[6,5,6,6],[8,5,8,6],[9,5,9,6],[10,5,10,6]]}
[]
[]
[]
[]
[]
[null,null,null,null,null,"رقم الحافلة"]
[null,null,"حساب الرحلة ",null,null,{"$f":"IFERROR(INDEX(البيانات!$A$2:$A$320,MATCH($B$9,البيانات!$B$2:$B$320,0)),\"\")","v":0}]
[]
{"$rows_left_out":38}
{"sheet":"R128","index":30,"n_rows":45,"n_cols":12,"rows_kept":45,"cut":false,"hidden":false,"merged":[[44,0,44,9],[5,5,5,6],[6,5,6,6],[8,5,8,6],[9,5,9,6],[10,5,10,6]]}
[]
[]
[]
[]
[]
[null,null,null,null,null,"رقم الحافلة"]
[null,null,"حساب الرحلة ",null,null,{"$f":"IFERROR(INDEX(البيانات!$A$2:$A$320,MATCH($B$9,البيانات!$B$2:$B$320,0)),\"\")","v":0}]
[]
{"$rows_left_out":38}
{"sheet":"R129","index":31,"n_rows":45,"n_cols":12,"rows_kept":45,"cut":false,"hidden":false,"merged":[[44,0,44,9],[5,5,5,6],[6,5,6,6],[8,5,8,6],[9,5,9,6],[10,5,10,6]]}
[]
[]
[]
[]
[]
[null,null,null,null,null,"رقم الحافلة"]
[null,null,"حساب الرحلة ",null,null,{"$f":"IFERROR(INDEX(البيانات!$A$2:$A$320,MATCH($B$9,البيانات!$B$2:$B$320,0)),\"\")","v":0}]
[]
{"$rows_left_out":38}
{"sheet":"R130","index":32,"n_rows":45,"n_cols":12,"rows_kept":45,"cut":false,"hidden":false,"merged":[[44,0,44,9],[5,5,5,6],[6,5,6,6],[8,5,8,6],[9,5,9,6],[10,5,10,6]]}
[]
[]
[]
[]
[]
[null,null,null,null,null,"رقم الحافلة"]
[null,null,"حساب الرحلة ",null,null,{"$f":"IFERROR(INDEX(البيانات!$A$2:$A$320,MATCH($B$9,البيانات!$B$2:$B$320,0)),\"\")","v":0}]
[]
{"$rows_left_out":38}
{"sheet":"R131","index":33,"n_rows":45,"n_cols":12,"rows_kept":45,"cut":false,"hidden":false,"merged":[[44,0,44,9],[5,5,5,6],[6,5,6,6],[8,5,8,6],[9,5,9,6],[10,5,10,6]]}
[]
[]
[]
[]
[]
[null,null,null,null,null,"رقم الحافلة"]
[null,null,"حساب الرحلة ",null,null,{"$f":"IFERROR(INDEX(البيانات!$A$2:$A$320,MATCH($B$9,البيانات!$B$2:$B$320,0)),\"\")","v":0}]
[]
{"$rows_left_out":38}
{"sheet":"R132","index":34,"n_rows":45,"n_cols":12,"rows_kept":45,"cut":false,"hidden":false,"merged":[[44,0,44,9],[5,5,5,6],[6,5,6,6],[8,5,8,6],[9,5,9,6],[10,5,10,6]]}
[]
[]
[]
[]
[]
[null,null,null,null,null,"رقم الحافلة"]
[null,null,"حساب الرحلة ",null,null,{"$f":"IFERROR(INDEX(البيانات!$A$2:$A$320,MATCH($B$9,البيانات!$B$2:$B$320,0)),\"\")","v":0}]
[]
{"$rows_left_out":38}
{"sheet":"R133","index":35,"n_rows":45,"n_cols":12,"rows_kept":45,"cut":false,"hidden":false,"merged":[[44,0,44,9],[5,5,5,6],[6,5,6,6],[8,5,8,6],[9,5,9,6],[10,5,10,6]]}
[]
[]
[]
[]
[]
[null,null,null,null,null,"رقم الحافلة"]
[null,null,"حساب الرحلة ",null,null,{"$f":"IFERROR(INDEX(البيانات!$A$2:$A$320,MATCH($B$9,البيانات!$B$2:$B$320,0)),\"\")","v":0}]
[]
{"$rows_left_out":38}
{"sheet":"R134","index":36,"n_rows":45,"n_cols":12,"rows_kept":45,"cut":false,"hidden":false,"merged":[[44,0,44,9],[5,5,5,6],[6,5,6,6],[8,5,8,6],[9,5,9,6],[10,5,10,6]]}
[]
[]
[]
[]
[]
[null,null,null,null,null,"رقم الحافلة"]
[null,null,"حساب الرحلة ",null,null,{"$f":"IFERROR(INDEX(البيانات!$A$2:$A$320,MATCH($B$9,البيانات!$B$2:$B$320,0)),\"\")","v":0}]
[]
{"$rows_left_out":38}
{"sheet":"R135","index":37,"n_rows":45,"n_cols":12,"rows_kept":45,"cut":false,"hidden":false,"merged":[[44,0,44,9],[5,5,5,6],[6,5,6,6],[8,5,8,6],[9,5,9,6],[10,5,10,6]]}
[]
[]
[]
[]
[]
[null,null,null,null,null,"رقم الحافلة"]
[null,null,"حساب الرحلة ",null,null,{"$f":"IFERROR(INDEX(البيانات!$A$2:$A$320,MATCH($B$9,البيانات!$B$2:$B$320,0)),\"\")","v":0}]
[]
{"$rows_left_out":38}
{"sheet":"R136","index":38,"n_rows":45,"n_cols":12,"rows_kept":45,"cut":false,"hidden":false,"merged":[[44,0,44,9],[5,5,5,6],[6,5,6,6],[8,5,8,6],[9,5,9,6],[10,5,10,6]]}
[]
[]
[]
[]
[]
[null,null,null,null,null,"رقم الحافلة"]
[null,null,"حساب الرحلة ",null,null,{"$f":"IFERROR(INDEX(البيانات!$A$2:$A$320,MATCH($B$9,البيانات!$B$2:$B$320,0)),\"\")","v":0}]
[]
{"$rows_left_out":38}
{"sheet":"R137","index":39,"n_rows":45,"n_cols":12,"rows_kept":45,"cut":false,"hidden":false,"merged":[[44,0,44,9],[5,5,5,6],[6,5,6,6],[8,5,8,6],[9,5,9,6],[10,5,10,6]]}
[]
[]
[]
[]
[]
[null,null,null,null,null,"رقم الحافلة"]
[null,null,"حساب الرحلة ",null,null,{"$f":"IFERROR(INDEX(البيانات!$A$2:$A$320,MATCH($B$9,البيانات!$B$2:$B$320,0)),\"\")","v":0}]
[]
{"$rows_left_out":38}
{"sheet":"R138","index":40,"n_rows":45,"n_cols":12,"rows_kept":45,"cut":false,"hidden":false,"merged":[[44,0,44,9],[5,5,5,6],[6,5,6,6],[8,5,8,6],[9,5,9,6],[10,5,10,6]]}
[]
[]
[]
[]
[]
[null,null,null,null,null,"رقم الحافلة"]
[null,null,"حساب الرحلة ",null,null,{"$f":"IFERROR(INDEX(البيانات!$A$2:$A$320,MATCH($B$9,البيانات!$B$2:$B$320,0)),\"\")","v":0}]
[]
{"$rows_left_out":38}
{"sheet":"R139","index":41,"n_rows":45,"n_cols":12,"rows_kept":45,"cut":false,"hidden":false,"merged":[[44,0,44,9],[5,5,5,6],[6,5,6,6],[8,5,8,6],[9,5,9,6],[10,5,10,6]]}
[]
[]
[]
[]
[]
[null,null,null,null,null,"رقم الحافلة"]
[null,null,"حساب الرحلة ",null,null,{"$f":"IFERROR(INDEX(البيانات!$A$2:$A$320,MATCH($B$9,البيانات!$B$2:$B$320,0)),\"\")","v":0}]
[]
{"$rows_left_out":38}
{"sheet":"R140","index":42,"n_rows":45,"n_cols":12,"rows_kept":45,"cut":false,"hidden":false,"merged":[[44,0,44,9],[5,5,5,6],[6,5,6,6],[8,5,8,6],[9,5,9,6],[10,5,10,6]]}
[]
[]
[]
[]
[]
[null,null,null,null,null,"رقم الحافلة"]
[null,null,"حساب الرحلة ",null,null,{"$f":"IFERROR(INDEX(البيانات!$A$2:$A$320,MATCH($B$9,البيانات!$B$2:$B$320,0)),\"\")","v":0}]
[]
{"$rows_left_out":38}
{"sheet":"R141","index":43,"n_rows":45,"n_cols":12,"rows_kept":45,"cut":false,"hidden":false,"merged":[[44,0,44,9],[5,5,5,6],[6,5,6,6],[8,5,8,6],[9,5,9,6],[10,5,10,6]]}
[]
[]
[]
[]
[]
[null,null,null,null,null,"رقم الحافلة"]
[null,null,"حساب الرحلة ",null,null,{"$f":"IFERROR(INDEX(البيانات!$A$2:$A$320,MATCH($B$9,البيانات!$B$2:$B$320,0)),\"\")","v":0}]
[]
{"$rows_left_out":38}
{"sheet":"R142","index":44,"n_rows":45,"n_cols":12,"rows_kept":45,"cut":false,"hidden":false,"merged":[[44,0,44,9],[5,5,5,6],[6,5,6,6],[8,5,8,6],[9,5,9,6],[10,5,10,6]]}
[]
[]
[]
[]
[]
[null,null,null,null,null,"رقم الحافلة"]
[null,null,"حساب الرحلة ",null,null,{"$f":"IFERROR(INDEX(البيانات!$A$2:$A$320,MATCH($B$9,البيانات!$B$2:$B$320,0)),\"\")","v":0}]
[]
{"$rows_left_out":38}
{"sheet":"R143","index":45,"n_rows":45,"n_cols":12,"rows_kept":45,"cut":false,"hidden":false,"merged":[[44,0,44,9],[5,5,5,6],[6,5,6,6],[8,5,8,6],[9,5,9,6],[10,5,10,6]]}
[]
[]
[]
[]
[]
[null,null,null,null,null,"رقم الحافلة"]
[null,null,"حساب الرحلة ",null,null,{"$f":"IFERROR(INDEX(البيانات!$A$2:$A$320,MATCH($B$9,البيانات!$B$2:$B$320,0)),\"\")","v":0}]
[]
{"$rows_left_out":38}
{"sheet":"R144","index":46,"n_rows":45,"n_cols":12,"rows_kept":45,"cut":false,"hidden":false,"merged":[[44,0,44,9],[5,5,5,6],[6,5,6,6],[8,5,8,6],[9,5,9,6],[10,5,10,6]]}
[]
[]
[]
[]
[]
[null,null,null,null,null,"رقم الحافلة"]
[null,null,"حساب الرحلة ",null,null,{"$f":"IFERROR(INDEX(البيانات!$A$2:$A$320,MATCH($B$9,البيانات!$B$2:$B$320,0)),\"\")","v":0}]
[]
{"$rows_left_out":38}
{"sheet":"R145","index":47,"n_rows":45,"n_cols":12,"rows_kept":45,"cut":false,"hidden":false,"merged":[[44,0,44,9],[5,5,5,6],[6,5,6,6],[8,5,8,6],[9,5,9,6],[10,5,10,6]]}
[]
[]
[]
[]
[]
[null,null,null,null,null,"رقم الحافلة"]
[null,null,"حساب الرحلة ",null,null,{"$f":"IFERROR(INDEX(البيانات!$A$2:$A$320,MATCH($B$9,البيانات!$B$2:$B$320,0)),\"\")","v":0}]
[]
{"$rows_left_out":38}
{"sheet":"R146","index":48,"n_rows":45,"n_cols":12,"rows_kept":45,"cut":false,"hidden":false,"merged":[[44,0,44,9],[5,5,5,6],[6,5,6,6],[8,5,8,6],[9,5,9,6],[10,5,10,6]]}
[]
[]
[]
[]
[]
[null,null,null,null,null,"رقم الحافلة"]
[null,null,"حساب الرحلة ",null,null,{"$f":"IFERROR(INDEX(البيانات!$A$2:$A$320,MATCH($B$9,البيانات!$B$2:$B$320,0)),\"\")","v":0}]
[]
{"$rows_left_out":38}
{"sheet":"R147","index":49,"n_rows":45,"n_cols":12,"rows_kept":45,"cut":false,"hidden":false,"merged":[[44,0,44,9],[5,5,5,6],[6,5,6,6],[8,5,8,6],[9,5,9,6],[10,5,10,6]]}
[]
[]
[]
[]
[]
[null,null,null,null,null,"رقم الحافلة"]
[null,null,"حساب الرحلة ",null,null,{"$f":"IFERROR(INDEX(البيانات!$A$2:$A$320,MATCH($B$9,البيانات!$B$2:$B$320,0)),\"\")","v":0}]
[]
{"$rows_left_out":38}
{"sheet":"R148","index":50,"n_rows":45,"n_cols":12,"rows_kept":45,"cut":false,"hidden":false,"merged":[[44,0,44,9],[5,5,5,6],[6,5,6,6],[8,5,8,6],[9,5,9,6],[10,5,10,6]]}
[]
[]
[]
[]
[]
[null,null,null,null,null,"رقم الحافلة"]
[null,null,"حساب الرحلة ",null,null,{"$f":"IFERROR(INDEX(البيانات!$A$2:$A$320,MATCH($B$9,البيانات!$B$2:$B$320,0)),\"\")","v":0}]
[]
{"$rows_left_out":38}
{"sheet":"R149","index":51,"n_rows":45,"n_cols":12,"rows_kept":45,"cut":false,"hidden":false,"merged":[[44,0,44,9],[5,5,5,6],[6,5,6,6],[8,5,8,6],[9,5,9,6],[10,5,10,6]]}
[]
[]
[]
[]
[]
[null,null,null,null,null,"رقم الحافلة"]
[null,null,"حساب الرحلة ",null,null,{"$f":"IFERROR(INDEX(البيانات!$A$2:$A$320,MATCH($B$9,البيانات!$B$2:$B$320,0)),\"\")","v":0}]
[]
{"$rows_left_out":38}
{"sheet":"R150","index":52,"n_rows":45,"n_cols":12,"rows_kept":45,"cut":false,"hidden":false,"merged":[[44,0,44,9],[5,5,5,6],[6,5,6,6],[8,5,8,6],[9,5,9,6],[10,5,10,6]]}
[]
[]
[]
[]
[]
[null,null,null,null,null,"رقم الحافلة"]
[null,null,"حساب الرحلة ",null,null,{"$f":"IFERROR(INDEX(البيانات!$A$2:$A$320,MATCH($B$9,البيانات!$B$2:$B$320,0)),\"\")","v":0}]
[]
{"$rows_left_out":37}