{"text_format":"1","workbook":"xlsx","n_sheets":6,"sheets":["fatoura","كشف حساب","الاصناف","المبيعات","استعلام","اسماء الزبائن"],"not_rendered":{"charts":0,"images":0,"macros":1,"external_links":0,"defined_names":9,"comments":0,"pivot_tables":0},"unopened":[],"bounds":{"document_bytes":16777216,"sheet_cells":100000,"rows_first":2000,"rows_last":500,"rows_between":2000,"halvings":0,"cell_chars":16384,"cell_head_chars":4096},"cells_cut":0,"cells_raw":0,"read":"whole","date_system":"1900"}

{"sheet":"fatoura","index":0,"n_rows":543,"n_cols":10,"rows_kept":543,"cut":false,"hidden":false,"merged":[]}
[null,null,"f7:f20","b7:b20"]
[null,null,null,"الرقم",58,null,null,"دفعة","رقم الشيك","تاريخ الدفعة"]
[null,null,null,"التاريخ",null,{"$f":"SUM(F7:F500)","v":0},{"$f":"SUM(F7:F500)/2","v":0}]
[" السيد:"]
[]
["رقم","الوصف","عدد","الوحدة","السعر","مجموع سعر الوحدة"]
[null,"`",null,{"$f":"IF(A7<>0,VLOOKUP(fatoura!A7,v,4,FALSE),\"\")","v":""},"الرصيد:",0]
[null,"`",null,{"$f":"IF(A8<>0,VLOOKUP(fatoura!A8,v,4,FALSE),\"\")","v":""},null,{"$f":"IF(A8<>0,SUM(E8*C8),\"\")","v":""}]
[null,"`",null,{"$f":"IF(A9<>0,VLOOKUP(fatoura!A9,v,4,FALSE),\"\")","v":""},null,{"$f":"IF(A9<>0,SUM(E9*C9),\"\")","v":""}]
[null,{"$f":"IF(A10<>0,VLOOKUP(fatoura!A10,v,2,FALSE),\"\")","v":""},null,{"$f":"IF(A10<>0,VLOOKUP(fatoura!A10,v,4,FALSE),\"\")","v":""},null,{"$f":"IF(A10<>0,SUM(E10*C10),\"\")","v":""}]
[null,{"$f":"IF(A11<>0,VLOOKUP(fatoura!A11,v,2,FALSE),\"\")","v":""},null,{"$f":"IF(A11<>0,VLOOKUP(fatoura!A11,v,4,FALSE),\"\")","v":""},null,""]
[null,{"$f":"IF(A12<>0,VLOOKUP(fatoura!A12,v,2,FALSE),\"\")","v":""},null,{"$f":"IF(A12<>0,VLOOKUP(fatoura!A12,v,4,FALSE),\"\")","v":""},null,""]
[null,{"$f":"IF(A13<>0,VLOOKUP(fatoura!A13,v,2,FALSE),\"\")","v":""},null,{"$f":"IF(A13<>0,VLOOKUP(fatoura!A13,v,4,FALSE),\"\")","v":""},null,""]
[null,{"$f":"IF(A14<>0,VLOOKUP(fatoura!A14,v,2,FALSE),\"\")","v":""},null,{"$f":"IF(A14<>0,VLOOKUP(fatoura!A14,v,4,FALSE),\"\")","v":""},null,""]
[null,{"$f":"IF(A15<>0,VLOOKUP(fatoura!A15,v,2,FALSE),\"\")","v":""},null,{"$f":"IF(A15<>0,VLOOKUP(fatoura!A15,v,4,FALSE),\"\")","v":""},null,""]
[null,{"$f":"IF(A16<>0,VLOOKUP(fatoura!A16,v,2,FALSE),\"\")","v":""},null,{"$f":"IF(A16<>0,VLOOKUP(fatoura!A16,v,4,FALSE),\"\")","v":""},null,""]
[null,{"$f":"IF(A17<>0,VLOOKUP(fatoura!A17,v,2,FALSE),\"\")","v":""},null,{"$f":"IF(A17<>0,VLOOKUP(fatoura!A17,v,4,FALSE),\"\")","v":""},null,""]
[null,{"$f":"IF(A18<>0,VLOOKUP(fatoura!A18,v,2,FALSE),\"\")","v":""},null,{"$f":"IF(A18<>0,VLOOKUP(fatoura!A18,v,4,FALSE),\"\")","v":""},null,""]
[null,{"$f":"IF(A19<>0,VLOOKUP(fatoura!A19,v,2,FALSE),\"\")","v":""},null,{"$f":"IF(A19<>0,VLOOKUP(fatoura!A19,v,4,FALSE),\"\")","v":""},null,""]
[null,{"$f":"IF(A20<>0,VLOOKUP(fatoura!A20,v,2,FALSE),\"\")","v":""},null,{"$f":"IF(A20<>0,VLOOKUP(fatoura!A20,v,4,FALSE),\"\")","v":""},null,""]
[null,{"$f":"IF(A21<>0,VLOOKUP(fatoura!A21,v,2,FALSE),\"\")","v":""},null,{"$f":"IF(A21<>0,VLOOKUP(fatoura!A21,v,4,FALSE),\"\")","v":""},null,""]
[null,{"$f":"IF(A22<>0,VLOOKUP(fatoura!A22,v,2,FALSE),\"\")","v":""},null,{"$f":"IF(A22<>0,VLOOKUP(fatoura!A22,v,4,FALSE),\"\")","v":""},null,""]
[null,{"$f":"IF(A23<>0,VLOOKUP(fatoura!A23,v,2,FALSE),\"\")","v":""},null,{"$f":"IF(A23<>0,VLOOKUP(fatoura!A23,v,4,FALSE),\"\")","v":""},null,""]
[null,{"$f":"IF(A24<>0,VLOOKUP(fatoura!A24,v,2,FALSE),\"\")","v":""},null,{"$f":"IF(A24<>0,VLOOKUP(fatoura!A24,v,4,FALSE),\"\")","v":""},null,""]
[null,{"$f":"IF(A25<>0,VLOOKUP(fatoura!A25,v,2,FALSE),\"\")","v":""},null,{"$f":"IF(A25<>0,VLOOKUP(fatoura!A25,v,4,FALSE),\"\")","v":""},null,""]
[null,{"$f":"IF(A26<>0,VLOOKUP(fatoura!A26,v,2,FALSE),\"\")","v":""},null,{"$f":"IF(A26<>0,VLOOKUP(fatoura!A26,v,4,FALSE),\"\")","v":""},null,""]
[null,{"$f":"IF(A27<>0,VLOOKUP(fatoura!A27,v,2,FALSE),\"\")","v":""},null,{"$f":"IF(A27<>0,VLOOKUP(fatoura!A27,v,4,FALSE),\"\")","v":""},null,""]
[null,{"$f":"IF(A28<>0,VLOOKUP(fatoura!A28,v,2,FALSE),\"\")","v":""},null,{"$f":"IF(A28<>0,VLOOKUP(fatoura!A28,v,4,FALSE),\"\")","v":""},null,""]
[null,{"$f":"IF(A29<>0,VLOOKUP(fatoura!A29,v,2,FALSE),\"\")","v":""},null,{"$f":"IF(A29<>0,VLOOKUP(fatoura!A29,v,4,FALSE),\"\")","v":""},null,""]
[null,{"$f":"IF(A30<>0,VLOOKUP(fatoura!A30,v,2,FALSE),\"\")","v":""},null,{"$f":"IF(A30<>0,VLOOKUP(fatoura!A30,v,4,FALSE),\"\")","v":""},null,""]
[null,{"$f":"IF(A31<>0,VLOOKUP(fatoura!A31,v,2,FALSE),\"\")","v":""},null,{"$f":"IF(A31<>0,VLOOKUP(fatoura!A31,v,4,FALSE),\"\")","v":""},null,""]
[null,{"$f":"IF(A32<>0,VLOOKUP(fatoura!A32,v,2,FALSE),\"\")","v":""},null,{"$f":"IF(A32<>0,VLOOKUP(fatoura!A32,v,4,FALSE),\"\")","v":""},null,""]
[null,{"$f":"IF(A33<>0,VLOOKUP(fatoura!A33,v,2,FALSE),\"\")","v":""},null,{"$f":"IF(A33<>0,VLOOKUP(fatoura!A33,v,4,FALSE),\"\")","v":""},null,""]
[null,{"$f":"IF(A34<>0,VLOOKUP(fatoura!A34,v,2,FALSE),\"\")","v":""},null,{"$f":"IF(A34<>0,VLOOKUP(fatoura!A34,v,4,FALSE),\"\")","v":""},null,""]
[null,{"$f":"IF(A35<>0,VLOOKUP(fatoura!A35,v,2,FALSE),\"\")","v":""},null,{"$f":"IF(A35<>0,VLOOKUP(fatoura!A35,v,4,FALSE),\"\")","v":""},null,""]
[null,{"$f":"IF(A36<>0,VLOOKUP(fatoura!A36,v,2,FALSE),\"\")","v":""},null,{"$f":"IF(A36<>0,VLOOKUP(fatoura!A36,v,4,FALSE),\"\")","v":""},null,""]
[null,{"$f":"IF(A37<>0,VLOOKUP(fatoura!A37,v,2,FALSE),\"\")","v":""},null,{"$f":"IF(A37<>0,VLOOKUP(fatoura!A37,v,4,FALSE),\"\")","v":""},null,""]
[null,{"$f":"IF(A38<>0,VLOOKUP(fatoura!A38,v,2,FALSE),\"\")","v":""},null,{"$f":"IF(A38<>0,VLOOKUP(fatoura!A38,v,4,FALSE),\"\")","v":""},null,""]
[null,{"$f":"IF(A39<>0,VLOOKUP(fatoura!A39,v,2,FALSE),\"\")","v":""},null,{"$f":"IF(A39<>0,VLOOKUP(fatoura!A39,v,4,FALSE),\"\")","v":""},null,""]
[null,{"$f":"IF(A40<>0,VLOOKUP(fatoura!A40,v,2,FALSE),\"\")","v":""},null,{"$f":"IF(A40<>0,VLOOKUP(fatoura!A40,v,4,FALSE),\"\")","v":""},null,""]
[null,{"$f":"IF(A41<>0,VLOOKUP(fatoura!A41,v,2,FALSE),\"\")","v":""},null,{"$f":"IF(A41<>0,VLOOKUP(fatoura!A41,v,4,FALSE),\"\")","v":""},null,""]
[null,{"$f":"IF(A42<>0,VLOOKUP(fatoura!A42,v,2,FALSE),\"\")","v":""},null,{"$f":"IF(A42<>0,VLOOKUP(fatoura!A42,v,4,FALSE),\"\")","v":""},null,""]
[null,{"$f":"IF(A43<>0,VLOOKUP(fatoura!A43,v,2,FALSE),\"\")","v":""},null,{"$f":"IF(A43<>0,VLOOKUP(fatoura!A43,v,4,FALSE),\"\")","v":""},null,""]
[null,{"$f":"IF(A44<>0,VLOOKUP(fatoura!A44,v,2,FALSE),\"\")","v":""},null,{"$f":"IF(A44<>0,VLOOKUP(fatoura!A44,v,4,FALSE),\"\")","v":""},null,""]
[null,{"$f":"IF(A45<>0,VLOOKUP(fatoura!A45,v,2,FALSE),\"\")","v":""},null,{"$f":"IF(A45<>0,VLOOKUP(fatoura!A45,v,4,FALSE),\"\")","v":""},null,""]
[null,{"$f":"IF(A46<>0,VLOOKUP(fatoura!A46,v,2,FALSE),\"\")","v":""},null,{"$f":"IF(A46<>0,VLOOKUP(fatoura!A46,v,4,FALSE),\"\")","v":""},null,""]
[null,{"$f":"IF(A47<>0,VLOOKUP(fatoura!A47,v,2,FALSE),\"\")","v":""},null,{"$f":"IF(A47<>0,VLOOKUP(fatoura!A47,v,4,FALSE),\"\")","v":""},null,""]
[null,{"$f":"IF(A48<>0,VLOOKUP(fatoura!A48,v,2,FALSE),\"\")","v":""},null,{"$f":"IF(A48<>0,VLOOKUP(fatoura!A48,v,4,FALSE),\"\")","v":""},null,""]
[null,{"$f":"IF(A49<>0,VLOOKUP(fatoura!A49,v,2,FALSE),\"\")","v":""},null,{"$f":"IF(A49<>0,VLOOKUP(fatoura!A49,v,4,FALSE),\"\")","v":""},null,""]
[null,{"$f":"IF(A50<>0,VLOOKUP(fatoura!A50,v,2,FALSE),\"\")","v":""},null,{"$f":"IF(A50<>0,VLOOKUP(fatoura!A50,v,4,FALSE),\"\")","v":""},null,""]
[null,{"$f":"IF(A51<>0,VLOOKUP(fatoura!A51,v,2,FALSE),\"\")","v":""},null,{"$f":"IF(A51<>0,VLOOKUP(fatoura!A51,v,4,FALSE),\"\")","v":""},null,""]
[null,{"$f":"IF(A52<>0,VLOOKUP(fatoura!A52,v,2,FALSE),\"\")","v":""},null,{"$f":"IF(A52<>0,VLOOKUP(fatoura!A52,v,4,FALSE),\"\")","v":""},null,""]
[null,{"$f":"IF(A53<>0,VLOOKUP(fatoura!A53,v,2,FALSE),\"\")","v":""},null,{"$f":"IF(A53<>0,VLOOKUP(fatoura!A53,v,4,FALSE),\"\")","v":""},null,""]
[null,{"$f":"IF(A54<>0,VLOOKUP(fatoura!A54,v,2,FALSE),\"\")","v":""},null,{"$f":"IF(A54<>0,VLOOKUP(fatoura!A54,v,4,FALSE),\"\")","v":""},null,""]
[null,{"$f":"IF(A55<>0,VLOOKUP(fatoura!A55,v,2,FALSE),\"\")","v":""},null,{"$f":"IF(A55<>0,VLOOKUP(fatoura!A55,v,4,FALSE),\"\")","v":""},null,""]
[null,{"$f":"IF(A56<>0,VLOOKUP(fatoura!A56,v,2,FALSE),\"\")","v":""},null,{"$f":"IF(A56<>0,VLOOKUP(fatoura!A56,v,4,FALSE),\"\")","v":""},null,""]
[null,{"$f":"IF(A57<>0,VLOOKUP(fatoura!A57,v,2,FALSE),\"\")","v":""},null,{"$f":"IF(A57<>0,VLOOKUP(fatoura!A57,v,4,FALSE),\"\")","v":""},null,""]
[null,{"$f":"IF(A58<>0,VLOOKUP(fatoura!A58,v,2,FALSE),\"\")","v":""},null,{"$f":"IF(A58<>0,VLOOKUP(fatoura!A58,v,4,FALSE),\"\")","v":""},null,""]
[null,{"$f":"IF(A59<>0,VLOOKUP(fatoura!A59,v,2,FALSE),\"\")","v":""},null,{"$f":"IF(A59<>0,VLOOKUP(fatoura!A59,v,4,FALSE),\"\")","v":""},null,""]
[null,{"$f":"IF(A60<>0,VLOOKUP(fatoura!A60,v,2,FALSE),\"\")","v":""},null,{"$f":"IF(A60<>0,VLOOKUP(fatoura!A60,v,4,FALSE),\"\")","v":""},null,""]
[null,{"$f":"IF(A61<>0,VLOOKUP(fatoura!A61,v,2,FALSE),\"\")","v":""},null,{"$f":"IF(A61<>0,VLOOKUP(fatoura!A61,v,4,FALSE),\"\")","v":""},null,""]
[null,{"$f":"IF(A62<>0,VLOOKUP(fatoura!A62,v,2,FALSE),\"\")","v":""},null,{"$f":"IF(A62<>0,VLOOKUP(fatoura!A62,v,4,FALSE),\"\")","v":""},null,""]
[null,{"$f":"IF(A63<>0,VLOOKUP(fatoura!A63,v,2,FALSE),\"\")","v":""},null,{"$f":"IF(A63<>0,VLOOKUP(fatoura!A63,v,4,FALSE),\"\")","v":""},null,""]
[null,{"$f":"IF(A64<>0,VLOOKUP(fatoura!A64,v,2,FALSE),\"\")","v":""},null,{"$f":"IF(A64<>0,VLOOKUP(fatoura!A64,v,4,FALSE),\"\")","v":""},null,""]
[null,{"$f":"IF(A65<>0,VLOOKUP(fatoura!A65,v,2,FALSE),\"\")","v":""},null,{"$f":"IF(A65<>0,VLOOKUP(fatoura!A65,v,4,FALSE),\"\")","v":""},null,""]
[null,{"$f":"IF(A66<>0,VLOOKUP(fatoura!A66,v,2,FALSE),\"\")","v":""},null,{"$f":"IF(A66<>0,VLOOKUP(fatoura!A66,v,4,FALSE),\"\")","v":""},null,""]
[null,{"$f":"IF(A67<>0,VLOOKUP(fatoura!A67,v,2,FALSE),\"\")","v":""},null,{"$f":"IF(A67<>0,VLOOKUP(fatoura!A67,v,4,FALSE),\"\")","v":""},null,""]
[null,{"$f":"IF(A68<>0,VLOOKUP(fatoura!A68,v,2,FALSE),\"\")","v":""},null,{"$f":"IF(A68<>0,VLOOKUP(fatoura!A68,v,4,FALSE),\"\")","v":""},null,""]
[null,{"$f":"IF(A69<>0,VLOOKUP(fatoura!A69,v,2,FALSE),\"\")","v":""},null,{"$f":"IF(A69<>0,VLOOKUP(fatoura!A69,v,4,FALSE),\"\")","v":""},null,""]
[null,{"$f":"IF(A70<>0,VLOOKUP(fatoura!A70,v,2,FALSE),\"\")","v":""},null,{"$f":"IF(A70<>0,VLOOKUP(fatoura!A70,v,4,FALSE),\"\")","v":""},null,""]
[null,{"$f":"IF(A71<>0,VLOOKUP(fatoura!A71,v,2,FALSE),\"\")","v":""},null,{"$f":"IF(A71<>0,VLOOKUP(fatoura!A71,v,4,FALSE),\"\")","v":""},null,""]
[null,{"$f":"IF(A72<>0,VLOOKUP(fatoura!A72,v,2,FALSE),\"\")","v":""},null,{"$f":"IF(A72<>0,VLOOKUP(fatoura!A72,v,4,FALSE),\"\")","v":""},null,""]
[null,{"$f":"IF(A73<>0,VLOOKUP(fatoura!A73,v,2,FALSE),\"\")","v":""},null,{"$f":"IF(A73<>0,VLOOKUP(fatoura!A73,v,4,FALSE),\"\")","v":""},null,{"$f":"IF(A73<>0,SUM(E73*C73),\"\")","v":""}]
[null,{"$f":"IF(A74<>0,VLOOKUP(fatoura!A74,v,2,FALSE),\"\")","v":""},null,{"$f":"IF(A74<>0,VLOOKUP(fatoura!A74,v,4,FALSE),\"\")","v":""},null,""]
[null,{"$f":"IF(A75<>0,VLOOKUP(fatoura!A75,v,2,FALSE),\"\")","v":""},null,{"$f":"IF(A75<>0,VLOOKUP(fatoura!A75,v,4,FALSE),\"\")","v":""},null,""]
[null,{"$f":"IF(A76<>0,VLOOKUP(fatoura!A76,v,2,FALSE),\"\")","v":""},null,{"$f":"IF(A76<>0,VLOOKUP(fatoura!A76,v,4,FALSE),\"\")","v":""},null,""]
[null,{"$f":"IF(A77<>0,VLOOKUP(fatoura!A77,v,2,FALSE),\"\")","v":""},null,{"$f":"IF(A77<>0,VLOOKUP(fatoura!A77,v,4,FALSE),\"\")","v":""},null,""]
[null,{"$f":"IF(A78<>0,VLOOKUP(fatoura!A78,v,2,FALSE),\"\")","v":""},null,{"$f":"IF(A78<>0,VLOOKUP(fatoura!A78,v,4,FALSE),\"\")","v":""},null,""]
[null,{"$f":"IF(A79<>0,VLOOKUP(fatoura!A79,v,2,FALSE),\"\")","v":""},null,{"$f":"IF(A79<>0,VLOOKUP(fatoura!A79,v,4,FALSE),\"\")","v":""},null,""]
[null,{"$f":"IF(A80<>0,VLOOKUP(fatoura!A80,v,2,FALSE),\"\")","v":""},null,{"$f":"IF(A80<>0,VLOOKUP(fatoura!A80,v,4,FALSE),\"\")","v":""},null,""]
{"$rows_left_out":464}
{"sheet":"كشف حساب","index":1,"n_rows":2,"n_cols":20,"rows_kept":2,"cut":false,"hidden":false,"merged":[]}
["الاسم","فاتورة","قيمة الفاتورة","دفعة","رقم الوصل","رقم الشيك","التاريخ",null,null,null,null,null,null,null,null,null,"رامي",{"$f":"SUMIFS($C$2:$C$999999,$A$2:$A$999999,Q1)","v":12},{"$f":"SUMIFS($D$2:$D$999999,$A$2:$A$999999,Q1)","v":0},{"$f":"R1-S1","v":12}]
["رامي",null,12,null,57,null,"2018-05-10"]

{"sheet":"الاصناف","index":2,"n_rows":12,"n_cols":6,"rows_kept":12,"cut":false,"hidden":false,"merged":[]}
["كود الصنف","الوصف","عدد","الوحدة","سعر المبيع","الكلفة"]
[2,"فاتورة"]
[3,"دفعة"]
["b15","برغي دبوس اسود 1.5 سم",1535,1000,3.2,2.375]
["b18","برغي دبوس اسود 1.8 سم",1728,1000,3.36,2.488]
["b20","برغي دبوس اسود 2 سم",576,1000,3.51,2.6]
["b25","برغي دبوس اسود 2.5 سم",1152,1000,3.93,2.9119999999999999]
["b30","برغي دبوس اسود 30 سم",3072,1000,4.45,3.2869999999999999]
["b40","برغي دبوس اسود 40 سم",768,1000,5.75,4.2619999999999996]
["b50","برغي دبوس اسود 50 سم",2880,1000,7.02,5.2]
["b70","برغي دبوس اسود 7 سم",288,1000,11.56,8.5619999999999994]
["b100","برغي دبوس اسود 10 سم",89.6,1000,16.5,12.1]

{"sheet":"المبيعات","index":3,"n_rows":536,"n_cols":6,"rows_kept":536,"cut":false,"hidden":false,"merged":[]}
["رقم","الوصف","عدد","الوحدة","السعر","مجموع سعر الوحدة"]
["b20","برغي دبوس اسود 2 سم",2,1000,500,{"$f":"E2*C2","v":1000}]
["b20","برغي دبوس اسود 2 سم",2,1000,3,{"$f":"E3*C3","v":6}]
["b",{"$error":"#N/A"},null,{"$error":"#N/A"},null,0]
["b30","برغي دبوس اسود 30 سم",null,1000,null,0]
["b70","برغي دبوس اسود 7 سم",null,1000,null,0]
["g",{"$error":"#N/A"},null,{"$error":"#N/A"},null,0]
["b40","برغي دبوس اسود 40 سم",null,1000,null,0]
["b30","برغي دبوس اسود 30 سم",null,1000,null,0]
["b70","برغي دبوس اسود 7 سم",null,1000,null,""]
["b40","برغي دبوس اسود 40 سم",null,1000,null,""]
["yuyu","y",3,{"$error":"#N/A"},4,""]
[5,"y",4,{"$error":"#N/A"},8,""]
["b15","برغي دبوس اسود 1.5 سم",30,1000,4]
["b20","برغي دبوس اسود 2 سم",4,1000,6,""]
["b30","برغي دبوس اسود 30 سم",5,1000,7,""]
["b15","برغي دبوس اسود 1.5 سم",2,1000,3,""]
["b20","برغي دبوس اسود 2 سم",5,1000,8,""]
["b50","برغي دبوس اسود 50 سم",2,1000,7,""]
["b30","برغي دبوس اسود 30 سم",3,1000,8,""]
["b15","برغي دبوس اسود 1.5 سم",20,1000,2,""]
["b20","برغي دبوس اسود 2 سم",30,1000,3,""]
["b30","برغي دبوس اسود 30 سم",40,1000,4,""]
["b40","برغي دبوس اسود 40 سم",50,1000,5,""]
["b50","برغي دبوس اسود 50 سم",2,1000,3,""]
["b40","برغي دبوس اسود 40 سم",3,1000,5,""]
["b15","برغي دبوس اسود 1.5 سم",2,1000,3,""]
["b20","برغي دبوس اسود 2 سم",3,1000,4,""]
["b15","برغي دبوس اسود 1.5 سم",3,1000,4,""]
[null,null,null,null,null,""]
[null,null,null,null,null,""]
[null,null,null,null,null,""]
[null,null,null,null,null,""]
[null,null,null,null,null,""]
[null,null,null,null,null,""]
[null,null,null,null,null,""]
[null,null,null,null,null,""]
[null,null,null,null,null,""]
[null,null,null,null,null,""]
[null,null,null,null,null,""]
[null,null,null,null,null,""]
[null,null,null,null,null,""]
[null,null,null,null,null,""]
[null,null,null,null,null,""]
[null,null,null,null,null,""]
[null,null,null,null,null,""]
[null,null,null,null,null,""]
[null,null,null,null,null,""]
[null,null,null,null,null,""]
[null,null,null,null,null,""]
[null,"","","","",""]
[null,"","","","",""]
[null,"","","","",""]
[null,"","","","",""]
[null,"","","","",""]
[null,"","","","",""]
[null,"","","","",""]
[null,"","","","",""]
[null,"","","","",""]
[null,"","","","",""]
[null,"","","","",""]
[null,"","","","",""]
[null,"","","","",""]
[null,"","","","",""]
[null,"","","","",""]
[null,"","","","",""]
[null,"","","","",""]
[null,"","","","",""]
[null,"","","","",""]
[null,"","","","",""]
[null,"","","","",""]
[null,"","","","",""]
[null,"","","","",""]
[null,"","","","",""]
[null,"","","","",""]
[null,"","","","",""]
[null,"","","","",""]
[null,"","","","",""]
[null,"","","","",""]
[null,"","","","",""]
{"$rows_left_out":457}
{"sheet":"استعلام","index":4,"n_rows":2000,"n_cols":8,"rows_kept":2000,"cut":false,"hidden":false,"merged":[]}
["الاسم","فاتورة","قيمة الفاتورة","دفعة","رقم الوصل","رقم الشيك","التاريخ","التاريخ"]
["رامي",null,null,null,null,null,"2018-03-05"]
[]
[]
[]
[]
[]
["الاسم","فاتورة","قيمة الفاتورة","دفعة","رقم الوصل","رقم الشيك","التاريخ","الرصيد"]
["رامي",null,12,null,57,null,"2018-05-10",{"$f":"C9-D9","v":12}]
[null,null,null,null,null,null,null,{"$f":"IF(A9<>0,SUM(H9+C10-D10),\"\")","v":12}]
[null,null,null,null,null,null,null,{"$f":"IF(A10<>0,SUM(H10+C11-D11),\"\")","v":""}]
[null,null,null,null,null,null,null,""]
[null,null,null,null,null,null,null,""]
[null,null,null,null,null,null,null,""]
[null,null,null,null,null,null,null,""]
[null,null,null,null,null,null,null,""]
[null,null,null,null,null,null,null,""]
[null,null,null,null,null,null,null,""]
[null,null,null,null,null,null,null,""]
[null,null,null,null,null,null,null,""]
[null,null,null,null,null,null,null,""]
[null,null,null,null,null,null,null,""]
[null,null,null,null,null,null,null,""]
[null,null,null,null,null,null,null,""]
[null,null,null,null,null,null,null,""]
[null,null,null,null,null,null,null,""]
[null,null,null,null,null,null,null,""]
[null,null,null,null,null,null,null,""]
[null,null,null,null,null,null,null,""]
[null,null,null,null,null,null,null,""]
[null,null,null,null,null,null,null,""]
[null,null,null,null,null,null,null,""]
[null,null,null,null,null,null,null,""]
[null,null,null,null,null,null,null,""]
[null,null,null,null,null,null,null,""]
[null,null,null,null,null,null,null,""]
[null,null,null,null,null,null,null,""]
[null,null,null,null,null,null,null,""]
[null,null,null,null,null,null,null,""]
[null,null,null,null,null,null,null,""]
[null,null,null,null,null,null,null,""]
[null,null,null,null,null,null,null,""]
[null,null,null,null,null,null,null,""]
[null,null,null,null,null,null,null,""]
[null,null,null,null,null,null,null,""]
[null,null,null,null,null,null,null,""]
[null,null,null,null,null,null,null,""]
[null,null,null,null,null,null,null,""]
[null,null,null,null,null,null,null,""]
[null,null,null,null,null,null,null,""]
[null,null,null,null,null,null,null,""]
[null,null,null,null,null,null,null,""]
[null,null,null,null,null,null,null,""]
[null,null,null,null,null,null,null,""]
[null,null,null,null,null,null,null,""]
[null,null,null,null,null,null,null,""]
[null,null,null,null,null,null,null,""]
[null,null,null,null,null,null,null,""]
[null,null,null,null,null,null,null,""]
[null,null,null,null,null,null,null,""]
[null,null,null,null,null,null,null,""]
[null,null,null,null,null,null,null,""]
[null,null,null,null,null,null,null,""]
[null,null,null,null,null,null,null,""]
[null,null,null,null,null,null,null,""]
[null,null,null,null,null,null,null,""]
[null,null,null,null,null,null,null,""]
[null,null,null,null,null,null,null,""]
[null,null,null,null,null,null,null,""]
[null,null,null,null,null,null,null,""]
[null,null,null,null,null,null,null,""]
[null,null,null,null,null,null,null,""]
[null,null,null,null,null,null,null,""]
[null,null,null,null,null,null,null,""]
[null,null,null,null,null,null,null,{"$f":"IF(A74<>0,SUM(H74+C75-D75),\"\")","v":""}]
[null,null,null,null,null,null,null,""]
[null,null,null,null,null,null,null,""]
[null,null,null,null,null,null,null,""]
[null,null,null,null,null,null,null,""]
[null,null,null,null,null,null,null,""]
{"$rows_left_out":1921}
{"sheet":"اسماء الزبائن","index":5,"n_rows":10,"n_cols":1,"rows_kept":10,"cut":false,"hidden":false,"merged":[]}
["عمر"]
["خالد"]
["نبيل"]
["رامي"]
["محمد"]
["محمود"]
["رباح"]
["خليل"]
["عبود"]
["كارول"]