{"text_format":"1","workbook":"xlsx","n_sheets":56,"sheets":["البيانات","الشيت الرئيسي","R100","R101","R102","R103","R104","R105","R106","R107","R108","R109","R1010","R1011","R1012","R113","R114","R115","R116","R117","R118","R119","R120","R121","R122","R123","R124","R125","R126","R127","R128","R129","R130","R131","R132","R133","R134","R135","R136","R137","R138","R139","R140","R141","R142","R143","R144","R145","R146","R147","R148","R149","R150","فاتورة المشتريات الرئيسية","فواتير المشتريات الكلية","إستدعاء برقم الفاتورة"],"not_rendered":{"charts":0,"images":0,"macros":1,"external_links":0,"defined_names":0,"comments":0,"pivot_tables":0},"unopened":[],"bounds":{"document_bytes":16777216,"sheet_cells":100000,"rows_first":2000,"rows_last":500,"rows_between":2000,"halvings":0,"cell_chars":16384,"cell_head_chars":4096},"cells_cut":0,"cells_raw":0,"read":"whole","date_system":"1900"}

{"sheet":"البيانات","index":0,"n_rows":52,"n_cols":7,"rows_kept":52,"cut":false,"hidden":false,"merged":[]}
["رقم الحافلة ","رقم الرحلة ","نوع الرحلة ","تاريخ الرحلة ","اسم المرشد ","فندق المدينة المنورة ","فندق مكة المكرمة "]
[1,"R100","طيران ","25-9-2018","محمود"]
[1,"R101","حافلات VIP",null,"حذيفه"]
[1,"R102","حافلات سياحية ",null,"علي"]
[2,"R103","طيران ",null,"حذيفه"]
[5,"R104",null,null,"علي"]
[null,"R105"]
[null,"R106"]
{"$rows_left_out":45}
{"sheet":"الشيت الرئيسي","index":1,"n_rows":45,"n_cols":12,"rows_kept":45,"cut":false,"hidden":false,"merged":[[44,0,44,9],[10,5,10,6],[5,5,5,6],[6,5,6,6],[8,5,8,6],[9,5,9,6],[10,8,10,9],[10,10,10,11],[5,1,6,3],[0,0,3,11],[8,8,8,9],[8,10,8,11],[9,8,9,9],[9,10,9,11]]}
[]
[]
[]
[]
[]
[null,"قائمة بأسماء المعتمرين  ",null,null,null,"رقم الحافلة"]
[null,null,null,null,null,{"$f":"IFERROR(INDEX(البيانات!$A$2:$A$320,MATCH($B$9,البيانات!$B$2:$B$320,0)),\"\")","v":0}]
[]
{"$rows_left_out":38}
{"sheet":"R100","index":2,"n_rows":45,"n_cols":12,"rows_kept":45,"cut":false,"hidden":false,"merged":[[44,0,44,9],[5,5,5,6],[6,5,6,6],[8,5,8,6],[9,5,9,6],[10,5,10,6]]}
[]
[]
[]
[]
[]
[null,null,null,null,null,"رقم الحافلة"]
[null,null,"حساب الرحلة ",null,null,{"$f":"IFERROR(INDEX(البيانات!$A$2:$A$320,MATCH($B$9,البيانات!$B$2:$B$320,0)),\"\")","v":1}]
[]
{"$rows_left_out":38}
{"sheet":"R101","index":3,"n_rows":45,"n_cols":12,"rows_kept":45,"cut":false,"hidden":false,"merged":[[44,0,44,9],[5,5,5,6],[6,5,6,6],[8,5,8,6],[9,5,9,6],[10,5,10,6]]}
[]
[]
[]
[]
[]
[null,null,null,null,null,"رقم الحافلة"]
[null,null,"حساب الرحلة ",null,null,{"$f":"IFERROR(INDEX(البيانات!$A$2:$A$320,MATCH($B$9,البيانات!$B$2:$B$320,0)),\"\")","v":1}]
[]
{"$rows_left_out":38}
{"sheet":"R102","index":4,"n_rows":45,"n_cols":12,"rows_kept":45,"cut":false,"hidden":false,"merged":[[44,0,44,9],[5,5,5,6],[6,5,6,6],[8,5,8,6],[9,5,9,6],[10,5,10,6]]}
[]
[]
[]
[]
[]
[null,null,null,null,null,"رقم الحافلة"]
[null,null,"حساب الرحلة ",null,null,{"$f":"IFERROR(INDEX(البيانات!$A$2:$A$320,MATCH($B$9,البيانات!$B$2:$B$320,0)),\"\")","v":1}]
[]
{"$rows_left_out":38}
{"sheet":"R103","index":5,"n_rows":45,"n_cols":12,"rows_kept":45,"cut":false,"hidden":false,"merged":[[44,0,44,9],[5,5,5,6],[6,5,6,6],[8,5,8,6],[9,5,9,6],[10,5,10,6]]}
[]
[]
[]
[]
[]
[null,null,null,null,null,"رقم الحافلة"]
[null,null,"حساب الرحلة ",null,null,{"$f":"IFERROR(INDEX(البيانات!$A$2:$A$320,MATCH($B$9,البيانات!$B$2:$B$320,0)),\"\")","v":2}]
[]
{"$rows_left_out":38}
{"sheet":"R104","index":6,"n_rows":45,"n_cols":12,"rows_kept":45,"cut":false,"hidden":false,"merged":[[44,0,44,9],[5,5,5,6],[6,5,6,6],[8,5,8,6],[9,5,9,6],[10,5,10,6]]}
[]
[]
[]
[]
[]
[null,null,null,null,null,"رقم الحافلة"]
[null,null,"حساب الرحلة ",null,null,{"$f":"IFERROR(INDEX(البيانات!$A$2:$A$320,MATCH($B$9,البيانات!$B$2:$B$320,0)),\"\")","v":5}]
[]
{"$rows_left_out":38}
{"sheet":"R105","index":7,"n_rows":45,"n_cols":12,"rows_kept":45,"cut":false,"hidden":false,"merged":[[44,0,44,9],[5,5,5,6],[6,5,6,6],[8,5,8,6],[9,5,9,6],[10,5,10,6]]}
[]
[]
[]
[]
[]
[null,null,null,null,null,"رقم الحافلة"]
[null,null,"حساب الرحلة ",null,null,{"$f":"IFERROR(INDEX(البيانات!$A$2:$A$320,MATCH($B$9,البيانات!$B$2:$B$320,0)),\"\")","v":0}]
[]
{"$rows_left_out":38}
{"sheet":"R106","index":8,"n_rows":45,"n_cols":12,"rows_kept":45,"cut":false,"hidden":false,"merged":[[44,0,44,9],[5,5,5,6],[6,5,6,6],[8,5,8,6],[9,5,9,6],[10,5,10,6]]}
[]
[]
[]
[]
[]
[null,null,null,null,null,"رقم الحافلة"]
[null,null,"حساب الرحلة ",null,null,{"$f":"IFERROR(INDEX(البيانات!$A$2:$A$320,MATCH($B$9,البيانات!$B$2:$B$320,0)),\"\")","v":0}]
[]
{"$rows_left_out":38}
{"sheet":"R107","index":9,"n_rows":45,"n_cols":12,"rows_kept":45,"cut":false,"hidden":false,"merged":[[44,0,44,9],[5,5,5,6],[6,5,6,6],[8,5,8,6],[9,5,9,6],[10,5,10,6]]}
[]
[]
[]
[]
[]
[null,null,null,null,null,"رقم الحافلة"]
[null,null,"حساب الرحلة ",null,null,{"$f":"IFERROR(INDEX(البيانات!$A$2:$A$320,MATCH($B$9,البيانات!$B$2:$B$320,0)),\"\")","v":0}]
[]
{"$rows_left_out":38}
{"sheet":"R108","index":10,"n_rows":45,"n_cols":12,"rows_kept":45,"cut":false,"hidden":false,"merged":[[44,0,44,9],[5,5,5,6],[6,5,6,6],[8,5,8,6],[9,5,9,6],[10,5,10,6]]}
[]
[]
[]
[]
[]
[null,null,null,null,null,"رقم الحافلة"]
[null,null,"حساب الرحلة ",null,null,{"$f":"IFERROR(INDEX(البيانات!$A$2:$A$320,MATCH($B$9,البيانات!$B$2:$B$320,0)),\"\")","v":0}]
[]
{"$rows_left_out":38}
{"sheet":"R109","index":11,"n_rows":45,"n_cols":12,"rows_kept":45,"cut":false,"hidden":false,"merged":[[44,0,44,9],[5,5,5,6],[6,5,6,6],[8,5,8,6],[9,5,9,6],[10,5,10,6]]}
[]
[]
[]
[]
[]
[null,null,null,null,null,"رقم الحافلة"]
[null,null,"حساب الرحلة ",null,null,{"$f":"IFERROR(INDEX(البيانات!$A$2:$A$320,MATCH($B$9,البيانات!$B$2:$B$320,0)),\"\")","v":0}]
[]
{"$rows_left_out":38}
{"sheet":"R1010","index":12,"n_rows":45,"n_cols":12,"rows_kept":45,"cut":false,"hidden":false,"merged":[[44,0,44,9],[5,5,5,6],[6,5,6,6],[8,5,8,6],[9,5,9,6],[10,5,10,6]]}
[]
[]
[]
[]
[]
[null,null,null,null,null,"رقم الحافلة"]
[null,null,"حساب الرحلة ",null,null,{"$f":"IFERROR(INDEX(البيانات!$A$2:$A$320,MATCH($B$9,البيانات!$B$2:$B$320,0)),\"\")","v":0}]
[]
{"$rows_left_out":38}
{"sheet":"R1011","index":13,"n_rows":45,"n_cols":12,"rows_kept":45,"cut":false,"hidden":false,"merged":[[44,0,44,9],[5,5,5,6],[6,5,6,6],[8,5,8,6],[9,5,9,6],[10,5,10,6]]}
[]
[]
[]
[]
[]
[null,null,null,null,null,"رقم الحافلة"]
[null,null,"حساب الرحلة ",null,null,{"$f":"IFERROR(INDEX(البيانات!$A$2:$A$320,MATCH($B$9,البيانات!$B$2:$B$320,0)),\"\")","v":0}]
[]
{"$rows_left_out":38}
{"sheet":"R1012","index":14,"n_rows":45,"n_cols":12,"rows_kept":45,"cut":false,"hidden":false,"merged":[[44,0,44,9],[5,5,5,6],[6,5,6,6],[8,5,8,6],[9,5,9,6],[10,5,10,6]]}
[]
[]
[]
[]
[]
[null,null,null,null,null,"رقم الحافلة"]
[null,null,"حساب الرحلة ",null,null,{"$f":"IFERROR(INDEX(البيانات!$A$2:$A$320,MATCH($B$9,البيانات!$B$2:$B$320,0)),\"\")","v":0}]
[]
{"$rows_left_out":38}
{"sheet":"R113","index":15,"n_rows":45,"n_cols":12,"rows_kept":45,"cut":false,"hidden":false,"merged":[[44,0,44,9],[5,5,5,6],[6,5,6,6],[8,5,8,6],[9,5,9,6],[10,5,10,6]]}
[]
[]
[]
[]
[]
[null,null,null,null,null,"رقم الحافلة"]
[null,null,"حساب الرحلة ",null,null,{"$f":"IFERROR(INDEX(البيانات!$A$2:$A$320,MATCH($B$9,البيانات!$B$2:$B$320,0)),\"\")","v":0}]
[]
{"$rows_left_out":38}
{"sheet":"R114","index":16,"n_rows":45,"n_cols":12,"rows_kept":45,"cut":false,"hidden":false,"merged":[[44,0,44,9],[5,5,5,6],[6,5,6,6],[8,5,8,6],[9,5,9,6],[10,5,10,6]]}
[]
[]
[]
[]
[]
[null,null,null,null,null,"رقم الحافلة"]
[null,null,"حساب الرحلة ",null,null,{"$f":"IFERROR(INDEX(البيانات!$A$2:$A$320,MATCH($B$9,البيانات!$B$2:$B$320,0)),\"\")","v":0}]
[]
{"$rows_left_out":38}
{"sheet":"R115","index":17,"n_rows":45,"n_cols":12,"rows_kept":45,"cut":false,"hidden":false,"merged":[[44,0,44,9],[5,5,5,6],[6,5,6,6],[8,5,8,6],[9,5,9,6],[10,5,10,6]]}
[]
[]
[]
[]
[]
[null,null,null,null,null,"رقم الحافلة"]
[null,null,"حساب الرحلة ",null,null,{"$f":"IFERROR(INDEX(البيانات!$A$2:$A$320,MATCH($B$9,البيانات!$B$2:$B$320,0)),\"\")","v":0}]
[]
{"$rows_left_out":38}
{"sheet":"R116","index":18,"n_rows":45,"n_cols":12,"rows_kept":45,"cut":false,"hidden":false,"merged":[[44,0,44,9],[5,5,5,6],[6,5,6,6],[8,5,8,6],[9,5,9,6],[10,5,10,6]]}
[]
[]
[]
[]
[]
[null,null,null,null,null,"رقم الحافلة"]
[null,null,"حساب الرحلة ",null,null,{"$f":"IFERROR(INDEX(البيانات!$A$2:$A$320,MATCH($B$9,البيانات!$B$2:$B$320,0)),\"\")","v":0}]
[]
{"$rows_left_out":38}
{"sheet":"R117","index":19,"n_rows":45,"n_cols":12,"rows_kept":45,"cut":false,"hidden":false,"merged":[[44,0,44,9],[5,5,5,6],[6,5,6,6],[8,5,8,6],[9,5,9,6],[10,5,10,6]]}
[]
[]
[]
[]
[]
[null,null,null,null,null,"رقم الحافلة"]
[null,null,"حساب الرحلة ",null,null,{"$f":"IFERROR(INDEX(البيانات!$A$2:$A$320,MATCH($B$9,البيانات!$B$2:$B$320,0)),\"\")","v":0}]
[]
{"$rows_left_out":38}
{"sheet":"R118","index":20,"n_rows":45,"n_cols":12,"rows_kept":45,"cut":false,"hidden":false,"merged":[[44,0,44,9],[5,5,5,6],[6,5,6,6],[8,5,8,6],[9,5,9,6],[10,5,10,6]]}
[]
[]
[]
[]
[]
[null,null,null,null,null,"رقم الحافلة"]
[null,null,"حساب الرحلة ",null,null,{"$f":"IFERROR(INDEX(البيانات!$A$2:$A$320,MATCH($B$9,البيانات!$B$2:$B$320,0)),\"\")","v":0}]
[]
{"$rows_left_out":38}
{"sheet":"R119","index":21,"n_rows":45,"n_cols":12,"rows_kept":45,"cut":false,"hidden":false,"merged":[[44,0,44,9],[5,5,5,6],[6,5,6,6],[8,5,8,6],[9,5,9,6],[10,5,10,6]]}
[]
[]
[]
[]
[]
[null,null,null,null,null,"رقم الحافلة"]
[null,null,"حساب الرحلة ",null,null,{"$f":"IFERROR(INDEX(البيانات!$A$2:$A$320,MATCH($B$9,البيانات!$B$2:$B$320,0)),\"\")","v":0}]
[]
{"$rows_left_out":38}
{"sheet":"R120","index":22,"n_rows":45,"n_cols":12,"rows_kept":45,"cut":false,"hidden":false,"merged":[[44,0,44,9],[5,5,5,6],[6,5,6,6],[8,5,8,6],[9,5,9,6],[10,5,10,6]]}
[]
[]
[]
[]
[]
[null,null,null,null,null,"رقم الحافلة"]
[null,null,"حساب الرحلة ",null,null,{"$f":"IFERROR(INDEX(البيانات!$A$2:$A$320,MATCH($B$9,البيانات!$B$2:$B$320,0)),\"\")","v":0}]
[]
{"$rows_left_out":38}
{"sheet":"R121","index":23,"n_rows":45,"n_cols":12,"rows_kept":45,"cut":false,"hidden":false,"merged":[[44,0,44,9],[5,5,5,6],[6,5,6,6],[8,5,8,6],[9,5,9,6],[10,5,10,6]]}
[]
[]
[]
[]
[]
[null,null,null,null,null,"رقم الحافلة"]
[null,null,"حساب الرحلة ",null,null,{"$f":"IFERROR(INDEX(البيانات!$A$2:$A$320,MATCH($B$9,البيانات!$B$2:$B$320,0)),\"\")","v":0}]
[]
{"$rows_left_out":38}
{"sheet":"R122","index":24,"n_rows":45,"n_cols":12,"rows_kept":45,"cut":false,"hidden":false,"merged":[[44,0,44,9],[5,5,5,6],[6,5,6,6],[8,5,8,6],[9,5,9,6],[10,5,10,6]]}
[]
[]
[]
[]
[]
[null,null,null,null,null,"رقم الحافلة"]
[null,null,"حساب الرحلة ",null,null,{"$f":"IFERROR(INDEX(البيانات!$A$2:$A$320,MATCH($B$9,البيانات!$B$2:$B$320,0)),\"\")","v":0}]
[]
{"$rows_left_out":38}
{"sheet":"R123","index":25,"n_rows":45,"n_cols":12,"rows_kept":45,"cut":false,"hidden":false,"merged":[[44,0,44,9],[5,5,5,6],[6,5,6,6],[8,5,8,6],[9,5,9,6],[10,5,10,6]]}
[]
[]
[]
[]
[]
[null,null,null,null,null,"رقم الحافلة"]
[null,null,"حساب الرحلة ",null,null,{"$f":"IFERROR(INDEX(البيانات!$A$2:$A$320,MATCH($B$9,البيانات!$B$2:$B$320,0)),\"\")","v":0}]
[]
{"$rows_left_out":38}
{"sheet":"R124","index":26,"n_rows":45,"n_cols":12,"rows_kept":45,"cut":false,"hidden":false,"merged":[[44,0,44,9],[5,5,5,6],[6,5,6,6],[8,5,8,6],[9,5,9,6],[10,5,10,6]]}
[]
[]
[]
[]
[]
[null,null,null,null,null,"رقم الحافلة"]
[null,null,"حساب الرحلة ",null,null,{"$f":"IFERROR(INDEX(البيانات!$A$2:$A$320,MATCH($B$9,البيانات!$B$2:$B$320,0)),\"\")","v":0}]
[]
{"$rows_left_out":38}
{"sheet":"R125","index":27,"n_rows":45,"n_cols":12,"rows_kept":45,"cut":false,"hidden":false,"merged":[[44,0,44,9],[5,5,5,6],[6,5,6,6],[8,5,8,6],[9,5,9,6],[10,5,10,6]]}
[]
[]
[]
[]
[]
[null,null,null,null,null,"رقم الحافلة"]
[null,null,"حساب الرحلة ",null,null,{"$f":"IFERROR(INDEX(البيانات!$A$2:$A$320,MATCH($B$9,البيانات!$B$2:$B$320,0)),\"\")","v":0}]
[]
{"$rows_left_out":38}
{"sheet":"R126","index":28,"n_rows":45,"n_cols":12,"rows_kept":45,"cut":false,"hidden":false,"merged":[[44,0,44,9],[5,5,5,6],[6,5,6,6],[8,5,8,6],[9,5,9,6],[10,5,10,6]]}
[]
[]
[]
[]
[]
[null,null,null,null,null,"رقم الحافلة"]
[null,null,"حساب الرحلة ",null,null,{"$f":"IFERROR(INDEX(البيانات!$A$2:$A$320,MATCH($B$9,البيانات!$B$2:$B$320,0)),\"\")","v":0}]
[]
{"$rows_left_out":38}
{"sheet":"R127","index":29,"n_rows":45,"n_cols":12,"rows_kept":45,"cut":false,"hidden":false,"merged":[[44,0,44,9],[5,5,5,6],[6,5,6,6],[8,5,8,6],[9,5,9,6],[10,5,10,6]]}
[]
[]
[]
[]
[]
[null,null,null,null,null,"رقم الحافلة"]
[null,null,"حساب الرحلة ",null,null,{"$f":"IFERROR(INDEX(البيانات!$A$2:$A$320,MATCH($B$9,البيانات!$B$2:$B$320,0)),\"\")","v":0}]
[]
{"$rows_left_out":38}
{"sheet":"R128","index":30,"n_rows":45,"n_cols":12,"rows_kept":45,"cut":false,"hidden":false,"merged":[[44,0,44,9],[5,5,5,6],[6,5,6,6],[8,5,8,6],[9,5,9,6],[10,5,10,6]]}
[]
[]
[]
[]
[]
[null,null,null,null,null,"رقم الحافلة"]
[null,null,"حساب الرحلة ",null,null,{"$f":"IFERROR(INDEX(البيانات!$A$2:$A$320,MATCH($B$9,البيانات!$B$2:$B$320,0)),\"\")","v":0}]
[]
{"$rows_left_out":38}
{"sheet":"R129","index":31,"n_rows":45,"n_cols":12,"rows_kept":45,"cut":false,"hidden":false,"merged":[[44,0,44,9],[5,5,5,6],[6,5,6,6],[8,5,8,6],[9,5,9,6],[10,5,10,6]]}
[]
[]
[]
[]
[]
[null,null,null,null,null,"رقم الحافلة"]
[null,null,"حساب الرحلة ",null,null,{"$f":"IFERROR(INDEX(البيانات!$A$2:$A$320,MATCH($B$9,البيانات!$B$2:$B$320,0)),\"\")","v":0}]
[]
{"$rows_left_out":38}
{"sheet":"R130","index":32,"n_rows":45,"n_cols":12,"rows_kept":45,"cut":false,"hidden":false,"merged":[[44,0,44,9],[5,5,5,6],[6,5,6,6],[8,5,8,6],[9,5,9,6],[10,5,10,6]]}
[]
[]
[]
[]
[]
[null,null,null,null,null,"رقم الحافلة"]
[null,null,"حساب الرحلة ",null,null,{"$f":"IFERROR(INDEX(البيانات!$A$2:$A$320,MATCH($B$9,البيانات!$B$2:$B$320,0)),\"\")","v":0}]
[]
{"$rows_left_out":38}
{"sheet":"R131","index":33,"n_rows":45,"n_cols":12,"rows_kept":45,"cut":false,"hidden":false,"merged":[[44,0,44,9],[5,5,5,6],[6,5,6,6],[8,5,8,6],[9,5,9,6],[10,5,10,6]]}
[]
[]
[]
[]
[]
[null,null,null,null,null,"رقم الحافلة"]
[null,null,"حساب الرحلة ",null,null,{"$f":"IFERROR(INDEX(البيانات!$A$2:$A$320,MATCH($B$9,البيانات!$B$2:$B$320,0)),\"\")","v":0}]
[]
{"$rows_left_out":38}
{"sheet":"R132","index":34,"n_rows":45,"n_cols":12,"rows_kept":45,"cut":false,"hidden":false,"merged":[[44,0,44,9],[5,5,5,6],[6,5,6,6],[8,5,8,6],[9,5,9,6],[10,5,10,6]]}
[]
[]
[]
[]
[]
[null,null,null,null,null,"رقم الحافلة"]
[null,null,"حساب الرحلة ",null,null,{"$f":"IFERROR(INDEX(البيانات!$A$2:$A$320,MATCH($B$9,البيانات!$B$2:$B$320,0)),\"\")","v":0}]
[]
{"$rows_left_out":38}
{"sheet":"R133","index":35,"n_rows":45,"n_cols":12,"rows_kept":45,"cut":false,"hidden":false,"merged":[[44,0,44,9],[5,5,5,6],[6,5,6,6],[8,5,8,6],[9,5,9,6],[10,5,10,6]]}
[]
[]
[]
[]
[]
[null,null,null,null,null,"رقم الحافلة"]
[null,null,"حساب الرحلة ",null,null,{"$f":"IFERROR(INDEX(البيانات!$A$2:$A$320,MATCH($B$9,البيانات!$B$2:$B$320,0)),\"\")","v":0}]
[]
{"$rows_left_out":38}
{"sheet":"R134","index":36,"n_rows":45,"n_cols":12,"rows_kept":45,"cut":false,"hidden":false,"merged":[[44,0,44,9],[5,5,5,6],[6,5,6,6],[8,5,8,6],[9,5,9,6],[10,5,10,6]]}
[]
[]
[]
[]
[]
[null,null,null,null,null,"رقم الحافلة"]
[null,null,"حساب الرحلة ",null,null,{"$f":"IFERROR(INDEX(البيانات!$A$2:$A$320,MATCH($B$9,البيانات!$B$2:$B$320,0)),\"\")","v":0}]
[]
{"$rows_left_out":38}
{"sheet":"R135","index":37,"n_rows":45,"n_cols":12,"rows_kept":45,"cut":false,"hidden":false,"merged":[[44,0,44,9],[5,5,5,6],[6,5,6,6],[8,5,8,6],[9,5,9,6],[10,5,10,6]]}
[]
[]
[]
[]
[]
[null,null,null,null,null,"رقم الحافلة"]
[null,null,"حساب الرحلة ",null,null,{"$f":"IFERROR(INDEX(البيانات!$A$2:$A$320,MATCH($B$9,البيانات!$B$2:$B$320,0)),\"\")","v":0}]
[]
{"$rows_left_out":38}
{"sheet":"R136","index":38,"n_rows":45,"n_cols":12,"rows_kept":45,"cut":false,"hidden":false,"merged":[[44,0,44,9],[5,5,5,6],[6,5,6,6],[8,5,8,6],[9,5,9,6],[10,5,10,6]]}
[]
[]
[]
[]
[]
[null,null,null,null,null,"رقم الحافلة"]
[null,null,"حساب الرحلة ",null,null,{"$f":"IFERROR(INDEX(البيانات!$A$2:$A$320,MATCH($B$9,البيانات!$B$2:$B$320,0)),\"\")","v":0}]
[]
{"$rows_left_out":38}
{"sheet":"R137","index":39,"n_rows":45,"n_cols":12,"rows_kept":45,"cut":false,"hidden":false,"merged":[[44,0,44,9],[5,5,5,6],[6,5,6,6],[8,5,8,6],[9,5,9,6],[10,5,10,6]]}
[]
[]
[]
[]
[]
[null,null,null,null,null,"رقم الحافلة"]
[null,null,"حساب الرحلة ",null,null,{"$f":"IFERROR(INDEX(البيانات!$A$2:$A$320,MATCH($B$9,البيانات!$B$2:$B$320,0)),\"\")","v":0}]
[]
{"$rows_left_out":38}
{"sheet":"R138","index":40,"n_rows":45,"n_cols":12,"rows_kept":45,"cut":false,"hidden":false,"merged":[[44,0,44,9],[5,5,5,6],[6,5,6,6],[8,5,8,6],[9,5,9,6],[10,5,10,6]]}
[]
[]
[]
[]
[]
[null,null,null,null,null,"رقم الحافلة"]
[null,null,"حساب الرحلة ",null,null,{"$f":"IFERROR(INDEX(البيانات!$A$2:$A$320,MATCH($B$9,البيانات!$B$2:$B$320,0)),\"\")","v":0}]
[]
{"$rows_left_out":38}
{"sheet":"R139","index":41,"n_rows":45,"n_cols":12,"rows_kept":45,"cut":false,"hidden":false,"merged":[[44,0,44,9],[5,5,5,6],[6,5,6,6],[8,5,8,6],[9,5,9,6],[10,5,10,6]]}
[]
[]
[]
[]
[]
[null,null,null,null,null,"رقم الحافلة"]
[null,null,"حساب الرحلة ",null,null,{"$f":"IFERROR(INDEX(البيانات!$A$2:$A$320,MATCH($B$9,البيانات!$B$2:$B$320,0)),\"\")","v":0}]
[]
{"$rows_left_out":38}
{"sheet":"R140","index":42,"n_rows":45,"n_cols":12,"rows_kept":45,"cut":false,"hidden":false,"merged":[[44,0,44,9],[5,5,5,6],[6,5,6,6],[8,5,8,6],[9,5,9,6],[10,5,10,6]]}
[]
[]
[]
[]
[]
[null,null,null,null,null,"رقم الحافلة"]
[null,null,"حساب الرحلة ",null,null,{"$f":"IFERROR(INDEX(البيانات!$A$2:$A$320,MATCH($B$9,البيانات!$B$2:$B$320,0)),\"\")","v":0}]
[]
{"$rows_left_out":38}
{"sheet":"R141","index":43,"n_rows":45,"n_cols":12,"rows_kept":45,"cut":false,"hidden":false,"merged":[[44,0,44,9],[5,5,5,6],[6,5,6,6],[8,5,8,6],[9,5,9,6],[10,5,10,6]]}
[]
[]
[]
[]
[]
[null,null,null,null,null,"رقم الحافلة"]
[null,null,"حساب الرحلة ",null,null,{"$f":"IFERROR(INDEX(البيانات!$A$2:$A$320,MATCH($B$9,البيانات!$B$2:$B$320,0)),\"\")","v":0}]
[]
{"$rows_left_out":38}
{"sheet":"R142","index":44,"n_rows":45,"n_cols":12,"rows_kept":45,"cut":false,"hidden":false,"merged":[[44,0,44,9],[5,5,5,6],[6,5,6,6],[8,5,8,6],[9,5,9,6],[10,5,10,6]]}
[]
[]
[]
[]
[]
[null,null,null,null,null,"رقم الحافلة"]
[null,null,"حساب الرحلة ",null,null,{"$f":"IFERROR(INDEX(البيانات!$A$2:$A$320,MATCH($B$9,البيانات!$B$2:$B$320,0)),\"\")","v":0}]
[]
{"$rows_left_out":38}
{"sheet":"R143","index":45,"n_rows":45,"n_cols":12,"rows_kept":45,"cut":false,"hidden":false,"merged":[[44,0,44,9],[5,5,5,6],[6,5,6,6],[8,5,8,6],[9,5,9,6],[10,5,10,6]]}
[]
[]
[]
[]
[]
[null,null,null,null,null,"رقم الحافلة"]
[null,null,"حساب الرحلة ",null,null,{"$f":"IFERROR(INDEX(البيانات!$A$2:$A$320,MATCH($B$9,البيانات!$B$2:$B$320,0)),\"\")","v":0}]
[]
{"$rows_left_out":38}
{"sheet":"R144","index":46,"n_rows":45,"n_cols":12,"rows_kept":45,"cut":false,"hidden":false,"merged":[[44,0,44,9],[5,5,5,6],[6,5,6,6],[8,5,8,6],[9,5,9,6],[10,5,10,6]]}
[]
[]
[]
[]
[]
[null,null,null,null,null,"رقم الحافلة"]
[null,null,"حساب الرحلة ",null,null,{"$f":"IFERROR(INDEX(البيانات!$A$2:$A$320,MATCH($B$9,البيانات!$B$2:$B$320,0)),\"\")","v":0}]
[]
{"$rows_left_out":38}
{"sheet":"R145","index":47,"n_rows":45,"n_cols":12,"rows_kept":45,"cut":false,"hidden":false,"merged":[[44,0,44,9],[5,5,5,6],[6,5,6,6],[8,5,8,6],[9,5,9,6],[10,5,10,6]]}
[]
[]
[]
[]
[]
[null,null,null,null,null,"رقم الحافلة"]
[null,null,"حساب الرحلة ",null,null,{"$f":"IFERROR(INDEX(البيانات!$A$2:$A$320,MATCH($B$9,البيانات!$B$2:$B$320,0)),\"\")","v":0}]
[]
{"$rows_left_out":38}
{"sheet":"R146","index":48,"n_rows":45,"n_cols":12,"rows_kept":45,"cut":false,"hidden":false,"merged":[[44,0,44,9],[5,5,5,6],[6,5,6,6],[8,5,8,6],[9,5,9,6],[10,5,10,6]]}
[]
[]
[]
[]
[]
[null,null,null,null,null,"رقم الحافلة"]
[null,null,"حساب الرحلة ",null,null,{"$f":"IFERROR(INDEX(البيانات!$A$2:$A$320,MATCH($B$9,البيانات!$B$2:$B$320,0)),\"\")","v":0}]
[]
{"$rows_left_out":38}
{"sheet":"R147","index":49,"n_rows":45,"n_cols":12,"rows_kept":45,"cut":false,"hidden":false,"merged":[[44,0,44,9],[5,5,5,6],[6,5,6,6],[8,5,8,6],[9,5,9,6],[10,5,10,6]]}
[]
[]
[]
[]
[]
[null,null,null,null,null,"رقم الحافلة"]
[null,null,"حساب الرحلة ",null,null,{"$f":"IFERROR(INDEX(البيانات!$A$2:$A$320,MATCH($B$9,البيانات!$B$2:$B$320,0)),\"\")","v":0}]
[]
{"$rows_left_out":38}
{"sheet":"R148","index":50,"n_rows":45,"n_cols":12,"rows_kept":45,"cut":false,"hidden":false,"merged":[[44,0,44,9],[5,5,5,6],[6,5,6,6],[8,5,8,6],[9,5,9,6],[10,5,10,6]]}
[]
[]
[]
[]
[]
[null,null,null,null,null,"رقم الحافلة"]
[null,null,"حساب الرحلة ",null,null,{"$f":"IFERROR(INDEX(البيانات!$A$2:$A$320,MATCH($B$9,البيانات!$B$2:$B$320,0)),\"\")","v":0}]
[]
{"$rows_left_out":38}
{"sheet":"R149","index":51,"n_rows":45,"n_cols":12,"rows_kept":45,"cut":false,"hidden":false,"merged":[[44,0,44,9],[5,5,5,6],[6,5,6,6],[8,5,8,6],[9,5,9,6],[10,5,10,6]]}
[]
[]
[]
[]
[]
[null,null,null,null,null,"رقم الحافلة"]
[null,null,"حساب الرحلة ",null,null,{"$f":"IFERROR(INDEX(البيانات!$A$2:$A$320,MATCH($B$9,البيانات!$B$2:$B$320,0)),\"\")","v":0}]
[]
{"$rows_left_out":38}
{"sheet":"R150","index":52,"n_rows":45,"n_cols":12,"rows_kept":45,"cut":false,"hidden":false,"merged":[[44,0,44,9],[5,5,5,6],[6,5,6,6],[8,5,8,6],[9,5,9,6],[10,5,10,6]]}
[]
[]
[]
[]
[]
[null,null,null,null,null,"رقم الحافلة"]
[null,null,"حساب الرحلة ",null,null,{"$f":"IFERROR(INDEX(البيانات!$A$2:$A$320,MATCH($B$9,البيانات!$B$2:$B$320,0)),\"\")","v":0}]
[]
{"$rows_left_out":38}
{"sheet":"فاتورة المشتريات الرئيسية","index":53,"n_rows":24,"n_cols":6,"rows_kept":24,"cut":false,"hidden":false,"merged":[[23,1,25,4],[23,5,25,5],[30,1,30,2],[30,3,30,5],[5,1,5,5],[19,1,19,2],[20,1,20,4],[21,1,21,4],[22,1,22,4]]}
[]
[]
[]
[]
[]
[]
[null,null,"فاتورة مشتريات","رقم الفاتورة ",3]
[null,"رقم الرحلة",null,null,"اسم المرشد ",{"$f":"IFERROR(IF(INDEX(البيانات!$E$2:$E$1000,MATCH($C$8,البيانات!$B$2:$B$1000,0))=\"\",\"\",INDEX(البيانات!$E$2:$E$1000,MATCH($C$8,البيانات!$B$2:$B$1000,0))),\"\")","v":""}]
{"$rows_left_out":17}
{"sheet":"فواتير المشتريات الكلية","index":54,"n_rows":693,"n_cols":29,"rows_kept":693,"cut":false,"hidden":false,"merged":[[0,0,1,7],[0,20,1,28],[1,8,1,10],[1,11,1,13],[1,14,1,16],[1,17,1,19],[0,8,0,19]]}
[null,null,null,null,null,null,null,null,"نوع الغرف"]
[null,null,null,null,null,null,null,null,"الثنائية",null,null,"الثلاثية",null,null,"الرباعية",null,null,"الخماسية"]
["مسلسل","رقم\n الفاتورة","رقم \nالرحلة","تاريخ الرحلة","نوع \nالرحلة ","اسم المرشد","فندق\n المدينة \nالمنورة","فندق \nمكة \nالمكرمة ","عدد الغرف","عدد المعتمرين","السعر","عدد الغرف","عدد المعتمرين","السعر","عدد الغرف","عدد المعتمرين","السعر","عدد الغرف","عدد المعتمرين","السعر","تكاليف اخرى","التأشيرة \nبدون مقعد  ","التأشيرة\n+ مقعد","اخرى ","الاجمالي","المرشد /\n (  يطرح ) ","عمولة مندوبين\n، مصاريف","اخرى ","صافى\n المشتريات"]
[{"$f":"IF(B4=\"\",\"\",SUBTOTAL(3,$B$4:B4))","v":1},1,"R100","25-9-2018","طيران ","محمود",null,null,2,4,35,3,9,45,null,null,null,null,null,null,0,0,0,0,{"$f":"(I4*K4)+(L4*N4)+(O4*Q4)+(R4*T4)+SUM(U4:X4)","v":205},10,20,30,{"$f":"Y4-(Z4+AA4+AB4)","v":145}]
[{"$f":"IF(B5=\"\",\"\",SUBTOTAL(3,$B$4:B5))","v":2},2,"R101",null,"حافلات VIP","حذيفه",null,null,3,6,40,null,null,null,null,null,null,2,10,85,0,0,0,0,{"$f":"(I5*K5)+(L5*N5)+(O5*Q5)+(R5*T5)+SUM(U5:X5)","v":290},20,10,30,{"$f":"Y5-(Z5+AA5+AB5)","v":230}]
[{"$f":"IF(B6=\"\",\"\",SUBTOTAL(3,$B$4:B6))","v":""},null,null,null,null,null,null,null,null,null,null,null,null,null,null,null,null,null,null,null,null,null,null,null,0,null,null,null,0]
[{"$f":"IF(B7=\"\",\"\",SUBTOTAL(3,$B$4:B7))","v":""},null,null,null,null,null,null,null,null,null,null,null,null,null,null,null,null,null,null,null,null,null,null,null,0,null,null,null,0]
[{"$f":"IF(B8=\"\",\"\",SUBTOTAL(3,$B$4:B8))","v":""},null,null,null,null,null,null,null,null,null,null,null,null,null,null,null,null,null,null,null,null,null,null,null,0,null,null,null,0]
{"$rows_left_out":686}
{"sheet":"إستدعاء برقم الفاتورة","index":55,"n_rows":24,"n_cols":6,"rows_kept":24,"cut":false,"hidden":false,"merged":[[30,1,30,2],[30,3,30,5],[5,1,5,5],[19,1,19,2],[20,1,20,4],[21,1,21,4],[22,1,22,4],[23,1,25,4],[23,5,25,5]]}
[]
[]
[]
[null,null,null,"بمجرد اختيار رقم الفاتورة من القائمة المنسدلة سوف يتم جلب بيانات الفاتورة المختارة بالمعادلات"]
[]
[]
[null,null,"فاتورة مشتريات","رقم الفاتورة ",2]
[null,"رقم الرحلة",{"$f":"IFERROR(INDEX('فواتير المشتريات الكلية'!$C$4:$C$1000,MATCH($E$7,'فواتير المشتريات الكلية'!$B$4:$B$1000,0)),\"\")","v":"R101"},null,"اسم المرشد ",{"$f":"IFERROR(IF(INDEX(البيانات!$E$2:$E$1000,MATCH($C$8,البيانات!$B$2:$B$1000,0))=\"\",\"\",INDEX(البيانات!$E$2:$E$1000,MATCH($C$8,البيانات!$B$2:$B$1000,0))),\"\")","v":"حذيفه"}]
{"$rows_left_out":16}