{"text_format":"1","workbook":"xlsx","n_sheets":3,"sheets":["التوقيت","المواد و الادوات المستعملة","التقرير"],"not_rendered":{"charts":0,"images":1,"macros":1,"external_links":0,"defined_names":2,"comments":0,"pivot_tables":0},"unopened":[],"bounds":{"document_bytes":16777216,"sheet_cells":100000,"rows_first":2000,"rows_last":500,"rows_between":2000,"halvings":0,"cell_chars":16384,"cell_head_chars":4096},"cells_cut":0,"cells_raw":0,"read":"whole","date_system":"1900"}

{"sheet":"التوقيت","index":0,"n_rows":19,"n_cols":21,"rows_kept":19,"cut":false,"hidden":false,"merged":[[2,1,2,4],[2,5,2,8],[2,9,2,12],[2,13,2,16],[2,17,2,20]]}
[]
[]
[null,"الأحد",null,null,null,"الإثنين",null,null,null,"الثلاثاء",null,null,null,"الأربعاء",null,null,null,"الخميس"]
[null,"الأستاذ","المادة ","القسم ","التوقيت ","الأستاذ","المادة ","القسم ","التوقيت ","الأستاذ","المادة ","القسم ","التوقيت ","الأستاذ","المادة ","القسم ","التوقيت ","الأستاذ","المادة ","القسم ","التوقيت "]
[null,"D","S","1ع3","12.00 - 08.00","F","S","1ع1","12.00 - 08.00","F","S","3ع ت01","12.00 - 08.00","F","S","1ع2","12.00 - 08.00","B","S","1ع4","12.00 - 08.00"]
[null,"H","P","1ع3","12.00 - 08.00","G","P","1ع1","12.00 - 08.00","H","P","3ع ت01","12.00 - 08.00","Z","P","1ع2","12.00 - 08.00","A","P","1ع4","12.00 - 08.00"]
[null,"B","S","3ع ت02","12.00 - 08.00","D","S","2ع تن03","12.00 - 08.00","L","S","2ع ت02","12.00 - 08.00","D","S","2ع ت01","12.00 - 08.00","N","P","2ت ر","12.00 - 08.00"]
[null,"N","P","3ع ت02","12.00 - 08.00","N","P","2ع ت03","12.00 - 08.00","Z","P","2ع ت02","12.00 - 08.00","A","P","2ع ت01","12.00 - 08.00","G","P","3ت ر","12.00 - 08.00"]
[null,"L","S","1ع5","17.30 - 13.30","L","S","2أف","17.30 - 15.30",null,null,null,null,null,null,null,null,"L","S","1أ2","15.30 - 13.30"]
[null,"G","P","1ع5","17.30 - 13.30","A","P","2أف","17.30 - 15.30",null,null,null,null,null,null,null,null,"Z","P","1أ2","15.30 - 13.30"]
[null,"B","S","1أ3","15.30 - 13.30","B","S","1أ1","17.30 - 15.30"]
[null,"Z","P","1أ3","15.30 - 13.30","H","P","1أ1","17.30 - 15.30"]
[]
[]
[null,null,"الأحد"]
[null,null,"الإثنين"]
[null,null,"الثلاثاء"]
[null,null,"الأربعاء"]
[null,null,"الخميس"]

{"sheet":"المواد و الادوات المستعملة","index":1,"n_rows":6,"n_cols":3,"rows_kept":6,"cut":false,"hidden":false,"merged":[]}
[]
[]
[null,"الأدوات المستعملة ","المواد المستعملة "]
[null,"مجهر ","حمض الخل"]
[null,"حاسوب","أكسيد الكبريت "]
[null,"سحاحة "]

{"sheet":"التقرير","index":2,"n_rows":40,"n_cols":13,"rows_kept":40,"cut":false,"hidden":false,"merged":[[3,1,3,3],[27,1,27,8],[28,1,28,8],[29,1,29,8],[30,1,30,8],[21,1,21,8],[22,1,22,8],[23,1,23,8],[24,1,24,8],[25,1,25,8],[26,1,26,8],[5,3,5,5],[33,1,33,8],[34,1,34,8],[35,1,35,8],[31,1,31,8],[32,1,32,8]]}
[null,null,null,null,null,null,null,null,null,null,null,null,"Report"]
[]
[]
[null,"مديرية التربية لولاية :ـــــــــــــ",null,null,null,null,null,null,"السنــة الدراسيـة"]
[null,"المؤسسة :ــــــــــــ",null,null,null,null,null,null,"200.../ 200..."]
[null,null,null,"التقرير اليومي للمخبـــري",null,null,"الرقم :"]
[null,null,null,null,"ليوم : ","الأحد","2018-11-10"]
[]
[]
[]
[]
[]
[null,"الأستاذ","المادة ","القسم ","التوقيت ","عنوان الدرس","الوسائل المستعملة","الأدوات المستعملة ","الملاحظة"]
[null,{"$f":"IFERROR(INDEX(التوقيت!$B$5:$U$12,ROWS($A$1:A1),MATCH($F$7,التوقيت!$B$3:$U$3,0)),\"\")","v":"D"},{"$f":"IFERROR(INDEX(التوقيت!$C$5:$U$12,ROWS($B$1:B1),MATCH($F$7,التوقيت!$B$3:$U$3,0)),\"\")","v":"S"},{"$f":"IFERROR(INDEX(التوقيت!$D$5:$U$12,ROWS($A$1:C1),MATCH($F$7,التوقيت!$B$3:$U$3,0)),\"\")","v":"1ع3"},{"$f":"IFERROR(INDEX(التوقيت!$E$5:$U$12,ROWS($A$1:D1),MATCH($F$7,التوقيت!$B$3:$U$3,0)),\"\")","v":"12.00 - 08.00"},null,"حمض الخل","مجهر "]
[null,{"$f":"IFERROR(INDEX(التوقيت!$B$5:$U$12,ROWS($A$1:A2),MATCH($F$7,التوقيت!$B$3:$U$3,0)),\"\")","v":"H"},{"$f":"IFERROR(INDEX(التوقيت!$C$5:$U$12,ROWS($B$1:B2),MATCH($F$7,التوقيت!$B$3:$U$3,0)),\"\")","v":"P"},{"$f":"IFERROR(INDEX(التوقيت!$D$5:$U$12,ROWS($A$1:C2),MATCH($F$7,التوقيت!$B$3:$U$3,0)),\"\")","v":"1ع3"},{"$f":"IFERROR(INDEX(التوقيت!$E$5:$U$12,ROWS($A$1:D2),MATCH($F$7,التوقيت!$B$3:$U$3,0)),\"\")","v":"12.00 - 08.00"}]
[null,{"$f":"IFERROR(INDEX(التوقيت!$B$5:$U$12,ROWS($A$1:A3),MATCH($F$7,التوقيت!$B$3:$U$3,0)),\"\")","v":"B"},{"$f":"IFERROR(INDEX(التوقيت!$C$5:$U$12,ROWS($B$1:B3),MATCH($F$7,التوقيت!$B$3:$U$3,0)),\"\")","v":"S"},{"$f":"IFERROR(INDEX(التوقيت!$D$5:$U$12,ROWS($A$1:C3),MATCH($F$7,التوقيت!$B$3:$U$3,0)),\"\")","v":"3ع ت02"},{"$f":"IFERROR(INDEX(التوقيت!$E$5:$U$12,ROWS($A$1:D3),MATCH($F$7,التوقيت!$B$3:$U$3,0)),\"\")","v":"12.00 - 08.00"}]
[null,{"$f":"IFERROR(INDEX(التوقيت!$B$5:$U$12,ROWS($A$1:A4),MATCH($F$7,التوقيت!$B$3:$U$3,0)),\"\")","v":"N"},{"$f":"IFERROR(INDEX(التوقيت!$C$5:$U$12,ROWS($B$1:B4),MATCH($F$7,التوقيت!$B$3:$U$3,0)),\"\")","v":"P"},{"$f":"IFERROR(INDEX(التوقيت!$D$5:$U$12,ROWS($A$1:C4),MATCH($F$7,التوقيت!$B$3:$U$3,0)),\"\")","v":"3ع ت02"},{"$f":"IFERROR(INDEX(التوقيت!$E$5:$U$12,ROWS($A$1:D4),MATCH($F$7,التوقيت!$B$3:$U$3,0)),\"\")","v":"12.00 - 08.00"}]
[null,{"$f":"IFERROR(INDEX(التوقيت!$B$5:$U$12,ROWS($A$1:A5),MATCH($F$7,التوقيت!$B$3:$U$3,0)),\"\")","v":"L"},{"$f":"IFERROR(INDEX(التوقيت!$C$5:$U$12,ROWS($B$1:B5),MATCH($F$7,التوقيت!$B$3:$U$3,0)),\"\")","v":"S"},{"$f":"IFERROR(INDEX(التوقيت!$D$5:$U$12,ROWS($A$1:C5),MATCH($F$7,التوقيت!$B$3:$U$3,0)),\"\")","v":"1ع5"},{"$f":"IFERROR(INDEX(التوقيت!$E$5:$U$12,ROWS($A$1:D5),MATCH($F$7,التوقيت!$B$3:$U$3,0)),\"\")","v":"17.30 - 13.30"}]
[null,{"$f":"IFERROR(INDEX(التوقيت!$B$5:$U$12,ROWS($A$1:A6),MATCH($F$7,التوقيت!$B$3:$U$3,0)),\"\")","v":"G"},{"$f":"IFERROR(INDEX(التوقيت!$C$5:$U$12,ROWS($B$1:B6),MATCH($F$7,التوقيت!$B$3:$U$3,0)),\"\")","v":"P"},{"$f":"IFERROR(INDEX(التوقيت!$D$5:$U$12,ROWS($A$1:C6),MATCH($F$7,التوقيت!$B$3:$U$3,0)),\"\")","v":"1ع5"},{"$f":"IFERROR(INDEX(التوقيت!$E$5:$U$12,ROWS($A$1:D6),MATCH($F$7,التوقيت!$B$3:$U$3,0)),\"\")","v":"17.30 - 13.30"}]
[null,{"$f":"IFERROR(INDEX(التوقيت!$B$5:$U$12,ROWS($A$1:A7),MATCH($F$7,التوقيت!$B$3:$U$3,0)),\"\")","v":"B"},{"$f":"IFERROR(INDEX(التوقيت!$C$5:$U$12,ROWS($B$1:B7),MATCH($F$7,التوقيت!$B$3:$U$3,0)),\"\")","v":"S"},{"$f":"IFERROR(INDEX(التوقيت!$D$5:$U$12,ROWS($A$1:C7),MATCH($F$7,التوقيت!$B$3:$U$3,0)),\"\")","v":"1أ3"},{"$f":"IFERROR(INDEX(التوقيت!$E$5:$U$12,ROWS($A$1:D7),MATCH($F$7,التوقيت!$B$3:$U$3,0)),\"\")","v":"15.30 - 13.30"}]
[null,{"$f":"IFERROR(INDEX(التوقيت!$B$5:$U$12,ROWS($A$1:A8),MATCH($F$7,التوقيت!$B$3:$U$3,0)),\"\")","v":"Z"},{"$f":"IFERROR(INDEX(التوقيت!$C$5:$U$12,ROWS($B$1:B8),MATCH($F$7,التوقيت!$B$3:$U$3,0)),\"\")","v":"P"},{"$f":"IFERROR(INDEX(التوقيت!$D$5:$U$12,ROWS($A$1:C8),MATCH($F$7,التوقيت!$B$3:$U$3,0)),\"\")","v":"1أ3"},{"$f":"IFERROR(INDEX(التوقيت!$E$5:$U$12,ROWS($A$1:D8),MATCH($F$7,التوقيت!$B$3:$U$3,0)),\"\")","v":"15.30 - 13.30"}]
[null,"ملاحظات عامة (حول حاجات الأساتذة – التجهيز و الوسائل الجديدة المستلمة) :"]
[null,"..............................................................................................................................................................."]
[null,"..............................................................................................................................................................."]
[null,"..............................................................................................................................................................."]
[null,"..............................................................................................................................................................."]
[null,"..............................................................................................................................................................."]
[null,"..............................................................................................................................................................."]
[null,"ملاحظات عامة (حول الاتلافات –النظافة- الصيانة- الاستغلال الأمثل للوسائل) :"]
[null,"..............................................................................................................................................................."]
[null,"..............................................................................................................................................................."]
[null,"..............................................................................................................................................................."]
[null,"..............................................................................................................................................................."]
[null,"..............................................................................................................................................................."]
[null,".............................................................................................................................................................."]
[]
[]
[null," بـ:                في :  "]
[null,"                                                                              "]
[null,"  توقيع العون                                           المقتصد                            المديـــر"]