{"text_format":"1","workbook":"xlsx","n_sheets":5,"sheets":["DATA","Room Reservation","Availability","Report in date","جرد البيتش"],"not_rendered":{"charts":0,"images":0,"macros":0,"external_links":0,"defined_names":4,"comments":1,"pivot_tables":0},"unopened":[],"bounds":{"document_bytes":16777216,"sheet_cells":100000,"rows_first":2000,"rows_last":500,"rows_between":2000,"halvings":0,"cell_chars":16384,"cell_head_chars":4096},"cells_cut":0,"cells_raw":0,"read":"whole","date_system":"1900"}

{"sheet":"DATA","index":0,"n_rows":59,"n_cols":22,"rows_kept":59,"cut":false,"hidden":false,"merged":[]}
["Agency","Nationality","Room#","ROOM","Room Type","Staus H.K Report",null,null,null,null,null,null,null,"ROOM",null,null,null,"H.K Report"]
["Sunrise","American",101,101,"S.T","TPL 3",null,null,1,"KB",null,null,3,101,{"$f":"LOOKUP(M2,$I$2:$J$6)","v":"TPL 3"},null,null,"V.D",null,null,"V.C",{"$f":"COUNTIF(R:R,U2)","v":10}]
["INDV","Australian",102,102,"S.T","TW",null,null,2,"TW",null,null,2,102,{"$f":"LOOKUP(M3,$I$2:$J$6)","v":"TW"},null,null,"V.C",null,null,"V.D",{"$f":"COUNTIF(R:R,U3)","v":1}]
["H. Use","British",103,103,"S.T","TW",null,null,3,"TPL 3",null,null,2,103,"TW",null,null,"V.C",null,null,"H.Use",3]
[null,null,104,104,"S.T","TW",null,null,4,"TPL (KB + 1)",null,null,2,104,"TW",null,null,"V.C",null,null,"O.C.C",1]
[null,null,105,105,"S.T","TW",null,null,5,"KB + 2",null,null,2,105,"TW",null,null,"V.C",null,null,"O.O.S",0]
[null,null,106,106,"S.T","TW",null,null,null,null,null,null,2,106,"TW",null,null,"V.C",null,null,"Comp",0]
[null,null,107,107,"S.T","TPL 3",null,null,null,null,null,null,3,107,"TPL 3",null,null,"V.C",null,null,null,0]
[null,null,108,108,"S.T","TPL (KB + 1)",null,null,null,null,null,null,4,108,"TPL (KB + 1)",null,null,"V.C"]
[null,null,109,109,"S.T","TW",null,null,null,null,null,null,2,109,"TW",null,null,"V.C"]
{"$rows_left_out":50}
{"sheet":"Room Reservation","index":1,"n_rows":1000,"n_cols":19,"rows_kept":1000,"cut":false,"hidden":false,"merged":[]}
["CODE","Agency","Nationality","Room#","Room Type","Agency","NAME","  DBL ","  SGL   ","TPL","CHD","INFT","PAX","Room Rate","Nationality","in","out","TOTAL NIGHT","TOTAL RATE"]
[null,{"$f":"DATA!A2","v":"Sunrise"},{"$f":"DATA!B2","v":"American"},101,{"$f":"IFERROR(LOOKUP(D2,DATA!$D$2:$E$59),\"\")","v":"S.T"},"INDV","magdey",null,1,null,null,null,{"$f":"H2*2+I2*1+J2*3","v":1},20,"Russian","2018-10-01","2018-10-12",{"$f":"Q2-P2","v":11},{"$f":"R2*N2","v":220}]
[null,{"$f":"DATA!A3","v":"INDV"},{"$f":"DATA!B3","v":"Australian"},null,null,null,null,null,null,null,null,null,null,null,null,null,null,{"$f":"Q3-P3","v":0},{"$f":"R3*N3","v":0}]
[null,{"$f":"DATA!A4","v":"H. Use"},{"$f":"DATA!B4","v":"British"},null,null,null,null,null,null,null,null,null,null,null,null,null,null,0,0]
[null,{"$f":"DATA!A5","v":0},{"$f":"DATA!B5","v":0},null,null,null,null,null,null,null,null,null,null,null,null,null,null,0,0]
[null,{"$f":"DATA!A6","v":0},{"$f":"DATA!B6","v":0},null,null,null,null,null,null,null,null,null,null,null,null,null,null,0,0]
[null,{"$f":"DATA!A7","v":0},{"$f":"DATA!B7","v":0},null,null,null,null,null,null,null,null,null,null,null,null,null,null,0,0]
[null,{"$f":"DATA!A9","v":0},{"$f":"DATA!B9","v":0},null,null,null,null,null,null,null,null,null,null,null,null,null,null,0,0]
[null,{"$f":"DATA!A10","v":0},{"$f":"DATA!B10","v":0},null,null,null,null,null,null,null,null,null,null,null,null,null,null,0,0]
[null,{"$f":"DATA!A8","v":0},{"$f":"DATA!B8","v":0},null,null,null,null,null,null,null,null,null,null,null,null,null,null,0,0]
{"$rows_left_out":991}
{"sheet":"Availability","index":2,"n_rows":65,"n_cols":22,"rows_kept":65,"cut":false,"hidden":false,"merged":[[5,0,6,0],[5,1,6,1],[5,2,6,2],[0,0,0,18],[2,15,2,16],[2,17,2,18],[2,0,2,14]]}
["VISIT EXCELTEMPLATE.NET FOR MORE TEMPLATES AND UPDATES",null,null,null,null,null,null,null,null,null,null,null,null,null,null,null,null,null,null,null,null," Available"]
[]
["HOTEL AVAILABILITY TABLE FOR PERIOD",null,null,null,null,null,null,null,null,null,null,null,null,null,null,{"$f":"C5+E5","v":"2018-10-01"},null,{"$f":"P3+14","v":"2018-10-15"},null,null,null," Occupied"]
[]
[null,"Start Date","2018-10-01",null,0,null,null,null,null,null,null,null,null,null,null,null,null,null,null,null,null," Double Reservation"]
["No","Room Type","Room Number",null,{"$f":"TEXT(WEEKDAY(E7),\"ddd\")","v":"Mon"},{"$f":"TEXT(WEEKDAY(F7),\"ddd\")","v":"Tue"},"Wed","Thu","Fri","Sat","Sun","Mon","Tue","Wed","Thu","Fri","Sat","Sun","Mon"]
[null,null,null,null,{"$f":"C5+E5","v":"2018-10-01"},{"$f":"E7+1","v":"2018-10-02"},{"$f":"F7+1","v":"2018-10-03"},"2018-10-04","2018-10-05","2018-10-06","2018-10-07","2018-10-08","2018-10-09","2018-10-10","2018-10-11","2018-10-12","2018-10-13","2018-10-14","2018-10-15"]
[1,{"$f":"DATA!E2","v":"S.T"},{"$f":"DATA!D2","v":101},null,{"$f":"IF(AND($B8<>\"\",$C8<>\"\"),1-SUMPRODUCT(('Room Reservation'!$P$1:$P$998<=E$7)*('Room Reservation'!$Q$1:$Q$998>=E$7+1)*('Room Reservation'!$E$1:$E$998=$B8)*('Room Reservation'!$D$1:$D$998=$C8)),\"\")","v":0},{"$f":"IF(AND($B8<>\"\",$C8<>\"\"),1-SUMPRODUCT(('Room Reservation'!$P$1:$P$998<=F$7)*('Room Reservation'!$Q$1:$Q$998>=F$7+1)*('Room Reservation'!$E$1:$E$998=$B8)*('Room Reservation'!$D$1:$D$998=$C8)),\"\")","v":0},{"$f":"IF(AND($B8<>\"\",$C8<>\"\"),1-SUMPRODUCT(('Room Reservation'!$P$1:$P$998<=G$7)*('Room Reservation'!$Q$1:$Q$998>=G$7+1)*('Room Reservation'!$E$1:$E$998=$B8)*('Room Reservation'!$D$1:$D$998=$C8)),\"\")","v":0},{"$f":"IF(AND($B8<>\"\",$C8<>\"\"),1-SUMPRODUCT(('Room Reservation'!$P$1:$P$998<=H$7)*('Room Reservation'!$Q$1:$Q$998>=H$7+1)*('Room Reservation'!$E$1:$E$998=$B8)*('Room Reservation'!$D$1:$D$998=$C8)),\"\")","v":0},{"$f":"IF(AND($B8<>\"\",$C8<>\"\"),1-SUMPRODUCT(('Room Reservation'!$P$1:$P$998<=I$7)*('Room Reservation'!$Q$1:$Q$998>=I$7+1)*('Room Reservation'!$E$1:$E$998=$B8)*('Room Reservation'!$D$1:$D$998=$C8)),\"\")","v":0},{"$f":"IF(AND($B8<>\"\",$C8<>\"\"),1-SUMPRODUCT(('Room Reservation'!$P$1:$P$998<=J$7)*('Room Reservation'!$Q$1:$Q$998>=J$7+1)*('Room Reservation'!$E$1:$E$998=$B8)*('Room Reservation'!$D$1:$D$998=$C8)),\"\")","v":0},{"$f":"IF(AND($B8<>\"\",$C8<>\"\"),1-SUMPRODUCT(('Room Reservation'!$P$1:$P$998<=K$7)*('Room Reservation'!$Q$1:$Q$998>=K$7+1)*('Room Reservation'!$E$1:$E$998=$B8)*('Room Reservation'!$D$1:$D$998=$C8)),\"\")","v":0},{"$f":"IF(AND($B8<>\"\",$C8<>\"\"),1-SUMPRODUCT(('Room Reservation'!$P$1:$P$998<=L$7)*('Room Reservation'!$Q$1:$Q$998>=L$7+1)*('Room Reservation'!$E$1:$E$998=$B8)*('Room Reservation'!$D$1:$D$998=$C8)),\"\")","v":0},{"$f":"IF(AND($B8<>\"\",$C8<>\"\"),1-SUMPRODUCT(('Room Reservation'!$P$1:$P$998<=M$7)*('Room Reservation'!$Q$1:$Q$998>=M$7+1)*('Room Reservation'!$E$1:$E$998=$B8)*('Room Reservation'!$D$1:$D$998=$C8)),\"\")","v":0},{"$f":"IF(AND($B8<>\"\",$C8<>\"\"),1-SUMPRODUCT(('Room Reservation'!$P$1:$P$998<=N$7)*('Room Reservation'!$Q$1:$Q$998>=N$7+1)*('Room Reservation'!$E$1:$E$998=$B8)*('Room Reservation'!$D$1:$D$998=$C8)),\"\")","v":0},{"$f":"IF(AND($B8<>\"\",$C8<>\"\"),1-SUMPRODUCT(('Room Reservation'!$P$1:$P$998<=O$7)*('Room Reservation'!$Q$1:$Q$998>=O$7+1)*('Room Reservation'!$E$1:$E$998=$B8)*('Room Reservation'!$D$1:$D$998=$C8)),\"\")","v":0},{"$f":"IF(AND($B8<>\"\",$C8<>\"\"),1-SUMPRODUCT(('Room Reservation'!$P$1:$P$998<=P$7)*('Room Reservation'!$Q$1:$Q$998>=P$7+1)*('Room Reservation'!$E$1:$E$998=$B8)*('Room Reservation'!$D$1:$D$998=$C8)),\"\")","v":1},{"$f":"IF(AND($B8<>\"\",$C8<>\"\"),1-SUMPRODUCT(('Room Reservation'!$P$1:$P$998<=Q$7)*('Room Reservation'!$Q$1:$Q$998>=Q$7+1)*('Room Reservation'!$E$1:$E$998=$B8)*('Room Reservation'!$D$1:$D$998=$C8)),\"\")","v":1},{"$f":"IF(AND($B8<>\"\",$C8<>\"\"),1-SUMPRODUCT(('Room Reservation'!$P$1:$P$998<=R$7)*('Room Reservation'!$Q$1:$Q$998>=R$7+1)*('Room Reservation'!$E$1:$E$998=$B8)*('Room Reservation'!$D$1:$D$998=$C8)),\"\")","v":1},{"$f":"IF(AND($B8<>\"\",$C8<>\"\"),1-SUMPRODUCT(('Room Reservation'!$P$1:$P$998<=S$7)*('Room Reservation'!$Q$1:$Q$998>=S$7+1)*('Room Reservation'!$E$1:$E$998=$B8)*('Room Reservation'!$D$1:$D$998=$C8)),\"\")","v":1}]
[2,{"$f":"DATA!E3","v":"S.T"},{"$f":"DATA!D3","v":102},null,{"$f":"IF(AND($B9<>\"\",$C9<>\"\"),1-SUMPRODUCT(('Room Reservation'!$P$1:$P$998<=E$7)*('Room Reservation'!$Q$1:$Q$998>=E$7+1)*('Room Reservation'!$E$1:$E$998=$B9)*('Room Reservation'!$D$1:$D$998=$C9)),\"\")","v":1},{"$f":"IF(AND($B9<>\"\",$C9<>\"\"),1-SUMPRODUCT(('Room Reservation'!$P$1:$P$998<=F$7)*('Room Reservation'!$Q$1:$Q$998>=F$7+1)*('Room Reservation'!$E$1:$E$998=$B9)*('Room Reservation'!$D$1:$D$998=$C9)),\"\")","v":1},{"$f":"IF(AND($B9<>\"\",$C9<>\"\"),1-SUMPRODUCT(('Room Reservation'!$P$1:$P$998<=G$7)*('Room Reservation'!$Q$1:$Q$998>=G$7+1)*('Room Reservation'!$E$1:$E$998=$B9)*('Room Reservation'!$D$1:$D$998=$C9)),\"\")","v":1},{"$f":"IF(AND($B9<>\"\",$C9<>\"\"),1-SUMPRODUCT(('Room Reservation'!$P$1:$P$998<=H$7)*('Room Reservation'!$Q$1:$Q$998>=H$7+1)*('Room Reservation'!$E$1:$E$998=$B9)*('Room Reservation'!$D$1:$D$998=$C9)),\"\")","v":1},{"$f":"IF(AND($B9<>\"\",$C9<>\"\"),1-SUMPRODUCT(('Room Reservation'!$P$1:$P$998<=I$7)*('Room Reservation'!$Q$1:$Q$998>=I$7+1)*('Room Reservation'!$E$1:$E$998=$B9)*('Room Reservation'!$D$1:$D$998=$C9)),\"\")","v":1},{"$f":"IF(AND($B9<>\"\",$C9<>\"\"),1-SUMPRODUCT(('Room Reservation'!$P$1:$P$998<=J$7)*('Room Reservation'!$Q$1:$Q$998>=J$7+1)*('Room Reservation'!$E$1:$E$998=$B9)*('Room Reservation'!$D$1:$D$998=$C9)),\"\")","v":1},{"$f":"IF(AND($B9<>\"\",$C9<>\"\"),1-SUMPRODUCT(('Room Reservation'!$P$1:$P$998<=K$7)*('Room Reservation'!$Q$1:$Q$998>=K$7+1)*('Room Reservation'!$E$1:$E$998=$B9)*('Room Reservation'!$D$1:$D$998=$C9)),\"\")","v":1},{"$f":"IF(AND($B9<>\"\",$C9<>\"\"),1-SUMPRODUCT(('Room Reservation'!$P$1:$P$998<=L$7)*('Room Reservation'!$Q$1:$Q$998>=L$7+1)*('Room Reservation'!$E$1:$E$998=$B9)*('Room Reservation'!$D$1:$D$998=$C9)),\"\")","v":1},{"$f":"IF(AND($B9<>\"\",$C9<>\"\"),1-SUMPRODUCT(('Room Reservation'!$P$1:$P$998<=M$7)*('Room Reservation'!$Q$1:$Q$998>=M$7+1)*('Room Reservation'!$E$1:$E$998=$B9)*('Room Reservation'!$D$1:$D$998=$C9)),\"\")","v":1},{"$f":"IF(AND($B9<>\"\",$C9<>\"\"),1-SUMPRODUCT(('Room Reservation'!$P$1:$P$998<=N$7)*('Room Reservation'!$Q$1:$Q$998>=N$7+1)*('Room Reservation'!$E$1:$E$998=$B9)*('Room Reservation'!$D$1:$D$998=$C9)),\"\")","v":1},{"$f":"IF(AND($B9<>\"\",$C9<>\"\"),1-SUMPRODUCT(('Room Reservation'!$P$1:$P$998<=O$7)*('Room Reservation'!$Q$1:$Q$998>=O$7+1)*('Room Reservation'!$E$1:$E$998=$B9)*('Room Reservation'!$D$1:$D$998=$C9)),\"\")","v":1},{"$f":"IF(AND($B9<>\"\",$C9<>\"\"),1-SUMPRODUCT(('Room Reservation'!$P$1:$P$998<=P$7)*('Room Reservation'!$Q$1:$Q$998>=P$7+1)*('Room Reservation'!$E$1:$E$998=$B9)*('Room Reservation'!$D$1:$D$998=$C9)),\"\")","v":1},{"$f":"IF(AND($B9<>\"\",$C9<>\"\"),1-SUMPRODUCT(('Room Reservation'!$P$1:$P$998<=Q$7)*('Room Reservation'!$Q$1:$Q$998>=Q$7+1)*('Room Reservation'!$E$1:$E$998=$B9)*('Room Reservation'!$D$1:$D$998=$C9)),\"\")","v":1},{"$f":"IF(AND($B9<>\"\",$C9<>\"\"),1-SUMPRODUCT(('Room Reservation'!$P$1:$P$998<=R$7)*('Room Reservation'!$Q$1:$Q$998>=R$7+1)*('Room Reservation'!$E$1:$E$998=$B9)*('Room Reservation'!$D$1:$D$998=$C9)),\"\")","v":1},{"$f":"IF(AND($B9<>\"\",$C9<>\"\"),1-SUMPRODUCT(('Room Reservation'!$P$1:$P$998<=S$7)*('Room Reservation'!$Q$1:$Q$998>=S$7+1)*('Room Reservation'!$E$1:$E$998=$B9)*('Room Reservation'!$D$1:$D$998=$C9)),\"\")","v":1}]
[3,{"$f":"DATA!E4","v":"S.T"},{"$f":"DATA!D4","v":103},null,{"$f":"IF(AND($B10<>\"\",$C10<>\"\"),1-SUMPRODUCT(('Room Reservation'!$P$1:$P$998<=E$7)*('Room Reservation'!$Q$1:$Q$998>=E$7+1)*('Room Reservation'!$E$1:$E$998=$B10)*('Room Reservation'!$D$1:$D$998=$C10)),\"\")","v":1},{"$f":"IF(AND($B10<>\"\",$C10<>\"\"),1-SUMPRODUCT(('Room Reservation'!$P$1:$P$998<=F$7)*('Room Reservation'!$Q$1:$Q$998>=F$7+1)*('Room Reservation'!$E$1:$E$998=$B10)*('Room Reservation'!$D$1:$D$998=$C10)),\"\")","v":1},{"$f":"IF(AND($B10<>\"\",$C10<>\"\"),1-SUMPRODUCT(('Room Reservation'!$P$1:$P$998<=G$7)*('Room Reservation'!$Q$1:$Q$998>=G$7+1)*('Room Reservation'!$E$1:$E$998=$B10)*('Room Reservation'!$D$1:$D$998=$C10)),\"\")","v":1},{"$f":"IF(AND($B10<>\"\",$C10<>\"\"),1-SUMPRODUCT(('Room Reservation'!$P$1:$P$998<=H$7)*('Room Reservation'!$Q$1:$Q$998>=H$7+1)*('Room Reservation'!$E$1:$E$998=$B10)*('Room Reservation'!$D$1:$D$998=$C10)),\"\")","v":1},{"$f":"IF(AND($B10<>\"\",$C10<>\"\"),1-SUMPRODUCT(('Room Reservation'!$P$1:$P$998<=I$7)*('Room Reservation'!$Q$1:$Q$998>=I$7+1)*('Room Reservation'!$E$1:$E$998=$B10)*('Room Reservation'!$D$1:$D$998=$C10)),\"\")","v":1},{"$f":"IF(AND($B10<>\"\",$C10<>\"\"),1-SUMPRODUCT(('Room Reservation'!$P$1:$P$998<=J$7)*('Room Reservation'!$Q$1:$Q$998>=J$7+1)*('Room Reservation'!$E$1:$E$998=$B10)*('Room Reservation'!$D$1:$D$998=$C10)),\"\")","v":1},{"$f":"IF(AND($B10<>\"\",$C10<>\"\"),1-SUMPRODUCT(('Room Reservation'!$P$1:$P$998<=K$7)*('Room Reservation'!$Q$1:$Q$998>=K$7+1)*('Room Reservation'!$E$1:$E$998=$B10)*('Room Reservation'!$D$1:$D$998=$C10)),\"\")","v":1},{"$f":"IF(AND($B10<>\"\",$C10<>\"\"),1-SUMPRODUCT(('Room Reservation'!$P$1:$P$998<=L$7)*('Room Reservation'!$Q$1:$Q$998>=L$7+1)*('Room Reservation'!$E$1:$E$998=$B10)*('Room Reservation'!$D$1:$D$998=$C10)),\"\")","v":1},{"$f":"IF(AND($B10<>\"\",$C10<>\"\"),1-SUMPRODUCT(('Room Reservation'!$P$1:$P$998<=M$7)*('Room Reservation'!$Q$1:$Q$998>=M$7+1)*('Room Reservation'!$E$1:$E$998=$B10)*('Room Reservation'!$D$1:$D$998=$C10)),\"\")","v":1},{"$f":"IF(AND($B10<>\"\",$C10<>\"\"),1-SUMPRODUCT(('Room Reservation'!$P$1:$P$998<=N$7)*('Room Reservation'!$Q$1:$Q$998>=N$7+1)*('Room Reservation'!$E$1:$E$998=$B10)*('Room Reservation'!$D$1:$D$998=$C10)),\"\")","v":1},{"$f":"IF(AND($B10<>\"\",$C10<>\"\"),1-SUMPRODUCT(('Room Reservation'!$P$1:$P$998<=O$7)*('Room Reservation'!$Q$1:$Q$998>=O$7+1)*('Room Reservation'!$E$1:$E$998=$B10)*('Room Reservation'!$D$1:$D$998=$C10)),\"\")","v":1},{"$f":"IF(AND($B10<>\"\",$C10<>\"\"),1-SUMPRODUCT(('Room Reservation'!$P$1:$P$998<=P$7)*('Room Reservation'!$Q$1:$Q$998>=P$7+1)*('Room Reservation'!$E$1:$E$998=$B10)*('Room Reservation'!$D$1:$D$998=$C10)),\"\")","v":1},{"$f":"IF(AND($B10<>\"\",$C10<>\"\"),1-SUMPRODUCT(('Room Reservation'!$P$1:$P$998<=Q$7)*('Room Reservation'!$Q$1:$Q$998>=Q$7+1)*('Room Reservation'!$E$1:$E$998=$B10)*('Room Reservation'!$D$1:$D$998=$C10)),\"\")","v":1},{"$f":"IF(AND($B10<>\"\",$C10<>\"\"),1-SUMPRODUCT(('Room Reservation'!$P$1:$P$998<=R$7)*('Room Reservation'!$Q$1:$Q$998>=R$7+1)*('Room Reservation'!$E$1:$E$998=$B10)*('Room Reservation'!$D$1:$D$998=$C10)),\"\")","v":1},{"$f":"IF(AND($B10<>\"\",$C10<>\"\"),1-SUMPRODUCT(('Room Reservation'!$P$1:$P$998<=S$7)*('Room Reservation'!$Q$1:$Q$998>=S$7+1)*('Room Reservation'!$E$1:$E$998=$B10)*('Room Reservation'!$D$1:$D$998=$C10)),\"\")","v":1}]
{"$rows_left_out":56}
{"sheet":"Report in date","index":3,"n_rows":4,"n_cols":16,"rows_kept":4,"cut":false,"hidden":false,"merged":[[0,1,0,5],[0,7,0,8]]}
[null,"Report today",null,null,null,null,"Date",{"$f":"TODAY()","v":"2018-10-29"}]
["Room No",101,102,103,104,105,106,107,108,109,110,111,112,113,114,115]
["H.K Report",{"$f":"DATA!$R2","v":"V.D"},{"$f":"DATA!$R3","v":"V.C"},{"$f":"DATA!$R4","v":"V.C"},{"$f":"DATA!$R5","v":"V.C"},{"$f":"DATA!$R6","v":"V.C"},{"$f":"DATA!$R7","v":"V.C"},{"$f":"DATA!$R8","v":"V.C"},{"$f":"DATA!$R9","v":"V.C"},{"$f":"DATA!$R10","v":"V.C"},{"$f":"DATA!$R11","v":"V.C"},{"$f":"DATA!$R12","v":"V.C"},{"$f":"DATA!$R13","v":"H.Use"},{"$f":"DATA!$R14","v":"H.Use"},{"$f":"DATA!$R15","v":"O.C.C"},{"$f":"DATA!$R16","v":"H.Use"}]
["Name"]

{"sheet":"جرد البيتش","index":4,"n_rows":11,"n_cols":8,"rows_kept":11,"cut":false,"hidden":false,"merged":[]}
["جرد البيتش : 27-10-2018"]
["الصنف","الكميه :27-10-2018",null,null,null,null,null,"الرصيد"]
["استله",1,null,null,null,null,null,{"$f":"B3-(C3-D3-E3-F3-G3)","v":1}]
["هنكيل",2,null,null,null,null,null,{"$f":"B4-(C4-D4-E4-F4-G4)","v":2}]
["كنز",12,null,null,null,null,null,12]
["عصير",11,null,null,null,null,null,11]
["صندوق معسل تفاح",1,null,null,null,null,null,1]
["صندوق معسل عنب",1,null,null,null,null,null,1]
["صندوق معسل ليمون",1,null,null,null,null,null,1]
["علبة فحم سريع",0.5,null,null,null,null,null,0.5]
{"$rows_left_out":1}