{"text_format":"1","workbook":"xlsx","n_sheets":5,"sheets":["Year_month","vacance","قائمة الموظفين","أنواع الإجازات","عطلات الشركة"],"not_rendered":{"charts":0,"images":1,"macros":1,"external_links":1,"defined_names":10,"comments":0,"pivot_tables":0},"unopened":[],"bounds":{"document_bytes":16777216,"sheet_cells":100000,"rows_first":2000,"rows_last":500,"rows_between":2000,"halvings":0,"cell_chars":16384,"cell_head_chars":4096},"cells_cut":0,"cells_raw":0,"read":"whole","date_system":"1900"}

{"sheet":"Year_month","index":0,"n_rows":36,"n_cols":34,"rows_kept":36,"cut":false,"hidden":false,"merged":[[35,13,35,15],[35,18,35,20],[35,23,35,25],[35,28,35,30],[35,33,35,35],[34,13,34,15],[34,18,34,20],[34,23,34,25],[34,28,34,30],[34,33,34,35],[33,13,33,15],[33,18,33,20],[33,23,33,25],[33,28,33,30],[33,33,33,35],[30,28,30,30],[30,33,30,35],[32,13,32,15],[32,18,32,20],[32,23,32,25],[32,28,32,30],[32,33,32,35],[30,2,30,4],[30,7,30,10],[30,13,30,15],[30,18,30,20],[30,23,30,25],[29,28,29,30],[29,33,29,35],[28,2,28,4],[28,7,28,10],[28,13,28,15],[28,18,28,20],[28,23,28,25],[29,2,29,4],[29,7,29,10],[29,13,29,15],[29,18,29,20],[29,23,29,25],[27,18,27,20],[27,23,27,25],[27,28,27,30],[27,33,27,35],[28,28,28,30],[28,33,28,35],[1,2,1,6],[2,4,2,6],[27,2,27,4],[27,7,27,10],[27,13,27,15]]}
[null,"سجل حضور الموظف"]
[null,"حدد موظفاً:","الموظف 1",null,null,null,null,"Day1","Day2"]
[null,"أدخل الشهر و السنة:","Year",2018,1,null,null,"السّبت","الأحد"]
[]
[]
[null,null,"الإثنين","الثلاثاء","الأربعاء","الخميس","الجمعة","الإثنين","الثلاثاء","الأربعاء","الخميس","الجمعة","الإثنين","الثلاثاء","الأربعاء","الخميس","الجمعة","الإثنين","الثلاثاء","الأربعاء","الخميس","الجمعة","الإثنين","الثلاثاء","الأربعاء"]
[null,null,"2018-01-01","2018-01-02","2018-01-03","2018-01-04","2018-01-05","2018-01-08","2018-01-09","2018-01-10","2018-01-11","2018-01-12","2018-01-15","2018-01-16","2018-01-17","2018-01-18","2018-01-19","2018-01-22","2018-01-23","2018-01-24","2018-01-25","2018-01-26","2018-01-29","2018-01-30","2018-01-31"]
["يناير",1,{"$f":"IFERROR(IF(B8<>$E$3,\"\",INDEX(vacance!$E$4:$E$26,MATCH(1,($C$2=vacance!$B$4:$B$26)*($C$7>=vacance!$C$4:$C$26)*($C$7<=vacance!$D$4:$D$26),0))),\"\")","v":""},{"$f":"IFERROR(IF(B8<>$E$3,\"\",INDEX(vacance!$E$4:$E$26,MATCH(1,($C$2=vacance!$B$4:$B$26)*($D$7>=vacance!$C$4:$C$26)*($D$7<=vacance!$D$4:$D$26),0))),\"\")","v":""},{"$f":"IFERROR(IF(B8<>$E$3,\"\",INDEX(vacance!$E$4:$E$26,MATCH(1,($C$2=vacance!$B$4:$B$26)*($E$7>=vacance!$C$4:$C$26)*($E$7<=vacance!$D$4:$D$26),0))),\"\")","v":"إجازة مرضية"},{"$f":"IFERROR(IF(B8<>$E$3,\"\",INDEX(vacance!$E$4:$E$26,MATCH(1,($C$2=vacance!$B$4:$B$26)*($F$7>=vacance!$C$4:$C$26)*($F$7<=vacance!$D$4:$D$26),0))),\"\")","v":""},{"$f":"IFERROR(IF(B8<>$E$3,\"\",INDEX(vacance!$E$4:$E$26,MATCH(1,($G$2=vacance!$B$4:$B$26)*($C$7>=vacance!$C$4:$C$26)*($G$7<=vacance!$D$4:$D$26),0))),\"\")","v":""},{"$f":"IFERROR(IF(B8<>$E$3,\"\",INDEX(vacance!$E$4:$E$26,MATCH(1,($C$2=vacance!$B$4:$B$26)*($H$7>=vacance!$C$4:$C$26)*($H$7<=vacance!$D$4:$D$26),0))),\"\")","v":""},{"$f":"IFERROR(IF(B8<>$E$3,\"\",INDEX(vacance!$E$4:$E$26,MATCH(1,($C$2=vacance!$B$4:$B$26)*($I$7>=vacance!$C$4:$C$26)*($I$7<=vacance!$D$4:$D$26),0))),\"\")","v":""},{"$f":"IFERROR(IF(B8<>$E$3,\"\",INDEX(vacance!$E$4:$E$26,MATCH(1,($C$2=vacance!$B$4:$B$26)*($J$7>=vacance!$C$4:$C$26)*($J$7<=vacance!$D$4:$D$26),0))),\"\")","v":""},{"$f":"IFERROR(IF(B8<>$E$3,\"\",INDEX(vacance!$E$4:$E$26,MATCH(1,($C$2=vacance!$B$4:$B$26)*($K$7>=vacance!$C$4:$C$26)*($K$7<=vacance!$D$4:$D$26),0))),\"\")","v":""},{"$f":"IFERROR(IF(B8<>$E$3,\"\",INDEX(vacance!$E$4:$E$26,MATCH(1,($C$2=vacance!$B$4:$B$26)*($L$7>=vacance!$C$4:$C$26)*($L$7<=vacance!$D$4:$D$26),0))),\"\")","v":""},{"$f":"IFERROR(IF(B8<>$E$3,\"\",INDEX(vacance!$E$4:$E$26,MATCH(1,($C$2=vacance!$B$4:$B$26)*($M$7>=vacance!$C$4:$C$26)*($M$7<=vacance!$D$4:$D$26),0))),\"\")","v":""},{"$f":"IFERROR(IF(B8<>$E$3,\"\",INDEX(vacance!$E$4:$E$26,MATCH(1,($C$2=vacance!$B$4:$B$26)*($N$7>=vacance!$C$4:$C$26)*($N$7<=vacance!$D$4:$D$26),0))),\"\")","v":""},{"$f":"IFERROR(IF(B8<>$E$3,\"\",INDEX(vacance!$E$4:$E$26,MATCH(1,($C$2=vacance!$B$4:$B$26)*($O$7>=vacance!$C$4:$C$26)*($O$7<=vacance!$D$4:$D$26),0))),\"\")","v":""},{"$f":"IFERROR(IF(B8<>$E$3,\"\",INDEX(vacance!$E$4:$E$26,MATCH(1,($C$2=vacance!$B$4:$B$26)*($P$7>=vacance!$C$4:$C$26)*($P$7<=vacance!$D$4:$D$26),0))),\"\")","v":""},{"$f":"IFERROR(IF(B8<>$E$3,\"\",INDEX(vacance!$E$4:$E$26,MATCH(1,($C$2=vacance!$B$4:$B$26)*($Q$7>=vacance!$C$4:$C$26)*($Q$7<=vacance!$D$4:$D$26),0))),\"\")","v":""},{"$f":"IFERROR(IF(B8<>$E$3,\"\",INDEX(vacance!$E$4:$E$26,MATCH(1,($C$2=vacance!$B$4:$B$26)*($R$7>=vacance!$C$4:$C$26)*($R$7<=vacance!$D$4:$D$26),0))),\"\")","v":""},{"$f":"IFERROR(IF(B8<>$E$3,\"\",INDEX(vacance!$E$4:$E$26,MATCH(1,($C$2=vacance!$B$4:$B$26)*($S$7>=vacance!$C$4:$C$26)*($S$7<=vacance!$D$4:$D$26),0))),\"\")","v":""},{"$f":"IFERROR(IF(B8<>$E$3,\"\",INDEX(vacance!$E$4:$E$26,MATCH(1,($C$2=vacance!$B$4:$B$26)*($T$7>=vacance!$C$4:$C$26)*($T$7<=vacance!$D$4:$D$26),0))),\"\")","v":""},{"$f":"IFERROR(IF(B8<>$E$3,\"\",INDEX(vacance!$E$4:$E$26,MATCH(1,($C$2=vacance!$B$4:$B$26)*($U$7>=vacance!$C$4:$C$26)*($U$7<=vacance!$D$4:$D$26),0))),\"\")","v":""},{"$f":"IFERROR(IF(B8<>$E$3,\"\",INDEX(vacance!$E$4:$E$26,MATCH(1,($C$2=vacance!$B$4:$B$26)*($V$7>=vacance!$C$4:$C$26)*($V$7<=vacance!$D$4:$D$26),0))),\"\")","v":""},{"$f":"IFERROR(IF(B8<>$E$3,\"\",INDEX(vacance!$E$4:$E$26,MATCH(1,($C$2=vacance!$B$4:$B$26)*($W$7>=vacance!$C$4:$C$26)*($W$7<=vacance!$D$4:$D$26),0))),\"\")","v":""},{"$f":"IFERROR(IF(B8<>$E$3,\"\",INDEX(vacance!$E$4:$E$26,MATCH(1,($C$2=vacance!$B$4:$B$26)*($X$7>=vacance!$C$4:$C$26)*($X$7<=vacance!$D$4:$D$26),0))),\"\")","v":""},{"$f":"IFERROR(IF(B8<>$E$3,\"\",INDEX(vacance!$E$4:$E$26,MATCH(1,($C$2=vacance!$B$4:$B$26)*($Y$7>=vacance!$C$4:$C$26)*($Y$7<=vacance!$D$4:$D$26),0))),\"\")","v":"حداد"},{"$f":"IFERROR(IF(B8<>$E$3,\"\",INDEX(vacance!$E$4:$E$26,MATCH(1,($C$2=vacance!$B$4:$B$26)*($Z$7>=vacance!$C$4:$C$26)*($Z$7<=vacance!$D$4:$D$26),0))),\"\")","v":""},{"$f":"IFERROR(IF(B8<>$E$3,\"\",INDEX(vacance!$E$4:$E$26,MATCH(1,($C$2=vacance!$B$4:$B$26)*($AA$7>=vacance!$C$4:$C$26)*($AA$7<=vacance!$D$4:$D$26),0))),\"\")","v":""},{"$f":"IFERROR(IF(B8<>$E$3,\"\",INDEX(vacance!$E$4:$E$26,MATCH(1,($C$2=vacance!$B$4:$B$26)*($AB$7>=vacance!$C$4:$C$26)*($AB$7<=vacance!$D$4:$D$26),0))),\"\")","v":""},{"$f":"IFERROR(IF(B8<>$E$3,\"\",INDEX(vacance!$E$4:$E$26,MATCH(1,($C$2=vacance!$B$4:$B$26)*($AC$7>=vacance!$C$4:$C$26)*($AC$7<=vacance!$D$4:$D$26),0))),\"\")","v":""},{"$f":"IFERROR(IF(B8<>$E$3,\"\",INDEX(vacance!$E$4:$E$26,MATCH(1,($C$2=vacance!$B$4:$B$26)*($AD$7>=vacance!$C$4:$C$26)*($AD$7<=vacance!$D$4:$D$26),0))),\"\")","v":""},{"$f":"IFERROR(IF(B8<>$E$3,\"\",INDEX(vacance!$E$4:$E$26,MATCH(1,($C$2=vacance!$B$4:$B$26)*($AE$7>=vacance!$C$4:$C$26)*($AE$7<=vacance!$D$4:$D$26),0))),\"\")","v":""},{"$f":"IFERROR(IF(B8<>$E$3,\"\",INDEX(vacance!$E$4:$E$26,MATCH(1,($C$2=vacance!$B$4:$B$26)*($AF$7>=vacance!$C$4:$C$26)*($AF$7<=vacance!$D$4:$D$26),0))),\"\")","v":""},{"$f":"IFERROR(IF(B8<>$E$3,\"\",INDEX(vacance!$E$4:$E$26,MATCH(1,($C$2=vacance!$B$4:$B$26)*($AG$7>=vacance!$C$4:$C$26)*($AG$7<=vacance!$D$4:$D$26),0))),\"\")","v":""}]
["فبراير",2,{"$f":"IFERROR(IF(B9<>$E$3,\"\",INDEX(vacance!$E$4:$E$26,MATCH(1,($C$2=vacance!$B$4:$B$26)*($C$7>=vacance!$C$4:$C$26)*($C$7<=vacance!$D$4:$D$26),0))),\"\")","v":""},{"$f":"IFERROR(IF(B9<>$E$3,\"\",INDEX(vacance!$E$4:$E$26,MATCH(1,($C$2=vacance!$B$4:$B$26)*($D$7>=vacance!$C$4:$C$26)*($D$7<=vacance!$D$4:$D$26),0))),\"\")","v":""},{"$f":"IFERROR(IF(B9<>$E$3,\"\",INDEX(vacance!$E$4:$E$26,MATCH(1,($C$2=vacance!$B$4:$B$26)*($E$7>=vacance!$C$4:$C$26)*($E$7<=vacance!$D$4:$D$26),0))),\"\")","v":""},{"$f":"IFERROR(IF(B9<>$E$3,\"\",INDEX(vacance!$E$4:$E$26,MATCH(1,($C$2=vacance!$B$4:$B$26)*($F$7>=vacance!$C$4:$C$26)*($F$7<=vacance!$D$4:$D$26),0))),\"\")","v":""},{"$f":"IFERROR(IF(B9<>$E$3,\"\",INDEX(vacance!$E$4:$E$26,MATCH(1,($G$2=vacance!$B$4:$B$26)*($C$7>=vacance!$C$4:$C$26)*($G$7<=vacance!$D$4:$D$26),0))),\"\")","v":""},{"$f":"IFERROR(IF(B9<>$E$3,\"\",INDEX(vacance!$E$4:$E$26,MATCH(1,($C$2=vacance!$B$4:$B$26)*($H$7>=vacance!$C$4:$C$26)*($H$7<=vacance!$D$4:$D$26),0))),\"\")","v":""},{"$f":"IFERROR(IF(B9<>$E$3,\"\",INDEX(vacance!$E$4:$E$26,MATCH(1,($C$2=vacance!$B$4:$B$26)*($I$7>=vacance!$C$4:$C$26)*($I$7<=vacance!$D$4:$D$26),0))),\"\")","v":""},{"$f":"IFERROR(IF(B9<>$E$3,\"\",INDEX(vacance!$E$4:$E$26,MATCH(1,($C$2=vacance!$B$4:$B$26)*($J$7>=vacance!$C$4:$C$26)*($J$7<=vacance!$D$4:$D$26),0))),\"\")","v":""},{"$f":"IFERROR(IF(B9<>$E$3,\"\",INDEX(vacance!$E$4:$E$26,MATCH(1,($C$2=vacance!$B$4:$B$26)*($K$7>=vacance!$C$4:$C$26)*($K$7<=vacance!$D$4:$D$26),0))),\"\")","v":""},{"$f":"IFERROR(IF(B9<>$E$3,\"\",INDEX(vacance!$E$4:$E$26,MATCH(1,($C$2=vacance!$B$4:$B$26)*($L$7>=vacance!$C$4:$C$26)*($L$7<=vacance!$D$4:$D$26),0))),\"\")","v":""},{"$f":"IFERROR(IF(B9<>$E$3,\"\",INDEX(vacance!$E$4:$E$26,MATCH(1,($C$2=vacance!$B$4:$B$26)*($M$7>=vacance!$C$4:$C$26)*($M$7<=vacance!$D$4:$D$26),0))),\"\")","v":""},{"$f":"IFERROR(IF(B9<>$E$3,\"\",INDEX(vacance!$E$4:$E$26,MATCH(1,($C$2=vacance!$B$4:$B$26)*($N$7>=vacance!$C$4:$C$26)*($N$7<=vacance!$D$4:$D$26),0))),\"\")","v":""},{"$f":"IFERROR(IF(B9<>$E$3,\"\",INDEX(vacance!$E$4:$E$26,MATCH(1,($C$2=vacance!$B$4:$B$26)*($O$7>=vacance!$C$4:$C$26)*($O$7<=vacance!$D$4:$D$26),0))),\"\")","v":""},{"$f":"IFERROR(IF(B9<>$E$3,\"\",INDEX(vacance!$E$4:$E$26,MATCH(1,($C$2=vacance!$B$4:$B$26)*($P$7>=vacance!$C$4:$C$26)*($P$7<=vacance!$D$4:$D$26),0))),\"\")","v":""},{"$f":"IFERROR(IF(B9<>$E$3,\"\",INDEX(vacance!$E$4:$E$26,MATCH(1,($C$2=vacance!$B$4:$B$26)*($Q$7>=vacance!$C$4:$C$26)*($Q$7<=vacance!$D$4:$D$26),0))),\"\")","v":""},{"$f":"IFERROR(IF(B9<>$E$3,\"\",INDEX(vacance!$E$4:$E$26,MATCH(1,($C$2=vacance!$B$4:$B$26)*($R$7>=vacance!$C$4:$C$26)*($R$7<=vacance!$D$4:$D$26),0))),\"\")","v":""},{"$f":"IFERROR(IF(B9<>$E$3,\"\",INDEX(vacance!$E$4:$E$26,MATCH(1,($C$2=vacance!$B$4:$B$26)*($S$7>=vacance!$C$4:$C$26)*($S$7<=vacance!$D$4:$D$26),0))),\"\")","v":""},{"$f":"IFERROR(IF(B9<>$E$3,\"\",INDEX(vacance!$E$4:$E$26,MATCH(1,($C$2=vacance!$B$4:$B$26)*($T$7>=vacance!$C$4:$C$26)*($T$7<=vacance!$D$4:$D$26),0))),\"\")","v":""},{"$f":"IFERROR(IF(B9<>$E$3,\"\",INDEX(vacance!$E$4:$E$26,MATCH(1,($C$2=vacance!$B$4:$B$26)*($U$7>=vacance!$C$4:$C$26)*($U$7<=vacance!$D$4:$D$26),0))),\"\")","v":""},{"$f":"IFERROR(IF(B9<>$E$3,\"\",INDEX(vacance!$E$4:$E$26,MATCH(1,($C$2=vacance!$B$4:$B$26)*($V$7>=vacance!$C$4:$C$26)*($V$7<=vacance!$D$4:$D$26),0))),\"\")","v":""},{"$f":"IFERROR(IF(B9<>$E$3,\"\",INDEX(vacance!$E$4:$E$26,MATCH(1,($C$2=vacance!$B$4:$B$26)*($W$7>=vacance!$C$4:$C$26)*($W$7<=vacance!$D$4:$D$26),0))),\"\")","v":""},{"$f":"IFERROR(IF(B9<>$E$3,\"\",INDEX(vacance!$E$4:$E$26,MATCH(1,($C$2=vacance!$B$4:$B$26)*($X$7>=vacance!$C$4:$C$26)*($X$7<=vacance!$D$4:$D$26),0))),\"\")","v":""},{"$f":"IFERROR(IF(B9<>$E$3,\"\",INDEX(vacance!$E$4:$E$26,MATCH(1,($C$2=vacance!$B$4:$B$26)*($Y$7>=vacance!$C$4:$C$26)*($Y$7<=vacance!$D$4:$D$26),0))),\"\")","v":""},{"$f":"IFERROR(IF(B9<>$E$3,\"\",INDEX(vacance!$E$4:$E$26,MATCH(1,($C$2=vacance!$B$4:$B$26)*($Z$7>=vacance!$C$4:$C$26)*($Z$7<=vacance!$D$4:$D$26),0))),\"\")","v":""},{"$f":"IFERROR(IF(B9<>$E$3,\"\",INDEX(vacance!$E$4:$E$26,MATCH(1,($C$2=vacance!$B$4:$B$26)*($AA$7>=vacance!$C$4:$C$26)*($AA$7<=vacance!$D$4:$D$26),0))),\"\")","v":""},{"$f":"IFERROR(IF(B9<>$E$3,\"\",INDEX(vacance!$E$4:$E$26,MATCH(1,($C$2=vacance!$B$4:$B$26)*($AB$7>=vacance!$C$4:$C$26)*($AB$7<=vacance!$D$4:$D$26),0))),\"\")","v":""},{"$f":"IFERROR(IF(B9<>$E$3,\"\",INDEX(vacance!$E$4:$E$26,MATCH(1,($C$2=vacance!$B$4:$B$26)*($AC$7>=vacance!$C$4:$C$26)*($AC$7<=vacance!$D$4:$D$26),0))),\"\")","v":""},{"$f":"IFERROR(IF(B9<>$E$3,\"\",INDEX(vacance!$E$4:$E$26,MATCH(1,($C$2=vacance!$B$4:$B$26)*($AD$7>=vacance!$C$4:$C$26)*($AD$7<=vacance!$D$4:$D$26),0))),\"\")","v":""},{"$f":"IFERROR(IF(B9<>$E$3,\"\",INDEX(vacance!$E$4:$E$26,MATCH(1,($C$2=vacance!$B$4:$B$26)*($AE$7>=vacance!$C$4:$C$26)*($AE$7<=vacance!$D$4:$D$26),0))),\"\")","v":""},{"$f":"IFERROR(IF(B9<>$E$3,\"\",INDEX(vacance!$E$4:$E$26,MATCH(1,($C$2=vacance!$B$4:$B$26)*($AF$7>=vacance!$C$4:$C$26)*($AF$7<=vacance!$D$4:$D$26),0))),\"\")","v":""},{"$f":"IFERROR(IF(B9<>$E$3,\"\",INDEX(vacance!$E$4:$E$26,MATCH(1,($C$2=vacance!$B$4:$B$26)*($AG$7>=vacance!$C$4:$C$26)*($AG$7<=vacance!$D$4:$D$26),0))),\"\")","v":""}]
["مارس",3,{"$f":"IFERROR(IF(B10<>$E$3,\"\",INDEX(vacance!$E$4:$E$26,MATCH(1,($C$2=vacance!$B$4:$B$26)*($C$7>=vacance!$C$4:$C$26)*($C$7<=vacance!$D$4:$D$26),0))),\"\")","v":""},{"$f":"IFERROR(IF(B10<>$E$3,\"\",INDEX(vacance!$E$4:$E$26,MATCH(1,($C$2=vacance!$B$4:$B$26)*($D$7>=vacance!$C$4:$C$26)*($D$7<=vacance!$D$4:$D$26),0))),\"\")","v":""},{"$f":"IFERROR(IF(B10<>$E$3,\"\",INDEX(vacance!$E$4:$E$26,MATCH(1,($C$2=vacance!$B$4:$B$26)*($E$7>=vacance!$C$4:$C$26)*($E$7<=vacance!$D$4:$D$26),0))),\"\")","v":""},{"$f":"IFERROR(IF(B10<>$E$3,\"\",INDEX(vacance!$E$4:$E$26,MATCH(1,($C$2=vacance!$B$4:$B$26)*($F$7>=vacance!$C$4:$C$26)*($F$7<=vacance!$D$4:$D$26),0))),\"\")","v":""},{"$f":"IFERROR(IF(B10<>$E$3,\"\",INDEX(vacance!$E$4:$E$26,MATCH(1,($G$2=vacance!$B$4:$B$26)*($C$7>=vacance!$C$4:$C$26)*($G$7<=vacance!$D$4:$D$26),0))),\"\")","v":""},{"$f":"IFERROR(IF(B10<>$E$3,\"\",INDEX(vacance!$E$4:$E$26,MATCH(1,($C$2=vacance!$B$4:$B$26)*($H$7>=vacance!$C$4:$C$26)*($H$7<=vacance!$D$4:$D$26),0))),\"\")","v":""},{"$f":"IFERROR(IF(B10<>$E$3,\"\",INDEX(vacance!$E$4:$E$26,MATCH(1,($C$2=vacance!$B$4:$B$26)*($I$7>=vacance!$C$4:$C$26)*($I$7<=vacance!$D$4:$D$26),0))),\"\")","v":""},{"$f":"IFERROR(IF(B10<>$E$3,\"\",INDEX(vacance!$E$4:$E$26,MATCH(1,($C$2=vacance!$B$4:$B$26)*($J$7>=vacance!$C$4:$C$26)*($J$7<=vacance!$D$4:$D$26),0))),\"\")","v":""},{"$f":"IFERROR(IF(B10<>$E$3,\"\",INDEX(vacance!$E$4:$E$26,MATCH(1,($C$2=vacance!$B$4:$B$26)*($K$7>=vacance!$C$4:$C$26)*($K$7<=vacance!$D$4:$D$26),0))),\"\")","v":""},{"$f":"IFERROR(IF(B10<>$E$3,\"\",INDEX(vacance!$E$4:$E$26,MATCH(1,($C$2=vacance!$B$4:$B$26)*($L$7>=vacance!$C$4:$C$26)*($L$7<=vacance!$D$4:$D$26),0))),\"\")","v":""},{"$f":"IFERROR(IF(B10<>$E$3,\"\",INDEX(vacance!$E$4:$E$26,MATCH(1,($C$2=vacance!$B$4:$B$26)*($M$7>=vacance!$C$4:$C$26)*($M$7<=vacance!$D$4:$D$26),0))),\"\")","v":""},{"$f":"IFERROR(IF(B10<>$E$3,\"\",INDEX(vacance!$E$4:$E$26,MATCH(1,($C$2=vacance!$B$4:$B$26)*($N$7>=vacance!$C$4:$C$26)*($N$7<=vacance!$D$4:$D$26),0))),\"\")","v":""},{"$f":"IFERROR(IF(B10<>$E$3,\"\",INDEX(vacance!$E$4:$E$26,MATCH(1,($C$2=vacance!$B$4:$B$26)*($O$7>=vacance!$C$4:$C$26)*($O$7<=vacance!$D$4:$D$26),0))),\"\")","v":""},{"$f":"IFERROR(IF(B10<>$E$3,\"\",INDEX(vacance!$E$4:$E$26,MATCH(1,($C$2=vacance!$B$4:$B$26)*($P$7>=vacance!$C$4:$C$26)*($P$7<=vacance!$D$4:$D$26),0))),\"\")","v":""},{"$f":"IFERROR(IF(B10<>$E$3,\"\",INDEX(vacance!$E$4:$E$26,MATCH(1,($C$2=vacance!$B$4:$B$26)*($Q$7>=vacance!$C$4:$C$26)*($Q$7<=vacance!$D$4:$D$26),0))),\"\")","v":""},{"$f":"IFERROR(IF(B10<>$E$3,\"\",INDEX(vacance!$E$4:$E$26,MATCH(1,($C$2=vacance!$B$4:$B$26)*($R$7>=vacance!$C$4:$C$26)*($R$7<=vacance!$D$4:$D$26),0))),\"\")","v":""},{"$f":"IFERROR(IF(B10<>$E$3,\"\",INDEX(vacance!$E$4:$E$26,MATCH(1,($C$2=vacance!$B$4:$B$26)*($S$7>=vacance!$C$4:$C$26)*($S$7<=vacance!$D$4:$D$26),0))),\"\")","v":""},{"$f":"IFERROR(IF(B10<>$E$3,\"\",INDEX(vacance!$E$4:$E$26,MATCH(1,($C$2=vacance!$B$4:$B$26)*($T$7>=vacance!$C$4:$C$26)*($T$7<=vacance!$D$4:$D$26),0))),\"\")","v":""},{"$f":"IFERROR(IF(B10<>$E$3,\"\",INDEX(vacance!$E$4:$E$26,MATCH(1,($C$2=vacance!$B$4:$B$26)*($U$7>=vacance!$C$4:$C$26)*($U$7<=vacance!$D$4:$D$26),0))),\"\")","v":""},{"$f":"IFERROR(IF(B10<>$E$3,\"\",INDEX(vacance!$E$4:$E$26,MATCH(1,($C$2=vacance!$B$4:$B$26)*($V$7>=vacance!$C$4:$C$26)*($V$7<=vacance!$D$4:$D$26),0))),\"\")","v":""},{"$f":"IFERROR(IF(B10<>$E$3,\"\",INDEX(vacance!$E$4:$E$26,MATCH(1,($C$2=vacance!$B$4:$B$26)*($W$7>=vacance!$C$4:$C$26)*($W$7<=vacance!$D$4:$D$26),0))),\"\")","v":""},{"$f":"IFERROR(IF(B10<>$E$3,\"\",INDEX(vacance!$E$4:$E$26,MATCH(1,($C$2=vacance!$B$4:$B$26)*($X$7>=vacance!$C$4:$C$26)*($X$7<=vacance!$D$4:$D$26),0))),\"\")","v":""},{"$f":"IFERROR(IF(B10<>$E$3,\"\",INDEX(vacance!$E$4:$E$26,MATCH(1,($C$2=vacance!$B$4:$B$26)*($Y$7>=vacance!$C$4:$C$26)*($Y$7<=vacance!$D$4:$D$26),0))),\"\")","v":""},{"$f":"IFERROR(IF(B10<>$E$3,\"\",INDEX(vacance!$E$4:$E$26,MATCH(1,($C$2=vacance!$B$4:$B$26)*($Z$7>=vacance!$C$4:$C$26)*($Z$7<=vacance!$D$4:$D$26),0))),\"\")","v":""},{"$f":"IFERROR(IF(B10<>$E$3,\"\",INDEX(vacance!$E$4:$E$26,MATCH(1,($C$2=vacance!$B$4:$B$26)*($AA$7>=vacance!$C$4:$C$26)*($AA$7<=vacance!$D$4:$D$26),0))),\"\")","v":""},{"$f":"IFERROR(IF(B10<>$E$3,\"\",INDEX(vacance!$E$4:$E$26,MATCH(1,($C$2=vacance!$B$4:$B$26)*($AB$7>=vacance!$C$4:$C$26)*($AB$7<=vacance!$D$4:$D$26),0))),\"\")","v":""},{"$f":"IFERROR(IF(B10<>$E$3,\"\",INDEX(vacance!$E$4:$E$26,MATCH(1,($C$2=vacance!$B$4:$B$26)*($AC$7>=vacance!$C$4:$C$26)*($AC$7<=vacance!$D$4:$D$26),0))),\"\")","v":""},{"$f":"IFERROR(IF(B10<>$E$3,\"\",INDEX(vacance!$E$4:$E$26,MATCH(1,($C$2=vacance!$B$4:$B$26)*($AD$7>=vacance!$C$4:$C$26)*($AD$7<=vacance!$D$4:$D$26),0))),\"\")","v":""},{"$f":"IFERROR(IF(B10<>$E$3,\"\",INDEX(vacance!$E$4:$E$26,MATCH(1,($C$2=vacance!$B$4:$B$26)*($AE$7>=vacance!$C$4:$C$26)*($AE$7<=vacance!$D$4:$D$26),0))),\"\")","v":""},{"$f":"IFERROR(IF(B10<>$E$3,\"\",INDEX(vacance!$E$4:$E$26,MATCH(1,($C$2=vacance!$B$4:$B$26)*($AF$7>=vacance!$C$4:$C$26)*($AF$7<=vacance!$D$4:$D$26),0))),\"\")","v":""},{"$f":"IFERROR(IF(B10<>$E$3,\"\",INDEX(vacance!$E$4:$E$26,MATCH(1,($C$2=vacance!$B$4:$B$26)*($AG$7>=vacance!$C$4:$C$26)*($AG$7<=vacance!$D$4:$D$26),0))),\"\")","v":""}]
{"$rows_left_out":27}
{"sheet":"vacance","index":1,"n_rows":26,"n_cols":6,"rows_kept":26,"cut":false,"hidden":false,"merged":[]}
[null,"متعقب إجازات الموظفين"]
[]
[null,"اسم الموظف","تاريخ البداية","تاريخ النهاية","نوع الإجازة","الأيام"]
[null,"الموظف 1",{"$f":"DATE(YEAR(TODAY()),1,3)","v":"2018-01-03"},{"$f":"DATE(YEAR(TODAY()),1,3)","v":"2018-01-03"},"إجازة مرضية",{"$f":"NETWORKDAYS(vacance!$C4,vacance!$D4,lstHolidays)","v":1}]
[null,"الموظف 2",{"$f":"DATE(YEAR(TODAY()),1,17)","v":"2018-01-17"},{"$f":"DATE(YEAR(TODAY()),1,18)","v":"2018-01-18"},"مرافق",{"$f":"NETWORKDAYS(vacance!$C5,vacance!$D5,lstHolidays)","v":2}]
[null,"الموظف 3",{"$f":"DATE(YEAR(TODAY()),1,18 )","v":"2018-01-18"},{"$f":"DATE(YEAR(TODAY()),1,21)","v":"2018-01-21"},"إجازة عادية",{"$f":"NETWORKDAYS(vacance!$C6,vacance!$D6,lstHolidays)","v":2}]
[null,"الموظف 5",{"$f":"DATE(YEAR(TODAY())-1,12,10 )","v":"2017-12-10"},{"$f":"DATE(YEAR(TODAY())-1,12,16)","v":"2017-12-16"},"حداد",{"$f":"NETWORKDAYS(vacance!$C7,vacance!$D7,lstHolidays)","v":5}]
[null,"الموظف 4",{"$f":"DATE(YEAR(TODAY())-1,12,1  )","v":"2017-12-01"},{"$f":"DATE(YEAR(TODAY())-1,12,2)","v":"2017-12-02"},"إجازة مرضية",{"$f":"NETWORKDAYS(vacance!$C8,vacance!$D8,lstHolidays)","v":1}]
[null,"الموظف 1",{"$f":"DATE(YEAR(TODAY())-1,11,14  )","v":"2017-11-14"},{"$f":"DATE(YEAR(TODAY())-1,11,18)","v":"2017-11-18"},"العطلة",{"$f":"NETWORKDAYS(vacance!$C9,vacance!$D9,lstHolidays)","v":4}]
[null,"الموظف 4",{"$f":"DATE(YEAR(TODAY()),1,31 )","v":"2018-01-31"},{"$f":"DATE(YEAR(TODAY()),2,4)","v":"2018-02-04"},"إجازة مرضية",{"$f":"NETWORKDAYS(vacance!$C10,vacance!$D10,lstHolidays)","v":3}]
{"$rows_left_out":17}
{"sheet":"قائمة الموظفين","index":2,"n_rows":8,"n_cols":2,"rows_kept":8,"cut":false,"hidden":false,"merged":[]}
[null,"قائمة الموظفين"]
[]
[null,"أسماء الموظفين"]
[null,"الموظف 1"]
[null,"الموظف 2"]
[null,"الموظف 3"]
[null,"الموظف 4"]
[null,"الموظف 5"]

{"sheet":"أنواع الإجازات","index":3,"n_rows":13,"n_cols":39,"rows_kept":13,"cut":false,"hidden":false,"merged":[]}
[null,"أنواع الإجازات",null,null,null,null,null,null,null,null,null,null,null,null,null,null,null,null,null,null,null,null,null,null,null,null,null,null,null,null,null,null,null,null,null,null,null,null,"السّبت"]
[null,null,null,null,null,null,null,null,null,null,null,null,null,null,null,null,null,null,null,null,null,null,null,null,null,null,null,null,null,null,null,null,null,null,null,null,null,null,"الأحد"]
[null,"قائمة أنواع الإجازات",null,null,null,null,null,null,null,null,null,null,null,null,null,null,null,null,null,null,null,null,null,null,null,null,null,null,null,null,null,null,null,null,null,null,null,null,"الإثنين"]
[null,"إجازة مرضية",null,null,null,null,null,null,null,null,null,null,null,null,null,null,null,null,null,null,null,null,null,null,null,null,null,null,null,null,null,null,null,null,null,null,null,null,"الثلاثاء"]
[null,"إجازة عادية",null,null,null,null,null,null,null,null,null,null,null,null,null,null,null,null,null,null,null,null,null,null,null,null,null,null,null,null,null,null,null,null,null,null,null,null,"الأربعاء"]
[null,"حداد",null,null,null,null,null,null,null,null,null,null,null,null,null,null,null,null,null,null,null,null,null,null,null,null,null,null,null,null,null,null,null,null,null,null,null,null,"الخميس"]
[null,"غياب",null,null,null,null,null,null,null,null,null,null,null,null,null,null,null,null,null,null,null,null,null,null,null,null,null,null,null,null,null,null,null,null,null,null,null,null,"الجمعة"]
[null,"تأخير"]
[null,"استئذان"]
[null,"مرافق"]
{"$rows_left_out":4}
{"sheet":"عطلات الشركة","index":4,"n_rows":7,"n_cols":3,"rows_kept":7,"cut":false,"hidden":false,"merged":[]}
[null,"عطلات الشركة"]
[]
[null,"عطلات الشركة","الوصف"]
[null,{"$f":"DATE(YEAR(TODAY()),11,24)","v":"2018-11-24"},"عيد الفطر"]
[null,{"$f":"DATE(YEAR(TODAY()),11,25)","v":"2018-11-25"},"عيد الفطر"]
[null,{"$f":"DATE(YEAR(TODAY()),12,24)","v":"2018-12-24"},"عيد الأضحى"]
[null,{"$f":"DATE(YEAR(TODAY()),12,25)","v":"2018-12-25"},"عيد الأضحى"]