{"text_format":"1","workbook":"xlsx","n_sheets":2,"sheets":["data","القائمة"],"not_rendered":{"charts":0,"images":0,"macros":1,"external_links":0,"defined_names":6,"comments":0,"pivot_tables":0},"unopened":[],"bounds":{"document_bytes":16777216,"sheet_cells":100000,"rows_first":2000,"rows_last":500,"rows_between":2000,"halvings":0,"cell_chars":16384,"cell_head_chars":4096},"cells_cut":0,"cells_raw":0,"read":"whole","date_system":"1900"}

{"sheet":"data","index":0,"n_rows":1094,"n_cols":8,"rows_kept":1094,"cut":false,"hidden":false,"merged":[]}
[null,null,null,null,null,null,null,"الذهاب"]
[null,null,null,null,null,null,null,"الاياب"]
[]
["رقم القيد","الاسم","اللقب","الواجهة","عدد الايام","التاريخ","الملاحظة"]
[14575,"احمد","علي","سطيف",21,"2018-11-13","الذهاب"]
[20050,"سمير","علولا","وهرن",35,"2018-11-14","الاياب"]
[null,{"$f":"+IFERROR(INDEX(#REF!,MATCH(A7,#REF!,0)),\"\")","v":""},{"$f":"+IFERROR(INDEX(#REF!,MATCH(A7,#REF!,0)),\"\")","v":""},{"$f":"IFERROR(INDEX(#REF!,MATCH(A7,#REF!,0)),\"\")","v":""},{"$f":"IFERROR(INDEX(#REF!,MATCH(A7,#REF!,0)),\"\")","v":""},null,"الاياب"]
[null,{"$f":"+IFERROR(INDEX(#REF!,MATCH(A8,#REF!,0)),\"\")","v":""},{"$f":"+IFERROR(INDEX(#REF!,MATCH(A8,#REF!,0)),\"\")","v":""},{"$f":"IFERROR(INDEX(#REF!,MATCH(A8,#REF!,0)),\"\")","v":""},{"$f":"IFERROR(INDEX(#REF!,MATCH(A8,#REF!,0)),\"\")","v":""},null,"الاياب"]
[null,{"$f":"+IFERROR(INDEX(#REF!,MATCH(A9,#REF!,0)),\"\")","v":""},{"$f":"+IFERROR(INDEX(#REF!,MATCH(A9,#REF!,0)),\"\")","v":""},{"$f":"IFERROR(INDEX(#REF!,MATCH(A9,#REF!,0)),\"\")","v":""},{"$f":"IFERROR(INDEX(#REF!,MATCH(A9,#REF!,0)),\"\")","v":""}]
[null,{"$f":"+IFERROR(INDEX(#REF!,MATCH(A10,#REF!,0)),\"\")","v":""},{"$f":"+IFERROR(INDEX(#REF!,MATCH(A10,#REF!,0)),\"\")","v":""},{"$f":"IFERROR(INDEX(#REF!,MATCH(A10,#REF!,0)),\"\")","v":""},{"$f":"IFERROR(INDEX(#REF!,MATCH(A10,#REF!,0)),\"\")","v":""}]
[null,{"$f":"+IFERROR(INDEX(#REF!,MATCH(A11,#REF!,0)),\"\")","v":""},{"$f":"+IFERROR(INDEX(#REF!,MATCH(A11,#REF!,0)),\"\")","v":""},{"$f":"IFERROR(INDEX(#REF!,MATCH(A11,#REF!,0)),\"\")","v":""},{"$f":"IFERROR(INDEX(#REF!,MATCH(A11,#REF!,0)),\"\")","v":""}]
[null,{"$f":"+IFERROR(INDEX(#REF!,MATCH(A12,#REF!,0)),\"\")","v":""},{"$f":"+IFERROR(INDEX(#REF!,MATCH(A12,#REF!,0)),\"\")","v":""},{"$f":"IFERROR(INDEX(#REF!,MATCH(A12,#REF!,0)),\"\")","v":""},{"$f":"IFERROR(INDEX(#REF!,MATCH(A12,#REF!,0)),\"\")","v":""}]
[null,{"$f":"+IFERROR(INDEX(#REF!,MATCH(A13,#REF!,0)),\"\")","v":""},{"$f":"+IFERROR(INDEX(#REF!,MATCH(A13,#REF!,0)),\"\")","v":""},{"$f":"IFERROR(INDEX(#REF!,MATCH(A13,#REF!,0)),\"\")","v":""},{"$f":"IFERROR(INDEX(#REF!,MATCH(A13,#REF!,0)),\"\")","v":""}]
[null,{"$f":"+IFERROR(INDEX(#REF!,MATCH(A14,#REF!,0)),\"\")","v":""},{"$f":"+IFERROR(INDEX(#REF!,MATCH(A14,#REF!,0)),\"\")","v":""},{"$f":"IFERROR(INDEX(#REF!,MATCH(A14,#REF!,0)),\"\")","v":""},{"$f":"IFERROR(INDEX(#REF!,MATCH(A14,#REF!,0)),\"\")","v":""}]
[null,{"$f":"+IFERROR(INDEX(#REF!,MATCH(A15,#REF!,0)),\"\")","v":""},{"$f":"+IFERROR(INDEX(#REF!,MATCH(A15,#REF!,0)),\"\")","v":""},{"$f":"IFERROR(INDEX(#REF!,MATCH(A15,#REF!,0)),\"\")","v":""},{"$f":"IFERROR(INDEX(#REF!,MATCH(A15,#REF!,0)),\"\")","v":""}]
[null,{"$f":"+IFERROR(INDEX(#REF!,MATCH(A16,#REF!,0)),\"\")","v":""},{"$f":"+IFERROR(INDEX(#REF!,MATCH(A16,#REF!,0)),\"\")","v":""},{"$f":"IFERROR(INDEX(#REF!,MATCH(A16,#REF!,0)),\"\")","v":""},{"$f":"IFERROR(INDEX(#REF!,MATCH(A16,#REF!,0)),\"\")","v":""}]
[null,{"$f":"+IFERROR(INDEX(#REF!,MATCH(A17,#REF!,0)),\"\")","v":""},{"$f":"+IFERROR(INDEX(#REF!,MATCH(A17,#REF!,0)),\"\")","v":""},{"$f":"IFERROR(INDEX(#REF!,MATCH(A17,#REF!,0)),\"\")","v":""},{"$f":"IFERROR(INDEX(#REF!,MATCH(A17,#REF!,0)),\"\")","v":""}]
[null,{"$f":"+IFERROR(INDEX(#REF!,MATCH(A18,#REF!,0)),\"\")","v":""},{"$f":"+IFERROR(INDEX(#REF!,MATCH(A18,#REF!,0)),\"\")","v":""},{"$f":"IFERROR(INDEX(#REF!,MATCH(A18,#REF!,0)),\"\")","v":""},{"$f":"IFERROR(INDEX(#REF!,MATCH(A18,#REF!,0)),\"\")","v":""}]
[null,{"$f":"+IFERROR(INDEX(#REF!,MATCH(A19,#REF!,0)),\"\")","v":""},{"$f":"+IFERROR(INDEX(#REF!,MATCH(A19,#REF!,0)),\"\")","v":""},{"$f":"IFERROR(INDEX(#REF!,MATCH(A19,#REF!,0)),\"\")","v":""},{"$f":"IFERROR(INDEX(#REF!,MATCH(A19,#REF!,0)),\"\")","v":""}]
[null,{"$f":"+IFERROR(INDEX(#REF!,MATCH(A20,#REF!,0)),\"\")","v":""},{"$f":"+IFERROR(INDEX(#REF!,MATCH(A20,#REF!,0)),\"\")","v":""},{"$f":"IFERROR(INDEX(#REF!,MATCH(A20,#REF!,0)),\"\")","v":""},{"$f":"IFERROR(INDEX(#REF!,MATCH(A20,#REF!,0)),\"\")","v":""}]
[null,{"$f":"+IFERROR(INDEX(#REF!,MATCH(A21,#REF!,0)),\"\")","v":""},{"$f":"+IFERROR(INDEX(#REF!,MATCH(A21,#REF!,0)),\"\")","v":""},{"$f":"IFERROR(INDEX(#REF!,MATCH(A21,#REF!,0)),\"\")","v":""},{"$f":"IFERROR(INDEX(#REF!,MATCH(A21,#REF!,0)),\"\")","v":""}]
[null,{"$f":"+IFERROR(INDEX(#REF!,MATCH(A22,#REF!,0)),\"\")","v":""},{"$f":"+IFERROR(INDEX(#REF!,MATCH(A22,#REF!,0)),\"\")","v":""},{"$f":"IFERROR(INDEX(#REF!,MATCH(A22,#REF!,0)),\"\")","v":""},{"$f":"IFERROR(INDEX(#REF!,MATCH(A22,#REF!,0)),\"\")","v":""}]
[null,{"$f":"+IFERROR(INDEX(#REF!,MATCH(A23,#REF!,0)),\"\")","v":""},{"$f":"+IFERROR(INDEX(#REF!,MATCH(A23,#REF!,0)),\"\")","v":""},{"$f":"IFERROR(INDEX(#REF!,MATCH(A23,#REF!,0)),\"\")","v":""},{"$f":"IFERROR(INDEX(#REF!,MATCH(A23,#REF!,0)),\"\")","v":""}]
[null,{"$f":"+IFERROR(INDEX(#REF!,MATCH(A24,#REF!,0)),\"\")","v":""},{"$f":"+IFERROR(INDEX(#REF!,MATCH(A24,#REF!,0)),\"\")","v":""},{"$f":"IFERROR(INDEX(#REF!,MATCH(A24,#REF!,0)),\"\")","v":""},{"$f":"IFERROR(INDEX(#REF!,MATCH(A24,#REF!,0)),\"\")","v":""}]
[null,{"$f":"+IFERROR(INDEX(#REF!,MATCH(A25,#REF!,0)),\"\")","v":""},{"$f":"+IFERROR(INDEX(#REF!,MATCH(A25,#REF!,0)),\"\")","v":""},{"$f":"IFERROR(INDEX(#REF!,MATCH(A25,#REF!,0)),\"\")","v":""},{"$f":"IFERROR(INDEX(#REF!,MATCH(A25,#REF!,0)),\"\")","v":""}]
[null,{"$f":"+IFERROR(INDEX(#REF!,MATCH(A26,#REF!,0)),\"\")","v":""},{"$f":"+IFERROR(INDEX(#REF!,MATCH(A26,#REF!,0)),\"\")","v":""},{"$f":"IFERROR(INDEX(#REF!,MATCH(A26,#REF!,0)),\"\")","v":""},{"$f":"IFERROR(INDEX(#REF!,MATCH(A26,#REF!,0)),\"\")","v":""}]
[null,{"$f":"+IFERROR(INDEX(#REF!,MATCH(A27,#REF!,0)),\"\")","v":""},{"$f":"+IFERROR(INDEX(#REF!,MATCH(A27,#REF!,0)),\"\")","v":""},{"$f":"IFERROR(INDEX(#REF!,MATCH(A27,#REF!,0)),\"\")","v":""},{"$f":"IFERROR(INDEX(#REF!,MATCH(A27,#REF!,0)),\"\")","v":""}]
[null,{"$f":"+IFERROR(INDEX(#REF!,MATCH(A28,#REF!,0)),\"\")","v":""},{"$f":"+IFERROR(INDEX(#REF!,MATCH(A28,#REF!,0)),\"\")","v":""},{"$f":"IFERROR(INDEX(#REF!,MATCH(A28,#REF!,0)),\"\")","v":""},{"$f":"IFERROR(INDEX(#REF!,MATCH(A28,#REF!,0)),\"\")","v":""}]
[null,{"$f":"+IFERROR(INDEX(#REF!,MATCH(A29,#REF!,0)),\"\")","v":""},{"$f":"+IFERROR(INDEX(#REF!,MATCH(A29,#REF!,0)),\"\")","v":""},{"$f":"IFERROR(INDEX(#REF!,MATCH(A29,#REF!,0)),\"\")","v":""},{"$f":"IFERROR(INDEX(#REF!,MATCH(A29,#REF!,0)),\"\")","v":""}]
[null,{"$f":"+IFERROR(INDEX(#REF!,MATCH(A30,#REF!,0)),\"\")","v":""},{"$f":"+IFERROR(INDEX(#REF!,MATCH(A30,#REF!,0)),\"\")","v":""},{"$f":"IFERROR(INDEX(#REF!,MATCH(A30,#REF!,0)),\"\")","v":""},{"$f":"IFERROR(INDEX(#REF!,MATCH(A30,#REF!,0)),\"\")","v":""}]
[null,{"$f":"+IFERROR(INDEX(#REF!,MATCH(A31,#REF!,0)),\"\")","v":""},{"$f":"+IFERROR(INDEX(#REF!,MATCH(A31,#REF!,0)),\"\")","v":""},{"$f":"IFERROR(INDEX(#REF!,MATCH(A31,#REF!,0)),\"\")","v":""},{"$f":"IFERROR(INDEX(#REF!,MATCH(A31,#REF!,0)),\"\")","v":""}]
[null,{"$f":"+IFERROR(INDEX(#REF!,MATCH(A32,#REF!,0)),\"\")","v":""},{"$f":"+IFERROR(INDEX(#REF!,MATCH(A32,#REF!,0)),\"\")","v":""},{"$f":"IFERROR(INDEX(#REF!,MATCH(A32,#REF!,0)),\"\")","v":""},{"$f":"IFERROR(INDEX(#REF!,MATCH(A32,#REF!,0)),\"\")","v":""}]
[null,{"$f":"+IFERROR(INDEX(#REF!,MATCH(A33,#REF!,0)),\"\")","v":""},{"$f":"+IFERROR(INDEX(#REF!,MATCH(A33,#REF!,0)),\"\")","v":""},{"$f":"IFERROR(INDEX(#REF!,MATCH(A33,#REF!,0)),\"\")","v":""},{"$f":"IFERROR(INDEX(#REF!,MATCH(A33,#REF!,0)),\"\")","v":""}]
[null,{"$f":"+IFERROR(INDEX(#REF!,MATCH(A34,#REF!,0)),\"\")","v":""},{"$f":"+IFERROR(INDEX(#REF!,MATCH(A34,#REF!,0)),\"\")","v":""},{"$f":"IFERROR(INDEX(#REF!,MATCH(A34,#REF!,0)),\"\")","v":""},{"$f":"IFERROR(INDEX(#REF!,MATCH(A34,#REF!,0)),\"\")","v":""}]
[null,{"$f":"+IFERROR(INDEX(#REF!,MATCH(A35,#REF!,0)),\"\")","v":""},{"$f":"+IFERROR(INDEX(#REF!,MATCH(A35,#REF!,0)),\"\")","v":""},{"$f":"IFERROR(INDEX(#REF!,MATCH(A35,#REF!,0)),\"\")","v":""},{"$f":"IFERROR(INDEX(#REF!,MATCH(A35,#REF!,0)),\"\")","v":""}]
[null,{"$f":"+IFERROR(INDEX(#REF!,MATCH(A36,#REF!,0)),\"\")","v":""},{"$f":"+IFERROR(INDEX(#REF!,MATCH(A36,#REF!,0)),\"\")","v":""},{"$f":"IFERROR(INDEX(#REF!,MATCH(A36,#REF!,0)),\"\")","v":""},{"$f":"IFERROR(INDEX(#REF!,MATCH(A36,#REF!,0)),\"\")","v":""}]
[null,{"$f":"+IFERROR(INDEX(#REF!,MATCH(A37,#REF!,0)),\"\")","v":""},{"$f":"+IFERROR(INDEX(#REF!,MATCH(A37,#REF!,0)),\"\")","v":""},{"$f":"IFERROR(INDEX(#REF!,MATCH(A37,#REF!,0)),\"\")","v":""},{"$f":"IFERROR(INDEX(#REF!,MATCH(A37,#REF!,0)),\"\")","v":""}]
[null,{"$f":"+IFERROR(INDEX(#REF!,MATCH(A38,#REF!,0)),\"\")","v":""},{"$f":"+IFERROR(INDEX(#REF!,MATCH(A38,#REF!,0)),\"\")","v":""},{"$f":"IFERROR(INDEX(#REF!,MATCH(A38,#REF!,0)),\"\")","v":""},{"$f":"IFERROR(INDEX(#REF!,MATCH(A38,#REF!,0)),\"\")","v":""}]
[null,{"$f":"+IFERROR(INDEX(#REF!,MATCH(A39,#REF!,0)),\"\")","v":""},{"$f":"+IFERROR(INDEX(#REF!,MATCH(A39,#REF!,0)),\"\")","v":""},{"$f":"IFERROR(INDEX(#REF!,MATCH(A39,#REF!,0)),\"\")","v":""},{"$f":"IFERROR(INDEX(#REF!,MATCH(A39,#REF!,0)),\"\")","v":""}]
[null,{"$f":"+IFERROR(INDEX(#REF!,MATCH(A40,#REF!,0)),\"\")","v":""},{"$f":"+IFERROR(INDEX(#REF!,MATCH(A40,#REF!,0)),\"\")","v":""},{"$f":"IFERROR(INDEX(#REF!,MATCH(A40,#REF!,0)),\"\")","v":""},{"$f":"IFERROR(INDEX(#REF!,MATCH(A40,#REF!,0)),\"\")","v":""}]
[null,{"$f":"+IFERROR(INDEX(#REF!,MATCH(A41,#REF!,0)),\"\")","v":""},{"$f":"+IFERROR(INDEX(#REF!,MATCH(A41,#REF!,0)),\"\")","v":""},{"$f":"IFERROR(INDEX(#REF!,MATCH(A41,#REF!,0)),\"\")","v":""},{"$f":"IFERROR(INDEX(#REF!,MATCH(A41,#REF!,0)),\"\")","v":""}]
[null,{"$f":"+IFERROR(INDEX(#REF!,MATCH(A42,#REF!,0)),\"\")","v":""},{"$f":"+IFERROR(INDEX(#REF!,MATCH(A42,#REF!,0)),\"\")","v":""},{"$f":"IFERROR(INDEX(#REF!,MATCH(A42,#REF!,0)),\"\")","v":""},{"$f":"IFERROR(INDEX(#REF!,MATCH(A42,#REF!,0)),\"\")","v":""}]
[null,{"$f":"+IFERROR(INDEX(#REF!,MATCH(A43,#REF!,0)),\"\")","v":""},{"$f":"+IFERROR(INDEX(#REF!,MATCH(A43,#REF!,0)),\"\")","v":""},{"$f":"IFERROR(INDEX(#REF!,MATCH(A43,#REF!,0)),\"\")","v":""},{"$f":"IFERROR(INDEX(#REF!,MATCH(A43,#REF!,0)),\"\")","v":""}]
[null,{"$f":"+IFERROR(INDEX(#REF!,MATCH(A44,#REF!,0)),\"\")","v":""},{"$f":"+IFERROR(INDEX(#REF!,MATCH(A44,#REF!,0)),\"\")","v":""},{"$f":"IFERROR(INDEX(#REF!,MATCH(A44,#REF!,0)),\"\")","v":""},{"$f":"IFERROR(INDEX(#REF!,MATCH(A44,#REF!,0)),\"\")","v":""}]
[null,{"$f":"+IFERROR(INDEX(#REF!,MATCH(A45,#REF!,0)),\"\")","v":""},{"$f":"+IFERROR(INDEX(#REF!,MATCH(A45,#REF!,0)),\"\")","v":""},{"$f":"IFERROR(INDEX(#REF!,MATCH(A45,#REF!,0)),\"\")","v":""},{"$f":"IFERROR(INDEX(#REF!,MATCH(A45,#REF!,0)),\"\")","v":""}]
[null,{"$f":"+IFERROR(INDEX(#REF!,MATCH(A46,#REF!,0)),\"\")","v":""},{"$f":"+IFERROR(INDEX(#REF!,MATCH(A46,#REF!,0)),\"\")","v":""},{"$f":"IFERROR(INDEX(#REF!,MATCH(A46,#REF!,0)),\"\")","v":""},{"$f":"IFERROR(INDEX(#REF!,MATCH(A46,#REF!,0)),\"\")","v":""}]
[{"$f":"IF(C47=\"\",\"\",SUBTOTAL(3,C$5:C47))","v":""},{"$f":"+IFERROR(INDEX(#REF!,MATCH(A47,#REF!,0)),\"\")","v":""},null,{"$f":"IFERROR(INDEX(#REF!,MATCH(A47,#REF!,0)),\"\")","v":""},{"$f":"IFERROR(INDEX(#REF!,MATCH(A47,#REF!,0)),\"\")","v":""}]
[{"$f":"IF(C48=\"\",\"\",SUBTOTAL(3,C$5:C48))","v":""},{"$f":"+IFERROR(INDEX(#REF!,MATCH(A48,#REF!,0)),\"\")","v":""},null,{"$f":"IFERROR(INDEX(#REF!,MATCH(A48,#REF!,0)),\"\")","v":""},{"$f":"IFERROR(INDEX(#REF!,MATCH(A48,#REF!,0)),\"\")","v":""}]
[{"$f":"IF(C49=\"\",\"\",SUBTOTAL(3,C$5:C49))","v":""},{"$f":"+IFERROR(INDEX(#REF!,MATCH(A49,#REF!,0)),\"\")","v":""},null,{"$f":"IFERROR(INDEX(#REF!,MATCH(A49,#REF!,0)),\"\")","v":""},{"$f":"IFERROR(INDEX(#REF!,MATCH(A49,#REF!,0)),\"\")","v":""}]
[{"$f":"IF(C50=\"\",\"\",SUBTOTAL(3,C$5:C50))","v":""},{"$f":"+IFERROR(INDEX(#REF!,MATCH(A50,#REF!,0)),\"\")","v":""},null,{"$f":"IFERROR(INDEX(#REF!,MATCH(A50,#REF!,0)),\"\")","v":""},{"$f":"IFERROR(INDEX(#REF!,MATCH(A50,#REF!,0)),\"\")","v":""}]
[{"$f":"IF(C51=\"\",\"\",SUBTOTAL(3,C$5:C51))","v":""},{"$f":"+IFERROR(INDEX(#REF!,MATCH(A51,#REF!,0)),\"\")","v":""},null,{"$f":"IFERROR(INDEX(#REF!,MATCH(A51,#REF!,0)),\"\")","v":""},{"$f":"IFERROR(INDEX(#REF!,MATCH(A51,#REF!,0)),\"\")","v":""}]
[{"$f":"IF(C52=\"\",\"\",SUBTOTAL(3,C$5:C52))","v":""},{"$f":"+IFERROR(INDEX(#REF!,MATCH(A52,#REF!,0)),\"\")","v":""},null,{"$f":"IFERROR(INDEX(#REF!,MATCH(A52,#REF!,0)),\"\")","v":""},{"$f":"IFERROR(INDEX(#REF!,MATCH(A52,#REF!,0)),\"\")","v":""}]
[{"$f":"IF(C53=\"\",\"\",SUBTOTAL(3,C$5:C53))","v":""},{"$f":"+IFERROR(INDEX(#REF!,MATCH(A53,#REF!,0)),\"\")","v":""},null,{"$f":"IFERROR(INDEX(#REF!,MATCH(A53,#REF!,0)),\"\")","v":""},{"$f":"IFERROR(INDEX(#REF!,MATCH(A53,#REF!,0)),\"\")","v":""}]
[{"$f":"IF(C54=\"\",\"\",SUBTOTAL(3,C$5:C54))","v":""},{"$f":"+IFERROR(INDEX(#REF!,MATCH(A54,#REF!,0)),\"\")","v":""},null,{"$f":"IFERROR(INDEX(#REF!,MATCH(A54,#REF!,0)),\"\")","v":""},{"$f":"IFERROR(INDEX(#REF!,MATCH(A54,#REF!,0)),\"\")","v":""}]
[{"$f":"IF(C55=\"\",\"\",SUBTOTAL(3,C$5:C55))","v":""},{"$f":"+IFERROR(INDEX(#REF!,MATCH(A55,#REF!,0)),\"\")","v":""},null,{"$f":"IFERROR(INDEX(#REF!,MATCH(A55,#REF!,0)),\"\")","v":""},{"$f":"IFERROR(INDEX(#REF!,MATCH(A55,#REF!,0)),\"\")","v":""}]
[{"$f":"IF(C56=\"\",\"\",SUBTOTAL(3,C$5:C56))","v":""},{"$f":"+IFERROR(INDEX(#REF!,MATCH(A56,#REF!,0)),\"\")","v":""},null,{"$f":"IFERROR(INDEX(#REF!,MATCH(A56,#REF!,0)),\"\")","v":""},{"$f":"IFERROR(INDEX(#REF!,MATCH(A56,#REF!,0)),\"\")","v":""}]
[{"$f":"IF(C57=\"\",\"\",SUBTOTAL(3,C$5:C57))","v":""},{"$f":"+IFERROR(INDEX(#REF!,MATCH(A57,#REF!,0)),\"\")","v":""},null,{"$f":"IFERROR(INDEX(#REF!,MATCH(A57,#REF!,0)),\"\")","v":""},{"$f":"IFERROR(INDEX(#REF!,MATCH(A57,#REF!,0)),\"\")","v":""}]
[{"$f":"IF(C58=\"\",\"\",SUBTOTAL(3,C$5:C58))","v":""},{"$f":"+IFERROR(INDEX(#REF!,MATCH(A58,#REF!,0)),\"\")","v":""},null,{"$f":"IFERROR(INDEX(#REF!,MATCH(A58,#REF!,0)),\"\")","v":""},{"$f":"IFERROR(INDEX(#REF!,MATCH(A58,#REF!,0)),\"\")","v":""}]
[{"$f":"IF(C59=\"\",\"\",SUBTOTAL(3,C$5:C59))","v":""},{"$f":"+IFERROR(INDEX(#REF!,MATCH(A59,#REF!,0)),\"\")","v":""},null,{"$f":"IFERROR(INDEX(#REF!,MATCH(A59,#REF!,0)),\"\")","v":""},{"$f":"IFERROR(INDEX(#REF!,MATCH(A59,#REF!,0)),\"\")","v":""}]
[{"$f":"IF(C60=\"\",\"\",SUBTOTAL(3,C$5:C60))","v":""},{"$f":"+IFERROR(INDEX(#REF!,MATCH(A60,#REF!,0)),\"\")","v":""},null,{"$f":"IFERROR(INDEX(#REF!,MATCH(A60,#REF!,0)),\"\")","v":""},{"$f":"IFERROR(INDEX(#REF!,MATCH(A60,#REF!,0)),\"\")","v":""}]
[{"$f":"IF(C61=\"\",\"\",SUBTOTAL(3,C$5:C61))","v":""},{"$f":"+IFERROR(INDEX(#REF!,MATCH(A61,#REF!,0)),\"\")","v":""},null,{"$f":"IFERROR(INDEX(#REF!,MATCH(A61,#REF!,0)),\"\")","v":""},{"$f":"IFERROR(INDEX(#REF!,MATCH(A61,#REF!,0)),\"\")","v":""}]
[{"$f":"IF(C62=\"\",\"\",SUBTOTAL(3,C$5:C62))","v":""},{"$f":"+IFERROR(INDEX(#REF!,MATCH(A62,#REF!,0)),\"\")","v":""},null,{"$f":"IFERROR(INDEX(#REF!,MATCH(A62,#REF!,0)),\"\")","v":""},{"$f":"IFERROR(INDEX(#REF!,MATCH(A62,#REF!,0)),\"\")","v":""}]
["SI(C63=\"\";\"\";SOUS.TOTAL(3;C$5:C63))",{"$f":"+IFERROR(INDEX(#REF!,MATCH(A63,#REF!,0)),\"\")","v":""},null,{"$f":"IFERROR(INDEX(#REF!,MATCH(A63,#REF!,0)),\"\")","v":""},{"$f":"IFERROR(INDEX(#REF!,MATCH(A63,#REF!,0)),\"\")","v":""}]
[{"$f":"IF(C64=\"\",\"\",SUBTOTAL(3,C$5:C64))","v":""},{"$f":"+IFERROR(INDEX(#REF!,MATCH(A64,#REF!,0)),\"\")","v":""},null,{"$f":"IFERROR(INDEX(#REF!,MATCH(A64,#REF!,0)),\"\")","v":""},{"$f":"IFERROR(INDEX(#REF!,MATCH(A64,#REF!,0)),\"\")","v":""}]
[{"$f":"IF(C65=\"\",\"\",SUBTOTAL(3,C$5:C65))","v":""},{"$f":"+IFERROR(INDEX(#REF!,MATCH(A65,#REF!,0)),\"\")","v":""},null,{"$f":"IFERROR(INDEX(#REF!,MATCH(A65,#REF!,0)),\"\")","v":""},{"$f":"IFERROR(INDEX(#REF!,MATCH(A65,#REF!,0)),\"\")","v":""}]
[{"$f":"IF(C66=\"\",\"\",SUBTOTAL(3,C$5:C66))","v":""},{"$f":"+IFERROR(INDEX(#REF!,MATCH(A66,#REF!,0)),\"\")","v":""},null,{"$f":"IFERROR(INDEX(#REF!,MATCH(A66,#REF!,0)),\"\")","v":""},{"$f":"IFERROR(INDEX(#REF!,MATCH(A66,#REF!,0)),\"\")","v":""}]
[{"$f":"IF(C67=\"\",\"\",SUBTOTAL(3,C$5:C67))","v":""},{"$f":"+IFERROR(INDEX(#REF!,MATCH(A67,#REF!,0)),\"\")","v":""},null,{"$f":"IFERROR(INDEX(#REF!,MATCH(A67,#REF!,0)),\"\")","v":""},{"$f":"IFERROR(INDEX(#REF!,MATCH(A67,#REF!,0)),\"\")","v":""}]
[{"$f":"IF(C68=\"\",\"\",SUBTOTAL(3,C$5:C68))","v":""},{"$f":"+IFERROR(INDEX(#REF!,MATCH(A68,#REF!,0)),\"\")","v":""},null,{"$f":"IFERROR(INDEX(#REF!,MATCH(A68,#REF!,0)),\"\")","v":""},{"$f":"IFERROR(INDEX(#REF!,MATCH(A68,#REF!,0)),\"\")","v":""}]
[{"$f":"IF(C69=\"\",\"\",SUBTOTAL(3,C$5:C69))","v":""},{"$f":"+IFERROR(INDEX(#REF!,MATCH(A69,#REF!,0)),\"\")","v":""},null,{"$f":"IFERROR(INDEX(#REF!,MATCH(A69,#REF!,0)),\"\")","v":""},{"$f":"IFERROR(INDEX(#REF!,MATCH(A69,#REF!,0)),\"\")","v":""}]
[{"$f":"IF(C70=\"\",\"\",SUBTOTAL(3,C$5:C70))","v":""},{"$f":"+IFERROR(INDEX(#REF!,MATCH(A70,#REF!,0)),\"\")","v":""},null,{"$f":"IFERROR(INDEX(#REF!,MATCH(A70,#REF!,0)),\"\")","v":""},{"$f":"IFERROR(INDEX(#REF!,MATCH(A70,#REF!,0)),\"\")","v":""}]
[{"$f":"IF(C71=\"\",\"\",SUBTOTAL(3,C$5:C71))","v":""},{"$f":"+IFERROR(INDEX(#REF!,MATCH(A71,#REF!,0)),\"\")","v":""},null,{"$f":"IFERROR(INDEX(#REF!,MATCH(A71,#REF!,0)),\"\")","v":""},{"$f":"IFERROR(INDEX(#REF!,MATCH(A71,#REF!,0)),\"\")","v":""}]
[{"$f":"IF(C72=\"\",\"\",SUBTOTAL(3,C$5:C72))","v":""},{"$f":"+IFERROR(INDEX(#REF!,MATCH(A72,#REF!,0)),\"\")","v":""},null,{"$f":"IFERROR(INDEX(#REF!,MATCH(A72,#REF!,0)),\"\")","v":""},{"$f":"IFERROR(INDEX(#REF!,MATCH(A72,#REF!,0)),\"\")","v":""}]
[{"$f":"IF(C73=\"\",\"\",SUBTOTAL(3,C$5:C73))","v":""},{"$f":"+IFERROR(INDEX(#REF!,MATCH(A73,#REF!,0)),\"\")","v":""},null,{"$f":"IFERROR(INDEX(#REF!,MATCH(A73,#REF!,0)),\"\")","v":""},{"$f":"IFERROR(INDEX(#REF!,MATCH(A73,#REF!,0)),\"\")","v":""}]
[{"$f":"IF(C74=\"\",\"\",SUBTOTAL(3,C$5:C74))","v":""},{"$f":"+IFERROR(INDEX(#REF!,MATCH(A74,#REF!,0)),\"\")","v":""},null,{"$f":"IFERROR(INDEX(#REF!,MATCH(A74,#REF!,0)),\"\")","v":""},{"$f":"IFERROR(INDEX(#REF!,MATCH(A74,#REF!,0)),\"\")","v":""}]
[{"$f":"IF(C75=\"\",\"\",SUBTOTAL(3,C$5:C75))","v":""},{"$f":"+IFERROR(INDEX(#REF!,MATCH(A75,#REF!,0)),\"\")","v":""},null,{"$f":"IFERROR(INDEX(#REF!,MATCH(A75,#REF!,0)),\"\")","v":""},{"$f":"IFERROR(INDEX(#REF!,MATCH(A75,#REF!,0)),\"\")","v":""}]
[{"$f":"IF(C76=\"\",\"\",SUBTOTAL(3,C$5:C76))","v":""},{"$f":"+IFERROR(INDEX(#REF!,MATCH(A76,#REF!,0)),\"\")","v":""},null,{"$f":"IFERROR(INDEX(#REF!,MATCH(A76,#REF!,0)),\"\")","v":""},{"$f":"IFERROR(INDEX(#REF!,MATCH(A76,#REF!,0)),\"\")","v":""}]
[{"$f":"IF(C77=\"\",\"\",SUBTOTAL(3,C$5:C77))","v":""},{"$f":"+IFERROR(INDEX(#REF!,MATCH(A77,#REF!,0)),\"\")","v":""},null,{"$f":"IFERROR(INDEX(#REF!,MATCH(A77,#REF!,0)),\"\")","v":""},{"$f":"IFERROR(INDEX(#REF!,MATCH(A77,#REF!,0)),\"\")","v":""}]
[{"$f":"IF(C78=\"\",\"\",SUBTOTAL(3,C$5:C78))","v":""},{"$f":"+IFERROR(INDEX(#REF!,MATCH(A78,#REF!,0)),\"\")","v":""},null,{"$f":"IFERROR(INDEX(#REF!,MATCH(A78,#REF!,0)),\"\")","v":""},{"$f":"IFERROR(INDEX(#REF!,MATCH(A78,#REF!,0)),\"\")","v":""}]
[{"$f":"IF(C79=\"\",\"\",SUBTOTAL(3,C$5:C79))","v":""},{"$f":"+IFERROR(INDEX(#REF!,MATCH(A79,#REF!,0)),\"\")","v":""},null,{"$f":"IFERROR(INDEX(#REF!,MATCH(A79,#REF!,0)),\"\")","v":""},{"$f":"IFERROR(INDEX(#REF!,MATCH(A79,#REF!,0)),\"\")","v":""}]
[{"$f":"IF(C80=\"\",\"\",SUBTOTAL(3,C$5:C80))","v":""},{"$f":"+IFERROR(INDEX(#REF!,MATCH(A80,#REF!,0)),\"\")","v":""},null,{"$f":"IFERROR(INDEX(#REF!,MATCH(A80,#REF!,0)),\"\")","v":""},{"$f":"IFERROR(INDEX(#REF!,MATCH(A80,#REF!,0)),\"\")","v":""}]
{"$rows_left_out":1015}
{"sheet":"القائمة","index":1,"n_rows":1100,"n_cols":17,"rows_kept":1100,"cut":false,"hidden":false,"merged":[[5,5,5,6],[6,5,6,6]]}
[null,null,null,null,null,null,null,null,null,null,null,null,null,null,null,null,"الذهاب"]
[null,null,null,null,null,null,null,null,null,null,null,null,null,null,null,null,"الاياب"]
[]
[]
[null,null,null,null,null,"الاياب",null,"القائمة"]
[null,null,null,null,null,"2018-11-21",null,"من"]
[null,null,null,null,null,"2018-11-21",null,"الى"]
[]
[]
["رقم القيد","الاسم","اللقب","الواجهة","عدد الايام","التاريخ","الملاحظة"]
[null,"","","","",""]
[null,"","","","",""]
[null,"","","","",""]
[null,"","","","",""]
[null,"","","","",""]
[null,"","","","",""]
[null,"","","","",""]
[null,"","","","",""]
[null,"","","","",""]
[null,"","","","",""]
[null,"","","","",""]
[null,"","","","",""]
[null,"","","","",""]
[null,"","","","",""]
[null,"","","","",""]
[null,"","","","",""]
[null,"","","","",""]
[null,"","","","",""]
[null,"","","","",""]
[null,"","","","",""]
[null,"","","","",""]
[null,"","","","",""]
[null,"","","","",""]
[null,"","","","",""]
[null,"","","","",""]
[null,"","","","",""]
[null,"","","","",""]
[null,"","","","",""]
[null,"","","","",""]
[null,"","","","",""]
[null,"","","","",""]
[null,"","","","",""]
[null,"","","","",""]
[null,"","","","",""]
[null,"","","","",""]
[null,"","","","",""]
[null,"","","","",""]
[null,"","","","",""]
[null,"","","","",""]
[null,"","","","",""]
[null,"","","","",""]
[null,"","","","",""]
["","",null,"","",""]
["","",null,"","",""]
["","",null,"","",""]
["","",null,"","",""]
["","",null,"","",""]
["","",null,"","",""]
["","",null,"","",""]
["","",null,"","",""]
["","",null,"","",""]
["","",null,"","",""]
["","",null,"","",""]
["","",null,"","",""]
["","",null,"","",""]
["","",null,"","",""]
["","",null,"","",""]
["","",null,"","",""]
["SI(C63=\"\";\"\";SOUS.TOTAL(3;C$5:C63))","",null,"","",""]
["","",null,"","",""]
["","",null,"","",""]
["","",null,"","",""]
["","",null,"","",""]
["","",null,"","",""]
["","",null,"","",""]
["","",null,"","",""]
["","",null,"","",""]
["","",null,"","",""]
["","",null,"","",""]
["","",null,"","",""]
{"$rows_left_out":1020}