{"text_format":"1","workbook":"xlsx","n_sheets":6,"sheets":["STATEMENT","NewInvoice","Codes","Invoices","Payments","Customers"],"not_rendered":{"charts":1,"images":23,"macros":1,"external_links":0,"defined_names":5,"comments":1,"pivot_tables":0},"unopened":[],"bounds":{"document_bytes":16777216,"sheet_cells":100000,"rows_first":2000,"rows_last":500,"rows_between":2000,"halvings":0,"cell_chars":16384,"cell_head_chars":4096},"cells_cut":0,"cells_raw":0,"read":"whole","date_system":"1900"}

{"sheet":"STATEMENT","index":0,"n_rows":94,"n_cols":9,"rows_kept":94,"cut":false,"hidden":false,"merged":[[91,3,91,4],[92,3,92,4],[93,3,93,4],[65,3,65,6],[11,3,11,7],[5,3,5,5],[5,6,5,7],[9,5,9,6],[9,3,9,4],[0,7,0,11],[1,8,1,11],[2,8,2,11],[1,1,1,3],[3,8,3,11],[6,1,6,2],[7,1,7,10],[0,1,0,4],[8,3,8,4],[8,5,8,6]]}
["Statement","Naief Akeel Alzofairy Est.\nForever Living Products Sole Agent in the Middle East",null,null,null,null,null,"مؤسسة نايف عقيل الظفيري \nالوكيل الحصري لشركة فورايفر ليفينج الشرق الاوسط "]
[null,"Address: Mussa Bin Nasir St ",null,null," "," ",null,null,"العنوان: شارع موسى بن نصير"]
[null,"Phone: 0112151970 : Fax 0112151971",null,null,null,null,null,null,"هاتف: 0112151970 - فاكس: 0112151971"]
[null,"VAT Registration No: :300095228700003",null,null,null,null,null,null,"الرقم الضريبي :300095228700003  "]
[]
[null,null,null,"Statement of Account",null,null,"كشف حساب عميل"]
[null,null,null,null,"Date:",{"$f":"TODAY()","v":"2018-11-19"},"التاريخ"]
[null," "]
[null,null,null,"Customer Name: ",null,"Dallah Healthcare Co. / Dallah Hospital",null,"اســــــــم الــــــعــــمــيـــــــــل:"]
[null,null,null,"FBO ID",null,{"$f":"IF(F9=\"\",\"\",VLOOKUP(F9,Customers!C2:D625,2,0))","v":775962},null,"وكــــــــــالة رقــــــــــــــــم:"]
[]
[null,null,null,"Invoices   الفواتير"]
[null,null,null,"#","Invoice #\nرقم الفاتورة","Invoice Amount\nمبلغ الفاتورة","Invoice Date\nتاريخ الفاتورة","Notes\nملاحظات"]
[null,null,null,{"$f":"IF(OR(Table1[[#This Row],[Invoice '#\nرقم الفاتورة]]=\"\",Table1[[#This Row],[Invoice '#\nرقم الفاتورة]]=\"Nothing Follows\"),\"\",ROW()-13)","v":1},{"$f":"IF(E13=\"No Invoices\",\"\",IFERROR(VLOOKUP(ROWS($E$14:E14),Invoices!$A$2:$G$300,4,0),\"No Invoices/s\"))","v":28},{"$f":"IFERROR(VLOOKUP(Table1[[#This Row],[Invoice '#\nرقم الفاتورة]],Table4[[Invoice '#\nرقم الفاتورة]:[Notes\nملاحظات]],2,0),\"\")","v":3540.23},{"$f":"IFERROR(VLOOKUP(Table1[[#This Row],[Invoice '#\nرقم الفاتورة]],Table4[[Invoice '#\nرقم الفاتورة]:[Notes\nملاحظات]],3,0),\"\")","v":"2017-07-04"}]
[null,null,null,{"$f":"IF(OR(Table1[[#This Row],[Invoice '#\nرقم الفاتورة]]=\"\",Table1[[#This Row],[Invoice '#\nرقم الفاتورة]]=\"Nothing Follows\"),\"\",ROW()-13)","v":2},{"$f":"IF(OR(E14=\"The End\",E14=\"\",E14=\"No Invoices/s\"),\"\",IF(E14=\"No Invoices\",\"\",IFERROR(VLOOKUP(ROWS($E$14:E15),Invoices!$A$2:$G$300,4,0),\"The End\")))","v":27},{"$f":"IFERROR(VLOOKUP(Table1[[#This Row],[Invoice '#\nرقم الفاتورة]],Table4[[Invoice '#\nرقم الفاتورة]:[Notes\nملاحظات]],2,0),\"\")","v":1523.63},{"$f":"IFERROR(VLOOKUP(Table1[[#This Row],[Invoice '#\nرقم الفاتورة]],Table4[[Invoice '#\nرقم الفاتورة]:[Notes\nملاحظات]],3,0),\"\")","v":"2017-07-04"}]
{"$rows_left_out":80}
{"sheet":"NewInvoice","index":1,"n_rows":41,"n_cols":13,"rows_kept":41,"cut":false,"hidden":false,"merged":[[0,1,0,4],[0,7,0,10],[40,7,40,10],[2,7,2,8],[3,8,3,10],[6,1,6,2],[1,7,1,10],[2,9,2,10],[40,1,40,3],[32,1,32,3],[7,1,7,2],[1,2,1,3],[5,1,5,2],[5,7,5,8],[6,7,6,8],[7,7,7,8]]}
["NEW INVOICE","Naief Akeel Alzofairy Est.\nForever Living Products Sole Agent in the Middle East",null,null,null,null,null,"مؤسسة نايف عقيل الظفيري \nالوكيل الحصري لشركة فورايفر ليفينج الشرق الاوسط "]
[null,"Address: ","Riyadh, Sulaymaniyeh, Mussa Bin Nusair St ",null," "," ",null,"العنوان: الرياض - السليمانية - شارع موسى بن نصير"]
[null,"Phone: ","0112151970","Fax: 0112151971",null,null,null," فاكس: 0112151971",null,"هاتف: 0112151970"]
[null,"VAT Registration No: :300095228700003",null,null,null,null,null,null,"الرقم الضريبي :300095228700003  "]
[]
[null,"Invoice No.",null,23,"فاتورة رقم:",null,"Invoice Date:",{"$f":"TODAY()","v":"2018-11-19"},null,null,"تـــــــــــــــــــــــــــــــاريـــــــــــــــــــخ الفاتورة:"]
[null,"Customer Name:",null,"Dallah Healthcare Co. / Dallah Hospital","اسم العـميـــــل:",null,"FBO ID:",{"$f":"IF(D7=\"\",\"\",VLOOKUP(D7,Customers!$C$2:$Q$601,2,0))","v":775962},null,null,"رقـــــــــــــــــم الــــــــــــوكـــــــــــــــالـــــــــــــة:"]
[null,"Customer Address:",null,{"$f":"IF(D7=\"\",\"\",VLOOKUP(D7,Customers!$C$2:$Q$601,10,0))","v":"King Fahd Road, Alnakheel Street , Riyadh, KSA"},"عنوان العميل",null,"VAT Registration",{"$f":"IF(D7=\"\",\"\",VLOOKUP(D7,Customers!$C$2:$N$601,7,0))","v":300049358500003},null,null,"الرقــم الضريبي للعميــــل:"]
[]
[null,null,null,null,null,0.48]
[null,"Code","Qty","DESCRIPTION","U. Price","Discount \n","Net U. \nPrice","TOTAL","VAT","TOTAL \nwith VAT","U. Sale \nPrice+VAT","U.CC","Tot. CC"]
[null,15,14,{"$f":"IF(Table7[[#This Row],[Code]]=\"\",\"\",VLOOKUP(Table7[[#This Row],[Code]],Codes!$B$2:$E$2231,2,0))","v":"Forever Alove Vera Gel "},{"$f":"IF(Table7[[#This Row],[Code]]=\"\",\"\",VLOOKUP(Table7[[#This Row],[Code]],Codes!$B$2:$E$2231,3,0))","v":98},{"$f":"IF(OR(Table7[[#This Row],[Code]]=\"\",Table7[[#This Row],[Qty]]=\"\"),\"\",Table7[U. Price]*$F$10)","v":47.04},{"$f":"IF(OR(Table7[[#This Row],[Code]]=\"\",Table7[[#This Row],[Qty]]=\"\"),\"\",Table7[U. Price]-Table7[Discount \n])","v":50.96},{"$f":"IF(OR(Table7[[#This Row],[Code]]=\"\",Table7[[#This Row],[Qty]]=\"\"),\"\",Table7[Qty]*Table7[Net U. \nPrice])","v":713.44},{"$f":"IF(OR(Table7[[#This Row],[Code]]=\"\",Table7[[#This Row],[Qty]]=\"\"),\"\",Table7[TOTAL]*0.05)","v":35.672000000000004},{"$f":"IF(OR(Table7[[#This Row],[Code]]=\"\",Table7[[#This Row],[Qty]]=\"\"),\"\",Table7[TOTAL]+Table7[VAT])","v":749.11200000000008},{"$f":"IF(OR(Table7[[#This Row],[Code]]=\"\",Table7[[#This Row],[Qty]]=\"\"),\"\",E12*1.05)","v":102.9},{"$f":"IF(Table7[[#This Row],[Code]]=\"\",\"\",VLOOKUP(Table7[[#This Row],[Code]],Codes!$B$2:$E$2231,4,0))","v":0.113},{"$f":"IF(OR(Table7[[#This Row],[Code]]=\"\",Table7[[#This Row],[Qty]]=\"\"),\"\",Table7[[#This Row],[Qty]]*Table7[[#This Row],[U.CC]])","v":1.5820000000000001}]
[null,null,null,{"$f":"IF(Table7[[#This Row],[Code]]=\"\",\"\",VLOOKUP(Table7[[#This Row],[Code]],Codes!$B$2:$E$2231,2,0))","v":""},{"$f":"IF(Table7[[#This Row],[Code]]=\"\",\"\",VLOOKUP(Table7[[#This Row],[Code]],Codes!$B$2:$E$2231,3,0))","v":""},{"$f":"IF(OR(Table7[[#This Row],[Code]]=\"\",Table7[[#This Row],[Qty]]=\"\"),\"\",Table7[U. Price]*$F$10)","v":""},{"$f":"IF(OR(Table7[[#This Row],[Code]]=\"\",Table7[[#This Row],[Qty]]=\"\"),\"\",Table7[U. Price]-Table7[Discount \n])","v":""},{"$f":"IF(OR(Table7[[#This Row],[Code]]=\"\",Table7[[#This Row],[Qty]]=\"\"),\"\",Table7[Qty]*Table7[Net U. \nPrice])","v":""},{"$f":"IF(OR(Table7[[#This Row],[Code]]=\"\",Table7[[#This Row],[Qty]]=\"\"),\"\",Table7[TOTAL]*0.05)","v":""},{"$f":"IF(OR(Table7[[#This Row],[Code]]=\"\",Table7[[#This Row],[Qty]]=\"\"),\"\",Table7[TOTAL]+Table7[VAT])","v":""},{"$f":"IF(OR(Table7[[#This Row],[Code]]=\"\",Table7[[#This Row],[Qty]]=\"\"),\"\",E13*1.05)","v":""},{"$f":"IF(Table7[[#This Row],[Code]]=\"\",\"\",VLOOKUP(Table7[[#This Row],[Code]],Codes!$B$2:$E$2231,4,0))","v":""},{"$f":"IF(OR(Table7[[#This Row],[Code]]=\"\",Table7[[#This Row],[Qty]]=\"\"),\"\",Table7[[#This Row],[Qty]]*Table7[[#This Row],[U.CC]])","v":""}]
[null,null,null,{"$f":"IF(Table7[[#This Row],[Code]]=\"\",\"\",VLOOKUP(Table7[[#This Row],[Code]],Codes!$B$2:$E$2231,2,0))","v":""},{"$f":"IF(Table7[[#This Row],[Code]]=\"\",\"\",VLOOKUP(Table7[[#This Row],[Code]],Codes!$B$2:$E$2231,3,0))","v":""},{"$f":"IF(OR(Table7[[#This Row],[Code]]=\"\",Table7[[#This Row],[Qty]]=\"\"),\"\",Table7[U. Price]*$F$10)","v":""},{"$f":"IF(OR(Table7[[#This Row],[Code]]=\"\",Table7[[#This Row],[Qty]]=\"\"),\"\",Table7[U. Price]-Table7[Discount \n])","v":""},{"$f":"IF(OR(Table7[[#This Row],[Code]]=\"\",Table7[[#This Row],[Qty]]=\"\"),\"\",Table7[Qty]*Table7[Net U. \nPrice])","v":""},{"$f":"IF(OR(Table7[[#This Row],[Code]]=\"\",Table7[[#This Row],[Qty]]=\"\"),\"\",Table7[TOTAL]*0.05)","v":""},{"$f":"IF(OR(Table7[[#This Row],[Code]]=\"\",Table7[[#This Row],[Qty]]=\"\"),\"\",Table7[TOTAL]+Table7[VAT])","v":""},{"$f":"IF(OR(Table7[[#This Row],[Code]]=\"\",Table7[[#This Row],[Qty]]=\"\"),\"\",E14*1.05)","v":""},{"$f":"IF(Table7[[#This Row],[Code]]=\"\",\"\",VLOOKUP(Table7[[#This Row],[Code]],Codes!$B$2:$E$2231,4,0))","v":""},{"$f":"IF(OR(Table7[[#This Row],[Code]]=\"\",Table7[[#This Row],[Qty]]=\"\"),\"\",Table7[[#This Row],[Qty]]*Table7[[#This Row],[U.CC]])","v":""}]
[null,null,null,{"$f":"IF(Table7[[#This Row],[Code]]=\"\",\"\",VLOOKUP(Table7[[#This Row],[Code]],Codes!$B$2:$E$2231,2,0))","v":""},{"$f":"IF(Table7[[#This Row],[Code]]=\"\",\"\",VLOOKUP(Table7[[#This Row],[Code]],Codes!$B$2:$E$2231,3,0))","v":""},{"$f":"IF(OR(Table7[[#This Row],[Code]]=\"\",Table7[[#This Row],[Qty]]=\"\"),\"\",Table7[U. Price]*$F$10)","v":""},{"$f":"IF(OR(Table7[[#This Row],[Code]]=\"\",Table7[[#This Row],[Qty]]=\"\"),\"\",Table7[U. Price]-Table7[Discount \n])","v":""},{"$f":"IF(OR(Table7[[#This Row],[Code]]=\"\",Table7[[#This Row],[Qty]]=\"\"),\"\",Table7[Qty]*Table7[Net U. \nPrice])","v":""},{"$f":"IF(OR(Table7[[#This Row],[Code]]=\"\",Table7[[#This Row],[Qty]]=\"\"),\"\",Table7[TOTAL]*0.05)","v":""},{"$f":"IF(OR(Table7[[#This Row],[Code]]=\"\",Table7[[#This Row],[Qty]]=\"\"),\"\",Table7[TOTAL]+Table7[VAT])","v":""},{"$f":"IF(OR(Table7[[#This Row],[Code]]=\"\",Table7[[#This Row],[Qty]]=\"\"),\"\",E15*1.05)","v":""},{"$f":"IF(Table7[[#This Row],[Code]]=\"\",\"\",VLOOKUP(Table7[[#This Row],[Code]],Codes!$B$2:$E$2231,4,0))","v":""},{"$f":"IF(OR(Table7[[#This Row],[Code]]=\"\",Table7[[#This Row],[Qty]]=\"\"),\"\",Table7[[#This Row],[Qty]]*Table7[[#This Row],[U.CC]])","v":""}]
{"$rows_left_out":27}
{"sheet":"Codes","index":2,"n_rows":26,"n_cols":5,"rows_kept":26,"cut":false,"hidden":false,"merged":[]}
["Codes","Code","Item","Ret Price","CC"]
[null,14,"Aloe Bath Gelèe ",71.25,8.2000000000000003E-2]
[null,15,"Forever Alove Vera Gel ",98,0.113]
[null,22,"Forever Alove Lips ",13.75,1.6E-2]
[null,28,"Forever Bright Toothgel ",29.75,3.5000000000000003E-2]
[null,51,"Aloe Proplis Crème ",76.75,8.8999999999999996E-2]
[null,61,"Aloe Vera Gelly ",58,6.7000000000000004E-2]
[null,62,"Aloe Lotion ",58,6.8000000000000005E-2]
[null,63,"Aloe Moisturizing Lotion ",58,6.8000000000000005E-2]
[null,64,"Aloe Heat Lotion ",58,6.8000000000000005E-2]
[null,67,"Aloe Evershield Deodorant ",28,3.2000000000000001E-2]
[null,70,"Gentleman's Pride",58,6.7000000000000004E-2]
[null,199,"Aloe Sunscreen  ",58,6.7000000000000004E-2]
[null,207,"Forever Bee Honey ",65.25,7.4999999999999997E-2]
[null,238,"Forever Aloe Scrub ",60.75,7.0000000000000007E-2]
{"$rows_left_out":12}
{"sheet":"Invoices","index":3,"n_rows":1469,"n_cols":17,"rows_kept":1469,"cut":false,"hidden":false,"merged":[]}
["INVOICES","#","Customer\nالعميل","Invoice #\nرقم الفاتورة","Invoice Amount\nمبلغ الفاتورة","Invoice Date\nتاريخ الفاتورة","Notes\nملاحظات"]
[{"$f":"IF(ISNUMBER(SEARCH(STATEMENT!$F$9,Table4[Customer\nالعميل])),MAX($A$1:A1)+1,0)","v":1},{"$f":"IF(OR(C2=\"\",Table4[[#Headers],[Customer\nالعميل]]=\"\"),\"\",MAX($B$1:B1)+1)","v":1},"Dallah Healthcare Co. / Dallah Hospital",28,3540.23,"2017-07-04"]
[{"$f":"IF(ISNUMBER(SEARCH(STATEMENT!$F$9,Table4[Customer\nالعميل])),MAX($A$1:A2)+1,0)","v":2},{"$f":"IF(OR(C3=\"\",Table4[[#Headers],[Customer\nالعميل]]=\"\"),\"\",MAX($B1:B$2)+1)","v":2},"Dallah Healthcare Co. / Dallah Hospital",27,1523.63,"2017-07-04"]
[{"$f":"IF(ISNUMBER(SEARCH(STATEMENT!$F$9,Table4[Customer\nالعميل])),MAX($A$1:A3)+1,0)","v":0},{"$f":"IF(OR(C4=\"\",Table4[[#Headers],[Customer\nالعميل]]=\"\"),\"\",MAX($B$1:B3)+1)","v":3},"Moath Abdul Raqib",16214,673.7,"2017-07-24"]
[{"$f":"IF(ISNUMBER(SEARCH(STATEMENT!$F$9,Table4[Customer\nالعميل])),MAX($A$1:A4)+1,0)","v":0},{"$f":"IF(OR(C5=\"\",Table4[[#Headers],[Customer\nالعميل]]=\"\"),\"\",MAX($B$1:B4)+1)","v":4},"Zawaq Alasal",4,1385,"2017-08-05"]
[{"$f":"IF(ISNUMBER(SEARCH(STATEMENT!$F$9,Table4[Customer\nالعميل])),MAX($A$1:A5)+1,0)","v":0},{"$f":"IF(OR(C6=\"\",Table4[[#Headers],[Customer\nالعميل]]=\"\"),\"\",MAX($B$1:B5)+1)","v":5},"AlKhair Pharmacy",10,1485.75,"2017-09-03"]
[{"$f":"IF(ISNUMBER(SEARCH(STATEMENT!$F$9,Table4[Customer\nالعميل])),MAX($A$1:A6)+1,0)","v":3},{"$f":"IF(OR(C7=\"\",Table4[[#Headers],[Customer\nالعميل]]=\"\"),\"\",MAX($B$1:B6)+1)","v":6},"Dallah Healthcare Co. / Dallah Hospital",18,637,"2017-09-17",null,null,null,null,null,null,null,null,null,null,"Jun"]
[{"$f":"IF(ISNUMBER(SEARCH(STATEMENT!$F$9,Table4[Customer\nالعميل])),MAX($A$1:A7)+1,0)","v":0},{"$f":"IF(OR(C8=\"\",Table4[[#Headers],[Customer\nالعميل]]=\"\"),\"\",MAX($B$1:B7)+1)","v":7},"Attar AlKuwait ",11,1518.53,"2017-09-23",null,null,null,null,null,null,null,null,null,null,69]
[{"$f":"IF(ISNUMBER(SEARCH(STATEMENT!$F$9,Table4[Customer\nالعميل])),MAX($A$1:A8)+1,0)","v":4},{"$f":"IF(OR(C9=\"\",Table4[[#Headers],[Customer\nالعميل]]=\"\"),\"\",MAX($B$1:B8)+1)","v":8},"Dallah Healthcare Co. / Dallah Hospital",41,2008,"2017-10-28",null,null,null,null,null,null,null,null,null,null,86]
[{"$f":"IF(ISNUMBER(SEARCH(STATEMENT!$F$9,Table4[Customer\nالعميل])),MAX($A$1:A9)+1,0)","v":5},{"$f":"IF(OR(C10=\"\",Table4[[#Headers],[Customer\nالعميل]]=\"\"),\"\",MAX($B$1:B9)+1)","v":9},"Dallah Healthcare Co. / Dallah Hospital",65,2344.96,"2017-10-30",null,null,null,null,null,null,null,null,null,null,41]
[{"$f":"IF(ISNUMBER(SEARCH(STATEMENT!$F$9,Table4[Customer\nالعميل])),MAX($A$1:A10)+1,0)","v":6},{"$f":"IF(OR(C11=\"\",Table4[[#Headers],[Customer\nالعميل]]=\"\"),\"\",MAX($B$1:B10)+1)","v":10},"Dallah Healthcare Co. / Dallah Hospital",23268,998.26,"2017-11-12",null,null,null,null,null,null,null,null,null,null,37]
[{"$f":"IF(ISNUMBER(SEARCH(STATEMENT!$F$9,Table4[Customer\nالعميل])),MAX($A$1:A11)+1,0)","v":0},{"$f":"IF(OR(C12=\"\",Table4[[#Headers],[Customer\nالعميل]]=\"\"),\"\",MAX($B$1:B11)+1)","v":11},"AlKhair Pharmacy",100,108.6,"2017-11-25",null,null,null,null,null,null,null,null,null,null,28]
[{"$f":"IF(ISNUMBER(SEARCH(STATEMENT!$F$9,Table4[Customer\nالعميل])),MAX($A$1:A12)+1,0)","v":0},{"$f":"IF(OR(C13=\"\",Table4[[#Headers],[Customer\nالعميل]]=\"\"),\"\",MAX($B$1:B12)+1)","v":12},"Attar Alhakeem",126,1049.1099999999999,"2017-11-25"]
[{"$f":"IF(ISNUMBER(SEARCH(STATEMENT!$F$9,Table4[Customer\nالعميل])),MAX($A$1:A13)+1,0)","v":0},{"$f":"IF(OR(C14=\"\",Table4[[#Headers],[Customer\nالعميل]]=\"\"),\"\",MAX($B$1:B13)+1)","v":13},"Zawaq Alasal",1101,1385,"2017-12-01"]
[{"$f":"IF(ISNUMBER(SEARCH(STATEMENT!$F$9,Table4[Customer\nالعميل])),MAX($A$1:A14)+1,0)","v":0},{"$f":"IF(OR(C15=\"\",Table4[[#Headers],[Customer\nالعميل]]=\"\"),\"\",MAX($B$1:B14)+1)","v":14},"AlKhair Pharmacy",26,777.75,"2017-02-12"]
{"$rows_left_out":1455}
{"sheet":"Payments","index":4,"n_rows":1053,"n_cols":6,"rows_kept":1053,"cut":false,"hidden":false,"merged":[[59,1,59,3]]}
["PAYMENTS","#","Customer\nالعميل","Payment Date\nتاريخ الدفع","Paid Amount\nالمبلغ المدفوع","Notes\nملاحظات"]
[{"$f":"IF(ISNUMBER(SEARCH(STATEMENT!$F$9,Table5[Customer\nالعميل])),MAX($A$1:A1)+1,0)","v":0},{"$f":"ROW()-1","v":1},"Mohamed Jazouli","2017-03-04",1000,"INV 22803"]
[{"$f":"IF(ISNUMBER(SEARCH(STATEMENT!$F$9,Table5[Customer\nالعميل])),MAX($A$1:A2)+1,0)","v":1},2,"Dallah Healthcare Co. / Dallah Hospital","2017-10-26",3540.23,"INV 28"]
[{"$f":"IF(ISNUMBER(SEARCH(STATEMENT!$F$9,Table5[Customer\nالعميل])),MAX($A$1:A3)+1,0)","v":2},3,"Dallah Healthcare Co. / Dallah Hospital","2017-10-26",1523.63,"INV 27"]
[{"$f":"IF(ISNUMBER(SEARCH(STATEMENT!$F$9,Table5[Customer\nالعميل])),MAX($A$1:A4)+1,0)","v":0},4,"AlKhair Pharmacy","2017-12-03",500]
[{"$f":"IF(ISNUMBER(SEARCH(STATEMENT!$F$9,Table5[Customer\nالعميل])),MAX($A$1:A5)+1,0)","v":3},5,"Dallah Healthcare Co. / Dallah Hospital","2018-01-17",2344.96,"INV 65"]
[{"$f":"IF(ISNUMBER(SEARCH(STATEMENT!$F$9,Table5[Customer\nالعميل])),MAX($A$1:A6)+1,0)","v":4},6,"Dallah Healthcare Co. / Dallah Hospital","2018-01-17",2008,"INV 41"]
[{"$f":"IF(ISNUMBER(SEARCH(STATEMENT!$F$9,Table5[Customer\nالعميل])),MAX($A$1:A7)+1,0)","v":5},7,"Dallah Healthcare Co. / Dallah Hospital","2018-01-17",998.26,"INV 23268"]
[{"$f":"IF(ISNUMBER(SEARCH(STATEMENT!$F$9,Table5[Customer\nالعميل])),MAX($A$1:A8)+1,0)","v":6},8,"Dallah Healthcare Co. / Dallah Hospital","2018-01-17",637,"INV 18"]
[{"$f":"IF(ISNUMBER(SEARCH(STATEMENT!$F$9,Table5[Customer\nالعميل])),MAX($A$1:A9)+1,0)","v":0},9,"Attar Alhakeem","2018-01-25",1049.1099999999999,"INV 126  16-4-2018 paid 849.11, earlier 200"]
[{"$f":"IF(ISNUMBER(SEARCH(STATEMENT!$F$9,Table5[Customer\nالعميل])),MAX($A$1:A10)+1,0)","v":7},10,"Dallah Healthcare Co. / Dallah Hospital","2018-03-10",3782.76,"INV 12"]
[{"$f":"IF(ISNUMBER(SEARCH(STATEMENT!$F$9,Table5[Customer\nالعميل])),MAX($A$1:A11)+1,0)","v":0},11,"AlKhair Pharmacy","2018-04-12",108.6]
[{"$f":"IF(ISNUMBER(SEARCH(STATEMENT!$F$9,Table5[Customer\nالعميل])),MAX($A$1:A12)+1,0)","v":0},12,"Mohamed Jazouli","2018-04-20",628,"INV 5000"]
[{"$f":"IF(ISNUMBER(SEARCH(STATEMENT!$F$9,Table5[Customer\nالعميل])),MAX($A$1:A13)+1,0)","v":0},13,"AlKhair Pharmacy","2018-04-24",500]
[{"$f":"IF(ISNUMBER(SEARCH(STATEMENT!$F$9,Table5[Customer\nالعميل])),MAX($A$1:A14)+1,0)","v":8},14,"Dallah Healthcare Co. / Dallah Hospital","2018-04-28",2354.63,"INV 102"]
{"$rows_left_out":1039}
{"sheet":"Customers","index":5,"n_rows":38,"n_cols":13,"rows_kept":38,"cut":false,"hidden":false,"merged":[]}
["CUSTOMERS","#","Customer","FOB ID","To Pay","Paid","Balance"," qty","VAT Registration","Mobile1","Office1","Address","Notes"]
[null,{"$f":"IF(Table3[[#This Row],[Customer]]=\"\",\"\",ROW()-1)","v":1},"AlGaili Omar Bakheet",822682,{"$f":"SUMIF(Table4[Customer\nالعميل],Table3[[#This Row],[Customer]],Table4[Invoice Amount\nمبلغ الفاتورة])","v":958.38},{"$f":"SUMIF(Table5[Customer\nالعميل],Table3[[#This Row],[Customer]],Table5[Paid Amount\nالمبلغ المدفوع])","v":0},{"$f":"Table3[[#This Row],[To Pay]]-Table3[[#This Row],[Paid]]","v":958.38},{"$f":"COUNTIF(Table4[Customer\nالعميل],Table3[[#This Row],[Customer]])","v":1}]
[null,{"$f":"IF(Table3[[#This Row],[Customer]]=\"\",\"\",ROW()-1)","v":2},"AlKhair Pharmacy",800037,{"$f":"SUMIF(Table4[Customer\nالعميل],Table3[[#This Row],[Customer]],Table4[Invoice Amount\nمبلغ الفاتورة])","v":2653.63},{"$f":"SUMIF(Table5[Customer\nالعميل],Table3[[#This Row],[Customer]],Table5[Paid Amount\nالمبلغ المدفوع])","v":1408.6},{"$f":"Table3[[#This Row],[To Pay]]-Table3[[#This Row],[Paid]]","v":1245.0300000000002},{"$f":"COUNTIF(Table4[Customer\nالعميل],Table3[[#This Row],[Customer]])","v":5}]
[null,{"$f":"IF(Table3[[#This Row],[Customer]]=\"\",\"\",ROW()-1)","v":3},"Attar Alhakeem",798004,{"$f":"SUMIF(Table4[Customer\nالعميل],Table3[[#This Row],[Customer]],Table4[Invoice Amount\nمبلغ الفاتورة])","v":5337.61},{"$f":"SUMIF(Table5[Customer\nالعميل],Table3[[#This Row],[Customer]],Table5[Paid Amount\nالمبلغ المدفوع])","v":1049.1099999999999},{"$f":"Table3[[#This Row],[To Pay]]-Table3[[#This Row],[Paid]]","v":4288.5},{"$f":"COUNTIF(Table4[Customer\nالعميل],Table3[[#This Row],[Customer]])","v":4}]
[null,{"$f":"IF(Table3[[#This Row],[Customer]]=\"\",\"\",ROW()-1)","v":4},"Attar AlKuwait",800042,{"$f":"SUMIF(Table4[Customer\nالعميل],Table3[[#This Row],[Customer]],Table4[Invoice Amount\nمبلغ الفاتورة])","v":0},{"$f":"SUMIF(Table5[Customer\nالعميل],Table3[[#This Row],[Customer]],Table5[Paid Amount\nالمبلغ المدفوع])","v":1600},{"$f":"Table3[[#This Row],[To Pay]]-Table3[[#This Row],[Paid]]","v":-1600},{"$f":"COUNTIF(Table4[Customer\nالعميل],Table3[[#This Row],[Customer]])","v":0}]
[null,{"$f":"IF(Table3[[#This Row],[Customer]]=\"\",\"\",ROW()-1)","v":5},"Dallah Healthcare Co. / Dallah Hospital",775962,{"$f":"SUMIF(Table4[Customer\nالعميل],Table3[[#This Row],[Customer]],Table4[Invoice Amount\nمبلغ الفاتورة])","v":39036.820000000014},{"$f":"SUMIF(Table5[Customer\nالعميل],Table3[[#This Row],[Customer]],Table5[Paid Amount\nالمبلغ المدفوع])","v":37166.770000000011},{"$f":"Table3[[#This Row],[To Pay]]-Table3[[#This Row],[Paid]]","v":1870.0500000000029},{"$f":"COUNTIF(Table4[Customer\nالعميل],Table3[[#This Row],[Customer]])","v":16},300049358500003,null,null,"King Fahd Road, Alnakheel Street , Riyadh, KSA"]
[null,{"$f":"IF(Table3[[#This Row],[Customer]]=\"\",\"\",ROW()-1)","v":6},"Hala Mohamed Alomdeh",725343,{"$f":"SUMIF(Table4[Customer\nالعميل],Table3[[#This Row],[Customer]],Table4[Invoice Amount\nمبلغ الفاتورة])","v":1831.54},{"$f":"SUMIF(Table5[Customer\nالعميل],Table3[[#This Row],[Customer]],Table5[Paid Amount\nالمبلغ المدفوع])","v":0},{"$f":"Table3[[#This Row],[To Pay]]-Table3[[#This Row],[Paid]]","v":1831.54},{"$f":"COUNTIF(Table4[Customer\nالعميل],Table3[[#This Row],[Customer]])","v":1}]
[null,{"$f":"IF(Table3[[#This Row],[Customer]]=\"\",\"\",ROW()-1)","v":7},"Ibrahim Bakhit",825009,{"$f":"SUMIF(Table4[Customer\nالعميل],Table3[[#This Row],[Customer]],Table4[Invoice Amount\nمبلغ الفاتورة])","v":79.66},{"$f":"SUMIF(Table5[Customer\nالعميل],Table3[[#This Row],[Customer]],Table5[Paid Amount\nالمبلغ المدفوع])","v":0},{"$f":"Table3[[#This Row],[To Pay]]-Table3[[#This Row],[Paid]]","v":79.66},{"$f":"COUNTIF(Table4[Customer\nالعميل],Table3[[#This Row],[Customer]])","v":1}]
[null,{"$f":"IF(Table3[[#This Row],[Customer]]=\"\",\"\",ROW()-1)","v":8},"Moath Abdul Raqib",784382,{"$f":"SUMIF(Table4[Customer\nالعميل],Table3[[#This Row],[Customer]],Table4[Invoice Amount\nمبلغ الفاتورة])","v":673.7},{"$f":"SUMIF(Table5[Customer\nالعميل],Table3[[#This Row],[Customer]],Table5[Paid Amount\nالمبلغ المدفوع])","v":0},{"$f":"Table3[[#This Row],[To Pay]]-Table3[[#This Row],[Paid]]","v":673.7},{"$f":"COUNTIF(Table4[Customer\nالعميل],Table3[[#This Row],[Customer]])","v":1}]
[null,{"$f":"IF(Table3[[#This Row],[Customer]]=\"\",\"\",ROW()-1)","v":9},"Mohamed Abduldayem Ahmad",807366,{"$f":"SUMIF(Table4[Customer\nالعميل],Table3[[#This Row],[Customer]],Table4[Invoice Amount\nمبلغ الفاتورة])","v":1761.87},{"$f":"SUMIF(Table5[Customer\nالعميل],Table3[[#This Row],[Customer]],Table5[Paid Amount\nالمبلغ المدفوع])","v":0},{"$f":"Table3[[#This Row],[To Pay]]-Table3[[#This Row],[Paid]]","v":1761.87},{"$f":"COUNTIF(Table4[Customer\nالعميل],Table3[[#This Row],[Customer]])","v":1}]
[null,{"$f":"IF(Table3[[#This Row],[Customer]]=\"\",\"\",ROW()-1)","v":10},"Mohamed Jazouli",726477,{"$f":"SUMIF(Table4[Customer\nالعميل],Table3[[#This Row],[Customer]],Table4[Invoice Amount\nمبلغ الفاتورة])","v":3959.59},{"$f":"SUMIF(Table5[Customer\nالعميل],Table3[[#This Row],[Customer]],Table5[Paid Amount\nالمبلغ المدفوع])","v":1628},{"$f":"Table3[[#This Row],[To Pay]]-Table3[[#This Row],[Paid]]","v":2331.59},{"$f":"COUNTIF(Table4[Customer\nالعميل],Table3[[#This Row],[Customer]])","v":3}]
[null,{"$f":"IF(Table3[[#This Row],[Customer]]=\"\",\"\",ROW()-1)","v":11},"Yousri Mousa Othman",769448,{"$f":"SUMIF(Table4[Customer\nالعميل],Table3[[#This Row],[Customer]],Table4[Invoice Amount\nمبلغ الفاتورة])","v":860.82999999999993},{"$f":"SUMIF(Table5[Customer\nالعميل],Table3[[#This Row],[Customer]],Table5[Paid Amount\nالمبلغ المدفوع])","v":0},{"$f":"Table3[[#This Row],[To Pay]]-Table3[[#This Row],[Paid]]","v":860.82999999999993},{"$f":"COUNTIF(Table4[Customer\nالعميل],Table3[[#This Row],[Customer]])","v":2}]
[null,{"$f":"IF(Table3[[#This Row],[Customer]]=\"\",\"\",ROW()-1)","v":12},"Zawaq Alasal",787477,{"$f":"SUMIF(Table4[Customer\nالعميل],Table3[[#This Row],[Customer]],Table4[Invoice Amount\nمبلغ الفاتورة])","v":2770},{"$f":"SUMIF(Table5[Customer\nالعميل],Table3[[#This Row],[Customer]],Table5[Paid Amount\nالمبلغ المدفوع])","v":0},{"$f":"Table3[[#This Row],[To Pay]]-Table3[[#This Row],[Paid]]","v":2770},{"$f":"COUNTIF(Table4[Customer\nالعميل],Table3[[#This Row],[Customer]])","v":2}]
[null,{"$f":"IF(Table3[[#This Row],[Customer]]=\"\",\"\",ROW()-1)","v":""},null,null,{"$f":"SUMIF(Table4[Customer\nالعميل],Table3[[#This Row],[Customer]],Table4[Invoice Amount\nمبلغ الفاتورة])","v":0},{"$f":"SUMIF(Table5[Customer\nالعميل],Table3[[#This Row],[Customer]],Table5[Paid Amount\nالمبلغ المدفوع])","v":0},{"$f":"Table3[[#This Row],[To Pay]]-Table3[[#This Row],[Paid]]","v":0},{"$f":"COUNTIF(Table4[Customer\nالعميل],Table3[[#This Row],[Customer]])","v":0}]
[null,{"$f":"IF(Table3[[#This Row],[Customer]]=\"\",\"\",ROW()-1)","v":""},null,null,{"$f":"SUMIF(Table4[Customer\nالعميل],Table3[[#This Row],[Customer]],Table4[Invoice Amount\nمبلغ الفاتورة])","v":0},{"$f":"SUMIF(Table5[Customer\nالعميل],Table3[[#This Row],[Customer]],Table5[Paid Amount\nالمبلغ المدفوع])","v":0},{"$f":"Table3[[#This Row],[To Pay]]-Table3[[#This Row],[Paid]]","v":0},{"$f":"COUNTIF(Table4[Customer\nالعميل],Table3[[#This Row],[Customer]])","v":0}]
{"$rows_left_out":23}