{"text_format":"1","workbook":"xlsx","n_sheets":3,"sheets":["Data","اسعار المحطات","الذين استلموا اجورهم"],"not_rendered":{"charts":0,"images":0,"macros":1,"external_links":0,"defined_names":5,"comments":0,"pivot_tables":0},"unopened":[],"bounds":{"document_bytes":16777216,"sheet_cells":100000,"rows_first":2000,"rows_last":500,"rows_between":2000,"halvings":0,"cell_chars":16384,"cell_head_chars":4096},"cells_cut":0,"cells_raw":0,"read":"whole","date_system":"1900"}

{"sheet":"Data","index":0,"n_rows":15,"n_cols":9,"rows_kept":15,"cut":false,"hidden":false,"merged":[]}
["تاريخ التحميل","اسم السائق","رقم المستند","رقم السيارة","الكمية","ت","اسم المحطة","المنتوج","السعر"]
["2018-01-01","عباس خليل عثمان",610417,1,38072,4,"الحقول","نفط",{"$f":"VLOOKUP(G2,'اسعار المحطات'!$A$2:$B$293,2,0)","v":200}]
["2018-01-01","عباس خليل عثمان",610416,1,35143,6,"الداخل","بنزين",{"$f":"VLOOKUP(G3,'اسعار المحطات'!$A$2:$B$293,2,0)","v":210}]
["2018-01-01","عباس خليل عثمان",610425,2,38607,9,"الجديدة","نفط",{"$f":"VLOOKUP(G4,'اسعار المحطات'!$A$2:$B$293,2,0)","v":215}]
["2018-01-01","فراس محمود احمد",610275,3,35186,15,"الشاكر","نفط",{"$f":"VLOOKUP(G5,'اسعار المحطات'!$A$2:$B$293,2,0)","v":195}]
["2018-01-01","فراس محمود احمد",610274,4,35186,25,"عطارد","نفط",{"$f":"VLOOKUP(G6,'اسعار المحطات'!$A$2:$B$293,2,0)","v":20}]
["2018-01-01","فراس محمود احمد",610461,4,42351,1,"الجبل","نفط",{"$f":"VLOOKUP(G7,'اسعار المحطات'!$A$2:$B$293,2,0)","v":35}]
["2018-01-01","فراس محمود احمد",610271,5,33914,2,"القديمة","نفط",{"$f":"VLOOKUP(G8,'اسعار المحطات'!$A$2:$B$293,2,0)","v":55}]
["2018-01-01","فراس محمود احمد",610460,6,34964,3,"الفارس","نفط",{"$f":"VLOOKUP(G9,'اسعار المحطات'!$A$2:$B$293,2,0)","v":65}]
["2018-01-01","فراس محمود احمد",610423,7,35201,5,"5 كيلو","نفط",{"$f":"VLOOKUP(G10,'اسعار المحطات'!$A$2:$B$293,2,0)","v":41}]
["2018-01-01","علي صادق صالح ",610269,8,41557,7,"18 كيلو","نفط",{"$f":"VLOOKUP(G11,'اسعار المحطات'!$A$2:$B$293,2,0)","v":72}]
["2018-01-01","علي صادق صالح ",610462,9,33487,8,"طليحة","نفط",{"$f":"VLOOKUP(G12,'اسعار المحطات'!$A$2:$B$293,2,0)","v":70}]
["2018-01-01","علي صادق صالح ",610455,10,42269,10,"الفارس1","نفط",{"$f":"VLOOKUP(G13,'اسعار المحطات'!$A$2:$B$293,2,0)","v":100}]
["2018-01-01","عبدالله عبدالكريم",610465,11,34897,11,"الجديدة1","نفط",{"$f":"VLOOKUP(G14,'اسعار المحطات'!$A$2:$B$293,2,0)","v":104}]
["2018-01-10","عبدالله عبدالكريم",610421,11,40579,12,"العربي","كاز",{"$f":"VLOOKUP(G15,'اسعار المحطات'!$A$2:$B$293,2,0)","v":120}]

{"sheet":"اسعار المحطات","index":1,"n_rows":15,"n_cols":2,"rows_kept":15,"cut":false,"hidden":false,"merged":[]}
["اسم المحطة","السعر"]
["الحقول",200]
["الداخل",210]
["الجديدة",215]
["الشاكر",195]
["عطارد",20]
["الجبل",35]
["القديمة",55]
["الفارس",65]
["5 كيلو",41]
["18 كيلو",72]
["طليحة",70]
["الفارس1",100]
["الجديدة1",104]
["العربي",120]

{"sheet":"الذين استلموا اجورهم","index":2,"n_rows":26,"n_cols":15,"rows_kept":26,"cut":false,"hidden":false,"merged":[]}
["تاريخ التحميل","اسم السائق","رقم المستند","رقم السيارة","الكمية","ت","اسم المحطة","المنتوج","السعر",null,"من تاريخ","الى تاريخ","نوع المنتوج",null,"ارقام السيارات المستثناة من الترحيل"]
["2018-01-01","عباس خليل عثمان",610425,2,38607,9,"الجديدة","نفط",215,null,"2018-01-01","2018-01-05","نفط",null,1]
["2018-01-01","فراس محمود احمد",610275,3,35186,15,"الشاكر","نفط",195,null,null,null,null,null,5]
["2018-01-01","فراس محمود احمد",610460,6,34964,3,"الفارس","نفط",65,null,null,null,null,null,7]
["2018-01-01","علي صادق صالح ",610269,8,41557,7,"18 كيلو","نفط",72,null,null,null,null,null,9]
["2018-01-01","علي صادق صالح ",610455,10,42269,10,"الفارس1","نفط",100,null,null,null,null,null,11]
[]
[]
[]
[null,null,null,null,null,null,null,null,null,null,null,"زيادة مدى الأرقام المستثناة من الترحيل ليصل الى اكثر من 25"]
[]
[]
[]
[]
[]
[]
[]
[]
[]
[]
[]
[]
[]
[]
[]
[null,null,null,null,null,null,null,null,null,null,null,null,null,null,4]