{"text_format":"1","workbook":"xlsx","n_sheets":5,"sheets":["Data","Lists","Engine","مهارات الحياة","حماية الطفل"],"not_rendered":{"charts":0,"images":0,"macros":0,"external_links":0,"defined_names":9,"comments":0,"pivot_tables":0},"unopened":[],"bounds":{"document_bytes":16777216,"sheet_cells":100000,"rows_first":2000,"rows_last":500,"rows_between":2000,"halvings":0,"cell_chars":16384,"cell_head_chars":4096},"cells_cut":0,"cells_raw":0,"read":"whole","date_system":"1900"}

{"sheet":"Data","index":0,"n_rows":16,"n_cols":15,"rows_kept":16,"cut":false,"hidden":false,"merged":[]}
[]
[]
[]
[]
[]
[]
[null,"الرقم","الاسم","اسم الام","Full Name","تاريخ الميلاد","الجنس","رقم الاثبات","الجنسية","العنوان","الهاتف","البرنامج","المشروع","تاريخ التسجيل","المركز"]
[null,null,null,null,null,null,null,null,null,null,null,"مهارات الحياة"]
[null,null,null,null,null,null,null,null,null,null,null,"حماية الطفل"]
[null,null,null,null,null,null,null,null,null,null,null,"مهارات الحياة"]
[null,null,null,null,null,null,null,null,null,null,null,"حماية الطفل"]
[null,null,null,null,null,null,null,null,null,null,null,"مهارات الحياة"]
[null,null,null,null,null,null,null,null,null,null,null,"حماية الطفل"]
[null,null,null,null,null,null,null,null,null,null,null,"مهارات الحياة"]
[null,null,null,null,null,null,null,null,null,null,null,"حماية الطفل"]
[null,null,null,null,null,null,null,null,null,null,null,"مهارات الحياة"]

{"sheet":"Lists","index":1,"n_rows":34,"n_cols":16,"rows_kept":34,"cut":false,"hidden":true,"merged":[]}
[]
[]
[]
[null,"مستفيد","ذكر","l","n","مستفيد","مهارات الحياة","مسجل","مكاني 1",null,{"$f":"COUNTIF(Data!M:M,Lists!F4)","v":0},null,{"$f":"COUNTIF(Data!P:P,Lists!H4)","v":0},1,2015,1]
[null,"غير مستفيد","أنثى","o","t","غير مستفيد","حماية الطفل","غير مسجل","مكاني 2",null,{"$f":"COUNTIF(Data!N:N,Lists!F4)","v":0},null,{"$f":"COUNTIF(Data!Q:Q,Lists!H4)","v":0},2,2016,2]
[null,null,null,"s","r",null,"خدمات دعم التعليم",null,"مكاني 3",null,{"$f":"COUNTIF(Data!O:O,Lists!F4)","v":0},null,{"$f":"COUNTIF(Data!R:R,Lists!H4)","v":0},3,2017,3]
[null,null,null,null,null,null,null,null,null,null,{"$f":"SUM(K4:K6)","v":0},null,{"$f":"SUM(M4:M6)","v":0},4,2018,4]
[null,null,null,null,null,null,null,null,null,null,null,null,null,5,2019,5]
[null,null,null,null,null,null,null,null,null,null,null,null,null,6,null,6]
[null,null,null,null,null,null,null,null,null,null,null,null,null,7,null,7]
[null,null,null,null,null,null,null,null,null,null,null,null,null,8,null,8]
[null,null,null,null,null,null,null,null,null,null,null,null,null,9,null,9]
[null,null,null,null,null,null,null,null,null,null,null,null,null,10,null,10]
[null,null,null,null,null,null,null,null,null,null,null,null,null,11,null,11]
[null,null,null,null,null,null,null,null,null,null,null,null,null,12,null,12]
[null,null,null,null,null,null,null,null,null,null,null,null,null,null,null,13]
[null,null,null,null,null,null,null,null,null,null,null,null,null,null,null,14]
[null,null,null,null,null,null,null,null,null,null,null,null,null,null,null,15]
[null,null,null,null,null,null,null,null,null,null,null,null,null,null,null,16]
[null,null,null,null,null,null,null,null,null,null,null,null,null,null,null,17]
[null,null,null,null,null,null,null,null,null,null,null,null,null,null,null,18]
[null,null,null,null,null,null,null,null,null,null,null,null,null,null,null,19]
[null,null,null,null,null,null,null,null,null,null,null,null,null,null,null,20]
[null,null,null,null,null,null,null,null,null,null,null,null,null,null,null,21]
[null,null,null,null,null,null,null,null,null,null,null,null,null,null,null,22]
[null,null,null,null,null,null,null,null,null,null,null,null,null,null,null,23]
[null,null,null,null,null,null,null,null,null,null,null,null,null,null,null,24]
[null,null,null,null,null,null,null,null,null,null,null,null,null,null,null,25]
[null,null,null,null,null,null,null,null,null,null,null,null,null,null,null,26]
[null,null,null,null,null,null,null,null,null,null,null,null,null,null,null,27]
[null,null,null,null,null,null,null,null,null,null,null,null,null,null,null,28]
[null,null,null,null,null,null,null,null,null,null,null,null,null,null,null,29]
[null,null,null,null,null,null,null,null,null,null,null,null,null,null,null,30]
[null,null,null,null,null,null,null,null,null,null,null,null,null,null,null,31]

{"sheet":"Engine","index":2,"n_rows":5,"n_cols":3,"rows_kept":5,"cut":false,"hidden":true,"merged":[]}
[]
[]
[null,{"$f":"COUNTA(Data!E1:E10000)-1","v":0},"Total entries in database - maximum 10000"]
[null,"EDIT","Mode"]
[null,1,"Row Store"]

{"sheet":"مهارات الحياة","index":3,"n_rows":3,"n_cols":13,"rows_kept":3,"cut":false,"hidden":false,"merged":[[0,0,1,10]]}
["قاعدة الحشد / برنامج مهارات الحياة"]
[]
["الرقم","الاسم","اسم الام","تاريخ الميلاد","الجنس","رقم الاثبات","الجنسية","العنوان","الهاتف","البرنامج","المشروع","تاريخ التسجيل","المركز"]

{"sheet":"حماية الطفل","index":4,"n_rows":3,"n_cols":13,"rows_kept":3,"cut":false,"hidden":false,"merged":[[0,0,1,14]]}
["قاعدة الحشد / برنامج حماية الطفل "]
[]
["الرقم","الاسم","اسم الام","تاريخ الميلاد","الجنس","رقم الاثبات","الجنسية","العنوان","الهاتف","البرنامج","المشروع","تاريخ التسجيل","المركز"]