{"text_format":"1","workbook":"xlsx","n_sheets":5,"sheets":["Data","Lists","Engine","مهارات الحياة","حماية الطفل"],"not_rendered":{"charts":0,"images":0,"macros":1,"external_links":0,"defined_names":10,"comments":0,"pivot_tables":0},"unopened":[],"bounds":{"document_bytes":16777216,"sheet_cells":100000,"rows_first":2000,"rows_last":500,"rows_between":2000,"halvings":0,"cell_chars":16384,"cell_head_chars":4096},"cells_cut":0,"cells_raw":0,"read":"whole","date_system":"1900"}

{"sheet":"Data","index":0,"n_rows":359,"n_cols":14,"rows_kept":359,"cut":false,"hidden":false,"merged":[]}
["الرقم","الاسم","اسم الام","Full Name","تاريخ الميلاد","الجنس","رقم الاثبات","الجنسية","العنوان","الهاتف","البرنامج","المشروع","تاريخ التسجيل","المركز"]
[{"$f":"IF(B2=\"\",\"\",SUBTOTAL(3,$B$2:B2))","v":""}]
[{"$f":"IF(B3=\"\",\"\",SUBTOTAL(3,$B$2:B3))","v":""}]
[{"$f":"IF(B4=\"\",\"\",SUBTOTAL(3,$B$2:B4))","v":""}]
[{"$f":"IF(B5=\"\",\"\",SUBTOTAL(3,$B$2:B5))","v":""}]
[{"$f":"IF(B6=\"\",\"\",SUBTOTAL(3,$B$2:B6))","v":""}]
[{"$f":"IF(B7=\"\",\"\",SUBTOTAL(3,$B$2:B7))","v":""}]
[{"$f":"IF(B8=\"\",\"\",SUBTOTAL(3,$B$2:B8))","v":""}]
[{"$f":"IF(B9=\"\",\"\",SUBTOTAL(3,$B$2:B9))","v":""}]
[{"$f":"IF(B10=\"\",\"\",SUBTOTAL(3,$B$2:B10))","v":""}]
[{"$f":"IF(B11=\"\",\"\",SUBTOTAL(3,$B$2:B11))","v":""}]
[{"$f":"IF(B12=\"\",\"\",SUBTOTAL(3,$B$2:B12))","v":""}]
[{"$f":"IF(B13=\"\",\"\",SUBTOTAL(3,$B$2:B13))","v":""}]
[{"$f":"IF(B14=\"\",\"\",SUBTOTAL(3,$B$2:B14))","v":""}]
[{"$f":"IF(B15=\"\",\"\",SUBTOTAL(3,$B$2:B15))","v":""}]
[{"$f":"IF(B16=\"\",\"\",SUBTOTAL(3,$B$2:B16))","v":""}]
[{"$f":"IF(B17=\"\",\"\",SUBTOTAL(3,$B$2:B17))","v":""}]
[{"$f":"IF(B18=\"\",\"\",SUBTOTAL(3,$B$2:B18))","v":""}]
[{"$f":"IF(B19=\"\",\"\",SUBTOTAL(3,$B$2:B19))","v":""}]
[{"$f":"IF(B20=\"\",\"\",SUBTOTAL(3,$B$2:B20))","v":""}]
[{"$f":"IF(B21=\"\",\"\",SUBTOTAL(3,$B$2:B21))","v":""}]
[{"$f":"IF(B22=\"\",\"\",SUBTOTAL(3,$B$2:B22))","v":""}]
[{"$f":"IF(B23=\"\",\"\",SUBTOTAL(3,$B$2:B23))","v":""}]
[{"$f":"IF(B24=\"\",\"\",SUBTOTAL(3,$B$2:B24))","v":""}]
[{"$f":"IF(B25=\"\",\"\",SUBTOTAL(3,$B$2:B25))","v":""}]
[{"$f":"IF(B26=\"\",\"\",SUBTOTAL(3,$B$2:B26))","v":""}]
[{"$f":"IF(B27=\"\",\"\",SUBTOTAL(3,$B$2:B27))","v":""}]
[{"$f":"IF(B28=\"\",\"\",SUBTOTAL(3,$B$2:B28))","v":""}]
[{"$f":"IF(B29=\"\",\"\",SUBTOTAL(3,$B$2:B29))","v":""}]
[{"$f":"IF(B30=\"\",\"\",SUBTOTAL(3,$B$2:B30))","v":""}]
[{"$f":"IF(B31=\"\",\"\",SUBTOTAL(3,$B$2:B31))","v":""}]
[{"$f":"IF(B32=\"\",\"\",SUBTOTAL(3,$B$2:B32))","v":""}]
[{"$f":"IF(B33=\"\",\"\",SUBTOTAL(3,$B$2:B33))","v":""}]
[{"$f":"IF(B34=\"\",\"\",SUBTOTAL(3,$B$2:B34))","v":""}]
[{"$f":"IF(B35=\"\",\"\",SUBTOTAL(3,$B$2:B35))","v":""}]
[{"$f":"IF(B36=\"\",\"\",SUBTOTAL(3,$B$2:B36))","v":""}]
[{"$f":"IF(B37=\"\",\"\",SUBTOTAL(3,$B$2:B37))","v":""}]
[{"$f":"IF(B38=\"\",\"\",SUBTOTAL(3,$B$2:B38))","v":""}]
[{"$f":"IF(B39=\"\",\"\",SUBTOTAL(3,$B$2:B39))","v":""}]
[{"$f":"IF(B40=\"\",\"\",SUBTOTAL(3,$B$2:B40))","v":""}]
[{"$f":"IF(B41=\"\",\"\",SUBTOTAL(3,$B$2:B41))","v":""}]
[{"$f":"IF(B42=\"\",\"\",SUBTOTAL(3,$B$2:B42))","v":""}]
[{"$f":"IF(B43=\"\",\"\",SUBTOTAL(3,$B$2:B43))","v":""}]
[{"$f":"IF(B44=\"\",\"\",SUBTOTAL(3,$B$2:B44))","v":""}]
[{"$f":"IF(B45=\"\",\"\",SUBTOTAL(3,$B$2:B45))","v":""}]
[{"$f":"IF(B46=\"\",\"\",SUBTOTAL(3,$B$2:B46))","v":""}]
[{"$f":"IF(B47=\"\",\"\",SUBTOTAL(3,$B$2:B47))","v":""}]
[{"$f":"IF(B48=\"\",\"\",SUBTOTAL(3,$B$2:B48))","v":""}]
[{"$f":"IF(B49=\"\",\"\",SUBTOTAL(3,$B$2:B49))","v":""}]
[{"$f":"IF(B50=\"\",\"\",SUBTOTAL(3,$B$2:B50))","v":""}]
[{"$f":"IF(B51=\"\",\"\",SUBTOTAL(3,$B$2:B51))","v":""}]
[{"$f":"IF(B52=\"\",\"\",SUBTOTAL(3,$B$2:B52))","v":""}]
[{"$f":"IF(B53=\"\",\"\",SUBTOTAL(3,$B$2:B53))","v":""}]
[{"$f":"IF(B54=\"\",\"\",SUBTOTAL(3,$B$2:B54))","v":""}]
[{"$f":"IF(B55=\"\",\"\",SUBTOTAL(3,$B$2:B55))","v":""}]
[{"$f":"IF(B56=\"\",\"\",SUBTOTAL(3,$B$2:B56))","v":""}]
[{"$f":"IF(B57=\"\",\"\",SUBTOTAL(3,$B$2:B57))","v":""}]
[{"$f":"IF(B58=\"\",\"\",SUBTOTAL(3,$B$2:B58))","v":""}]
[{"$f":"IF(B59=\"\",\"\",SUBTOTAL(3,$B$2:B59))","v":""}]
[{"$f":"IF(B60=\"\",\"\",SUBTOTAL(3,$B$2:B60))","v":""}]
[{"$f":"IF(B61=\"\",\"\",SUBTOTAL(3,$B$2:B61))","v":""}]
[{"$f":"IF(B62=\"\",\"\",SUBTOTAL(3,$B$2:B62))","v":""}]
[{"$f":"IF(B63=\"\",\"\",SUBTOTAL(3,$B$2:B63))","v":""}]
[{"$f":"IF(B64=\"\",\"\",SUBTOTAL(3,$B$2:B64))","v":""}]
[{"$f":"IF(B65=\"\",\"\",SUBTOTAL(3,$B$2:B65))","v":""}]
[{"$f":"IF(B66=\"\",\"\",SUBTOTAL(3,$B$2:B66))","v":""}]
[{"$f":"IF(B67=\"\",\"\",SUBTOTAL(3,$B$2:B67))","v":""}]
[{"$f":"IF(B68=\"\",\"\",SUBTOTAL(3,$B$2:B68))","v":""}]
[{"$f":"IF(B69=\"\",\"\",SUBTOTAL(3,$B$2:B69))","v":""}]
[{"$f":"IF(B70=\"\",\"\",SUBTOTAL(3,$B$2:B70))","v":""}]
[{"$f":"IF(B71=\"\",\"\",SUBTOTAL(3,$B$2:B71))","v":""}]
[{"$f":"IF(B72=\"\",\"\",SUBTOTAL(3,$B$2:B72))","v":""}]
[{"$f":"IF(B73=\"\",\"\",SUBTOTAL(3,$B$2:B73))","v":""}]
[{"$f":"IF(B74=\"\",\"\",SUBTOTAL(3,$B$2:B74))","v":""}]
[{"$f":"IF(B75=\"\",\"\",SUBTOTAL(3,$B$2:B75))","v":""}]
[{"$f":"IF(B76=\"\",\"\",SUBTOTAL(3,$B$2:B76))","v":""}]
[{"$f":"IF(B77=\"\",\"\",SUBTOTAL(3,$B$2:B77))","v":""}]
[{"$f":"IF(B78=\"\",\"\",SUBTOTAL(3,$B$2:B78))","v":""}]
[{"$f":"IF(B79=\"\",\"\",SUBTOTAL(3,$B$2:B79))","v":""}]
[{"$f":"IF(B80=\"\",\"\",SUBTOTAL(3,$B$2:B80))","v":""}]
[{"$f":"IF(B81=\"\",\"\",SUBTOTAL(3,$B$2:B81))","v":""}]
[{"$f":"IF(B82=\"\",\"\",SUBTOTAL(3,$B$2:B82))","v":""}]
[{"$f":"IF(B83=\"\",\"\",SUBTOTAL(3,$B$2:B83))","v":""}]
[{"$f":"IF(B84=\"\",\"\",SUBTOTAL(3,$B$2:B84))","v":""}]
[{"$f":"IF(B85=\"\",\"\",SUBTOTAL(3,$B$2:B85))","v":""}]
[{"$f":"IF(B86=\"\",\"\",SUBTOTAL(3,$B$2:B86))","v":""}]
[{"$f":"IF(B87=\"\",\"\",SUBTOTAL(3,$B$2:B87))","v":""}]
[{"$f":"IF(B88=\"\",\"\",SUBTOTAL(3,$B$2:B88))","v":""}]
[{"$f":"IF(B89=\"\",\"\",SUBTOTAL(3,$B$2:B89))","v":""}]
[{"$f":"IF(B90=\"\",\"\",SUBTOTAL(3,$B$2:B90))","v":""}]
[{"$f":"IF(B91=\"\",\"\",SUBTOTAL(3,$B$2:B91))","v":""}]
[{"$f":"IF(B92=\"\",\"\",SUBTOTAL(3,$B$2:B92))","v":""}]
[{"$f":"IF(B93=\"\",\"\",SUBTOTAL(3,$B$2:B93))","v":""}]
[{"$f":"IF(B94=\"\",\"\",SUBTOTAL(3,$B$2:B94))","v":""}]
[{"$f":"IF(B95=\"\",\"\",SUBTOTAL(3,$B$2:B95))","v":""}]
[{"$f":"IF(B96=\"\",\"\",SUBTOTAL(3,$B$2:B96))","v":""}]
[{"$f":"IF(B97=\"\",\"\",SUBTOTAL(3,$B$2:B97))","v":""}]
[{"$f":"IF(B98=\"\",\"\",SUBTOTAL(3,$B$2:B98))","v":""}]
[{"$f":"IF(B99=\"\",\"\",SUBTOTAL(3,$B$2:B99))","v":""}]
[{"$f":"IF(B100=\"\",\"\",SUBTOTAL(3,$B$2:B100))","v":""}]
[{"$f":"IF(B101=\"\",\"\",SUBTOTAL(3,$B$2:B101))","v":""}]
[{"$f":"IF(B102=\"\",\"\",SUBTOTAL(3,$B$2:B102))","v":""}]
[{"$f":"IF(B103=\"\",\"\",SUBTOTAL(3,$B$2:B103))","v":""}]
[{"$f":"IF(B104=\"\",\"\",SUBTOTAL(3,$B$2:B104))","v":""}]
[{"$f":"IF(B105=\"\",\"\",SUBTOTAL(3,$B$2:B105))","v":""}]
[{"$f":"IF(B106=\"\",\"\",SUBTOTAL(3,$B$2:B106))","v":""}]
[{"$f":"IF(B107=\"\",\"\",SUBTOTAL(3,$B$2:B107))","v":""}]
[{"$f":"IF(B108=\"\",\"\",SUBTOTAL(3,$B$2:B108))","v":""}]
[{"$f":"IF(B109=\"\",\"\",SUBTOTAL(3,$B$2:B109))","v":""}]
[{"$f":"IF(B110=\"\",\"\",SUBTOTAL(3,$B$2:B110))","v":""}]
[{"$f":"IF(B111=\"\",\"\",SUBTOTAL(3,$B$2:B111))","v":""}]
[{"$f":"IF(B112=\"\",\"\",SUBTOTAL(3,$B$2:B112))","v":""}]
[{"$f":"IF(B113=\"\",\"\",SUBTOTAL(3,$B$2:B113))","v":""}]
[{"$f":"IF(B114=\"\",\"\",SUBTOTAL(3,$B$2:B114))","v":""}]
[{"$f":"IF(B115=\"\",\"\",SUBTOTAL(3,$B$2:B115))","v":""}]
[{"$f":"IF(B116=\"\",\"\",SUBTOTAL(3,$B$2:B116))","v":""}]
[{"$f":"IF(B117=\"\",\"\",SUBTOTAL(3,$B$2:B117))","v":""}]
[{"$f":"IF(B118=\"\",\"\",SUBTOTAL(3,$B$2:B118))","v":""}]
[{"$f":"IF(B119=\"\",\"\",SUBTOTAL(3,$B$2:B119))","v":""}]
[{"$f":"IF(B120=\"\",\"\",SUBTOTAL(3,$B$2:B120))","v":""}]
[{"$f":"IF(B121=\"\",\"\",SUBTOTAL(3,$B$2:B121))","v":""}]
[{"$f":"IF(B122=\"\",\"\",SUBTOTAL(3,$B$2:B122))","v":""}]
[{"$f":"IF(B123=\"\",\"\",SUBTOTAL(3,$B$2:B123))","v":""}]
[{"$f":"IF(B124=\"\",\"\",SUBTOTAL(3,$B$2:B124))","v":""}]
[{"$f":"IF(B125=\"\",\"\",SUBTOTAL(3,$B$2:B125))","v":""}]
[{"$f":"IF(B126=\"\",\"\",SUBTOTAL(3,$B$2:B126))","v":""}]
[{"$f":"IF(B127=\"\",\"\",SUBTOTAL(3,$B$2:B127))","v":""}]
[{"$f":"IF(B128=\"\",\"\",SUBTOTAL(3,$B$2:B128))","v":""}]
[{"$f":"IF(B129=\"\",\"\",SUBTOTAL(3,$B$2:B129))","v":""}]
[{"$f":"IF(B130=\"\",\"\",SUBTOTAL(3,$B$2:B130))","v":""}]
[{"$f":"IF(B131=\"\",\"\",SUBTOTAL(3,$B$2:B131))","v":""}]
[{"$f":"IF(B132=\"\",\"\",SUBTOTAL(3,$B$2:B132))","v":""}]
[{"$f":"IF(B133=\"\",\"\",SUBTOTAL(3,$B$2:B133))","v":""}]
[{"$f":"IF(B134=\"\",\"\",SUBTOTAL(3,$B$2:B134))","v":""}]
[{"$f":"IF(B135=\"\",\"\",SUBTOTAL(3,$B$2:B135))","v":""}]
[{"$f":"IF(B136=\"\",\"\",SUBTOTAL(3,$B$2:B136))","v":""}]
[{"$f":"IF(B137=\"\",\"\",SUBTOTAL(3,$B$2:B137))","v":""}]
[{"$f":"IF(B138=\"\",\"\",SUBTOTAL(3,$B$2:B138))","v":""}]
[{"$f":"IF(B139=\"\",\"\",SUBTOTAL(3,$B$2:B139))","v":""}]
[{"$f":"IF(B140=\"\",\"\",SUBTOTAL(3,$B$2:B140))","v":""}]
[{"$f":"IF(B141=\"\",\"\",SUBTOTAL(3,$B$2:B141))","v":""}]
[{"$f":"IF(B142=\"\",\"\",SUBTOTAL(3,$B$2:B142))","v":""}]
[{"$f":"IF(B143=\"\",\"\",SUBTOTAL(3,$B$2:B143))","v":""}]
[{"$f":"IF(B144=\"\",\"\",SUBTOTAL(3,$B$2:B144))","v":""}]
[{"$f":"IF(B145=\"\",\"\",SUBTOTAL(3,$B$2:B145))","v":""}]
[{"$f":"IF(B146=\"\",\"\",SUBTOTAL(3,$B$2:B146))","v":""}]
[{"$f":"IF(B147=\"\",\"\",SUBTOTAL(3,$B$2:B147))","v":""}]
[{"$f":"IF(B148=\"\",\"\",SUBTOTAL(3,$B$2:B148))","v":""}]
[{"$f":"IF(B149=\"\",\"\",SUBTOTAL(3,$B$2:B149))","v":""}]
[{"$f":"IF(B150=\"\",\"\",SUBTOTAL(3,$B$2:B150))","v":""}]
[{"$f":"IF(B151=\"\",\"\",SUBTOTAL(3,$B$2:B151))","v":""}]
[{"$f":"IF(B152=\"\",\"\",SUBTOTAL(3,$B$2:B152))","v":""}]
[{"$f":"IF(B153=\"\",\"\",SUBTOTAL(3,$B$2:B153))","v":""}]
[{"$f":"IF(B154=\"\",\"\",SUBTOTAL(3,$B$2:B154))","v":""}]
[{"$f":"IF(B155=\"\",\"\",SUBTOTAL(3,$B$2:B155))","v":""}]
[{"$f":"IF(B156=\"\",\"\",SUBTOTAL(3,$B$2:B156))","v":""}]
[{"$f":"IF(B157=\"\",\"\",SUBTOTAL(3,$B$2:B157))","v":""}]
[{"$f":"IF(B158=\"\",\"\",SUBTOTAL(3,$B$2:B158))","v":""}]
[{"$f":"IF(B159=\"\",\"\",SUBTOTAL(3,$B$2:B159))","v":""}]
[{"$f":"IF(B160=\"\",\"\",SUBTOTAL(3,$B$2:B160))","v":""}]
[{"$f":"IF(B161=\"\",\"\",SUBTOTAL(3,$B$2:B161))","v":""}]
[{"$f":"IF(B162=\"\",\"\",SUBTOTAL(3,$B$2:B162))","v":""}]
[{"$f":"IF(B163=\"\",\"\",SUBTOTAL(3,$B$2:B163))","v":""}]
[{"$f":"IF(B164=\"\",\"\",SUBTOTAL(3,$B$2:B164))","v":""}]
[{"$f":"IF(B165=\"\",\"\",SUBTOTAL(3,$B$2:B165))","v":""}]
[{"$f":"IF(B166=\"\",\"\",SUBTOTAL(3,$B$2:B166))","v":""}]
[{"$f":"IF(B167=\"\",\"\",SUBTOTAL(3,$B$2:B167))","v":""}]
[{"$f":"IF(B168=\"\",\"\",SUBTOTAL(3,$B$2:B168))","v":""}]
[{"$f":"IF(B169=\"\",\"\",SUBTOTAL(3,$B$2:B169))","v":""}]
[{"$f":"IF(B170=\"\",\"\",SUBTOTAL(3,$B$2:B170))","v":""}]
[{"$f":"IF(B171=\"\",\"\",SUBTOTAL(3,$B$2:B171))","v":""}]
[{"$f":"IF(B172=\"\",\"\",SUBTOTAL(3,$B$2:B172))","v":""}]
[{"$f":"IF(B173=\"\",\"\",SUBTOTAL(3,$B$2:B173))","v":""}]
[{"$f":"IF(B174=\"\",\"\",SUBTOTAL(3,$B$2:B174))","v":""}]
[{"$f":"IF(B175=\"\",\"\",SUBTOTAL(3,$B$2:B175))","v":""}]
[{"$f":"IF(B176=\"\",\"\",SUBTOTAL(3,$B$2:B176))","v":""}]
[{"$f":"IF(B177=\"\",\"\",SUBTOTAL(3,$B$2:B177))","v":""}]
[{"$f":"IF(B178=\"\",\"\",SUBTOTAL(3,$B$2:B178))","v":""}]
[{"$f":"IF(B179=\"\",\"\",SUBTOTAL(3,$B$2:B179))","v":""}]
[{"$f":"IF(B180=\"\",\"\",SUBTOTAL(3,$B$2:B180))","v":""}]
[{"$f":"IF(B181=\"\",\"\",SUBTOTAL(3,$B$2:B181))","v":""}]
[{"$f":"IF(B182=\"\",\"\",SUBTOTAL(3,$B$2:B182))","v":""}]
[{"$f":"IF(B183=\"\",\"\",SUBTOTAL(3,$B$2:B183))","v":""}]
[{"$f":"IF(B184=\"\",\"\",SUBTOTAL(3,$B$2:B184))","v":""}]
[{"$f":"IF(B185=\"\",\"\",SUBTOTAL(3,$B$2:B185))","v":""}]
[{"$f":"IF(B186=\"\",\"\",SUBTOTAL(3,$B$2:B186))","v":""}]
[{"$f":"IF(B187=\"\",\"\",SUBTOTAL(3,$B$2:B187))","v":""}]
[{"$f":"IF(B188=\"\",\"\",SUBTOTAL(3,$B$2:B188))","v":""}]
[{"$f":"IF(B189=\"\",\"\",SUBTOTAL(3,$B$2:B189))","v":""}]
[{"$f":"IF(B190=\"\",\"\",SUBTOTAL(3,$B$2:B190))","v":""}]
[{"$f":"IF(B191=\"\",\"\",SUBTOTAL(3,$B$2:B191))","v":""}]
[{"$f":"IF(B192=\"\",\"\",SUBTOTAL(3,$B$2:B192))","v":""}]
[{"$f":"IF(B193=\"\",\"\",SUBTOTAL(3,$B$2:B193))","v":""}]
[{"$f":"IF(B194=\"\",\"\",SUBTOTAL(3,$B$2:B194))","v":""}]
[{"$f":"IF(B195=\"\",\"\",SUBTOTAL(3,$B$2:B195))","v":""}]
[{"$f":"IF(B196=\"\",\"\",SUBTOTAL(3,$B$2:B196))","v":""}]
[{"$f":"IF(B197=\"\",\"\",SUBTOTAL(3,$B$2:B197))","v":""}]
[{"$f":"IF(B198=\"\",\"\",SUBTOTAL(3,$B$2:B198))","v":""}]
[{"$f":"IF(B199=\"\",\"\",SUBTOTAL(3,$B$2:B199))","v":""}]
[{"$f":"IF(B200=\"\",\"\",SUBTOTAL(3,$B$2:B200))","v":""}]
[{"$f":"IF(B201=\"\",\"\",SUBTOTAL(3,$B$2:B201))","v":""}]
[{"$f":"IF(B202=\"\",\"\",SUBTOTAL(3,$B$2:B202))","v":""}]
[{"$f":"IF(B203=\"\",\"\",SUBTOTAL(3,$B$2:B203))","v":""}]
[{"$f":"IF(B204=\"\",\"\",SUBTOTAL(3,$B$2:B204))","v":""}]
[{"$f":"IF(B205=\"\",\"\",SUBTOTAL(3,$B$2:B205))","v":""}]
[{"$f":"IF(B206=\"\",\"\",SUBTOTAL(3,$B$2:B206))","v":""}]
[{"$f":"IF(B207=\"\",\"\",SUBTOTAL(3,$B$2:B207))","v":""}]
[{"$f":"IF(B208=\"\",\"\",SUBTOTAL(3,$B$2:B208))","v":""}]
[{"$f":"IF(B209=\"\",\"\",SUBTOTAL(3,$B$2:B209))","v":""}]
[{"$f":"IF(B210=\"\",\"\",SUBTOTAL(3,$B$2:B210))","v":""}]
[{"$f":"IF(B211=\"\",\"\",SUBTOTAL(3,$B$2:B211))","v":""}]
[{"$f":"IF(B212=\"\",\"\",SUBTOTAL(3,$B$2:B212))","v":""}]
[{"$f":"IF(B213=\"\",\"\",SUBTOTAL(3,$B$2:B213))","v":""}]
[{"$f":"IF(B214=\"\",\"\",SUBTOTAL(3,$B$2:B214))","v":""}]
[{"$f":"IF(B215=\"\",\"\",SUBTOTAL(3,$B$2:B215))","v":""}]
[{"$f":"IF(B216=\"\",\"\",SUBTOTAL(3,$B$2:B216))","v":""}]
[{"$f":"IF(B217=\"\",\"\",SUBTOTAL(3,$B$2:B217))","v":""}]
[{"$f":"IF(B218=\"\",\"\",SUBTOTAL(3,$B$2:B218))","v":""}]
[{"$f":"IF(B219=\"\",\"\",SUBTOTAL(3,$B$2:B219))","v":""}]
[{"$f":"IF(B220=\"\",\"\",SUBTOTAL(3,$B$2:B220))","v":""}]
[{"$f":"IF(B221=\"\",\"\",SUBTOTAL(3,$B$2:B221))","v":""}]
[{"$f":"IF(B222=\"\",\"\",SUBTOTAL(3,$B$2:B222))","v":""}]
[{"$f":"IF(B223=\"\",\"\",SUBTOTAL(3,$B$2:B223))","v":""}]
[{"$f":"IF(B224=\"\",\"\",SUBTOTAL(3,$B$2:B224))","v":""}]
[{"$f":"IF(B225=\"\",\"\",SUBTOTAL(3,$B$2:B225))","v":""}]
[{"$f":"IF(B226=\"\",\"\",SUBTOTAL(3,$B$2:B226))","v":""}]
[{"$f":"IF(B227=\"\",\"\",SUBTOTAL(3,$B$2:B227))","v":""}]
[{"$f":"IF(B228=\"\",\"\",SUBTOTAL(3,$B$2:B228))","v":""}]
[{"$f":"IF(B229=\"\",\"\",SUBTOTAL(3,$B$2:B229))","v":""}]
[{"$f":"IF(B230=\"\",\"\",SUBTOTAL(3,$B$2:B230))","v":""}]
[{"$f":"IF(B231=\"\",\"\",SUBTOTAL(3,$B$2:B231))","v":""}]
[{"$f":"IF(B232=\"\",\"\",SUBTOTAL(3,$B$2:B232))","v":""}]
[{"$f":"IF(B233=\"\",\"\",SUBTOTAL(3,$B$2:B233))","v":""}]
[{"$f":"IF(B234=\"\",\"\",SUBTOTAL(3,$B$2:B234))","v":""}]
[{"$f":"IF(B235=\"\",\"\",SUBTOTAL(3,$B$2:B235))","v":""}]
[{"$f":"IF(B236=\"\",\"\",SUBTOTAL(3,$B$2:B236))","v":""}]
[{"$f":"IF(B237=\"\",\"\",SUBTOTAL(3,$B$2:B237))","v":""}]
[{"$f":"IF(B238=\"\",\"\",SUBTOTAL(3,$B$2:B238))","v":""}]
[{"$f":"IF(B239=\"\",\"\",SUBTOTAL(3,$B$2:B239))","v":""}]
[{"$f":"IF(B240=\"\",\"\",SUBTOTAL(3,$B$2:B240))","v":""}]
[{"$f":"IF(B241=\"\",\"\",SUBTOTAL(3,$B$2:B241))","v":""}]
[{"$f":"IF(B242=\"\",\"\",SUBTOTAL(3,$B$2:B242))","v":""}]
[{"$f":"IF(B243=\"\",\"\",SUBTOTAL(3,$B$2:B243))","v":""}]
[{"$f":"IF(B244=\"\",\"\",SUBTOTAL(3,$B$2:B244))","v":""}]
[{"$f":"IF(B245=\"\",\"\",SUBTOTAL(3,$B$2:B245))","v":""}]
[{"$f":"IF(B246=\"\",\"\",SUBTOTAL(3,$B$2:B246))","v":""}]
[{"$f":"IF(B247=\"\",\"\",SUBTOTAL(3,$B$2:B247))","v":""}]
[{"$f":"IF(B248=\"\",\"\",SUBTOTAL(3,$B$2:B248))","v":""}]
[{"$f":"IF(B249=\"\",\"\",SUBTOTAL(3,$B$2:B249))","v":""}]
[{"$f":"IF(B250=\"\",\"\",SUBTOTAL(3,$B$2:B250))","v":""}]
[{"$f":"IF(B251=\"\",\"\",SUBTOTAL(3,$B$2:B251))","v":""}]
[{"$f":"IF(B252=\"\",\"\",SUBTOTAL(3,$B$2:B252))","v":""}]
[{"$f":"IF(B253=\"\",\"\",SUBTOTAL(3,$B$2:B253))","v":""}]
[{"$f":"IF(B254=\"\",\"\",SUBTOTAL(3,$B$2:B254))","v":""}]
[{"$f":"IF(B255=\"\",\"\",SUBTOTAL(3,$B$2:B255))","v":""}]
[{"$f":"IF(B256=\"\",\"\",SUBTOTAL(3,$B$2:B256))","v":""}]
[{"$f":"IF(B257=\"\",\"\",SUBTOTAL(3,$B$2:B257))","v":""}]
[{"$f":"IF(B258=\"\",\"\",SUBTOTAL(3,$B$2:B258))","v":""}]
[{"$f":"IF(B259=\"\",\"\",SUBTOTAL(3,$B$2:B259))","v":""}]
[{"$f":"IF(B260=\"\",\"\",SUBTOTAL(3,$B$2:B260))","v":""}]
[{"$f":"IF(B261=\"\",\"\",SUBTOTAL(3,$B$2:B261))","v":""}]
[{"$f":"IF(B262=\"\",\"\",SUBTOTAL(3,$B$2:B262))","v":""}]
[{"$f":"IF(B263=\"\",\"\",SUBTOTAL(3,$B$2:B263))","v":""}]
[{"$f":"IF(B264=\"\",\"\",SUBTOTAL(3,$B$2:B264))","v":""}]
[{"$f":"IF(B265=\"\",\"\",SUBTOTAL(3,$B$2:B265))","v":""}]
[{"$f":"IF(B266=\"\",\"\",SUBTOTAL(3,$B$2:B266))","v":""}]
[{"$f":"IF(B267=\"\",\"\",SUBTOTAL(3,$B$2:B267))","v":""}]
[{"$f":"IF(B268=\"\",\"\",SUBTOTAL(3,$B$2:B268))","v":""}]
[{"$f":"IF(B269=\"\",\"\",SUBTOTAL(3,$B$2:B269))","v":""}]
[{"$f":"IF(B270=\"\",\"\",SUBTOTAL(3,$B$2:B270))","v":""}]
[{"$f":"IF(B271=\"\",\"\",SUBTOTAL(3,$B$2:B271))","v":""}]
[{"$f":"IF(B272=\"\",\"\",SUBTOTAL(3,$B$2:B272))","v":""}]
[{"$f":"IF(B273=\"\",\"\",SUBTOTAL(3,$B$2:B273))","v":""}]
[{"$f":"IF(B274=\"\",\"\",SUBTOTAL(3,$B$2:B274))","v":""}]
[{"$f":"IF(B275=\"\",\"\",SUBTOTAL(3,$B$2:B275))","v":""}]
[{"$f":"IF(B276=\"\",\"\",SUBTOTAL(3,$B$2:B276))","v":""}]
[{"$f":"IF(B277=\"\",\"\",SUBTOTAL(3,$B$2:B277))","v":""}]
[{"$f":"IF(B278=\"\",\"\",SUBTOTAL(3,$B$2:B278))","v":""}]
[{"$f":"IF(B279=\"\",\"\",SUBTOTAL(3,$B$2:B279))","v":""}]
[{"$f":"IF(B280=\"\",\"\",SUBTOTAL(3,$B$2:B280))","v":""}]
[{"$f":"IF(B281=\"\",\"\",SUBTOTAL(3,$B$2:B281))","v":""}]
[{"$f":"IF(B282=\"\",\"\",SUBTOTAL(3,$B$2:B282))","v":""}]
[{"$f":"IF(B283=\"\",\"\",SUBTOTAL(3,$B$2:B283))","v":""}]
[{"$f":"IF(B284=\"\",\"\",SUBTOTAL(3,$B$2:B284))","v":""}]
[{"$f":"IF(B285=\"\",\"\",SUBTOTAL(3,$B$2:B285))","v":""}]
[{"$f":"IF(B286=\"\",\"\",SUBTOTAL(3,$B$2:B286))","v":""}]
[{"$f":"IF(B287=\"\",\"\",SUBTOTAL(3,$B$2:B287))","v":""}]
[{"$f":"IF(B288=\"\",\"\",SUBTOTAL(3,$B$2:B288))","v":""}]
[{"$f":"IF(B289=\"\",\"\",SUBTOTAL(3,$B$2:B289))","v":""}]
[{"$f":"IF(B290=\"\",\"\",SUBTOTAL(3,$B$2:B290))","v":""}]
[{"$f":"IF(B291=\"\",\"\",SUBTOTAL(3,$B$2:B291))","v":""}]
[{"$f":"IF(B292=\"\",\"\",SUBTOTAL(3,$B$2:B292))","v":""}]
[{"$f":"IF(B293=\"\",\"\",SUBTOTAL(3,$B$2:B293))","v":""}]
[{"$f":"IF(B294=\"\",\"\",SUBTOTAL(3,$B$2:B294))","v":""}]
[{"$f":"IF(B295=\"\",\"\",SUBTOTAL(3,$B$2:B295))","v":""}]
[{"$f":"IF(B296=\"\",\"\",SUBTOTAL(3,$B$2:B296))","v":""}]
[{"$f":"IF(B297=\"\",\"\",SUBTOTAL(3,$B$2:B297))","v":""}]
[{"$f":"IF(B298=\"\",\"\",SUBTOTAL(3,$B$2:B298))","v":""}]
[{"$f":"IF(B299=\"\",\"\",SUBTOTAL(3,$B$2:B299))","v":""}]
[{"$f":"IF(B300=\"\",\"\",SUBTOTAL(3,$B$2:B300))","v":""}]
[{"$f":"IF(B301=\"\",\"\",SUBTOTAL(3,$B$2:B301))","v":""}]
[{"$f":"IF(B302=\"\",\"\",SUBTOTAL(3,$B$2:B302))","v":""}]
[{"$f":"IF(B303=\"\",\"\",SUBTOTAL(3,$B$2:B303))","v":""}]
[{"$f":"IF(B304=\"\",\"\",SUBTOTAL(3,$B$2:B304))","v":""}]
[{"$f":"IF(B305=\"\",\"\",SUBTOTAL(3,$B$2:B305))","v":""}]
[{"$f":"IF(B306=\"\",\"\",SUBTOTAL(3,$B$2:B306))","v":""}]
[{"$f":"IF(B307=\"\",\"\",SUBTOTAL(3,$B$2:B307))","v":""}]
[{"$f":"IF(B308=\"\",\"\",SUBTOTAL(3,$B$2:B308))","v":""}]
[{"$f":"IF(B309=\"\",\"\",SUBTOTAL(3,$B$2:B309))","v":""}]
[{"$f":"IF(B310=\"\",\"\",SUBTOTAL(3,$B$2:B310))","v":""}]
[{"$f":"IF(B311=\"\",\"\",SUBTOTAL(3,$B$2:B311))","v":""}]
[{"$f":"IF(B312=\"\",\"\",SUBTOTAL(3,$B$2:B312))","v":""}]
[{"$f":"IF(B313=\"\",\"\",SUBTOTAL(3,$B$2:B313))","v":""}]
[{"$f":"IF(B314=\"\",\"\",SUBTOTAL(3,$B$2:B314))","v":""}]
[{"$f":"IF(B315=\"\",\"\",SUBTOTAL(3,$B$2:B315))","v":""}]
[{"$f":"IF(B316=\"\",\"\",SUBTOTAL(3,$B$2:B316))","v":""}]
[{"$f":"IF(B317=\"\",\"\",SUBTOTAL(3,$B$2:B317))","v":""}]
[{"$f":"IF(B318=\"\",\"\",SUBTOTAL(3,$B$2:B318))","v":""}]
[{"$f":"IF(B319=\"\",\"\",SUBTOTAL(3,$B$2:B319))","v":""}]
[{"$f":"IF(B320=\"\",\"\",SUBTOTAL(3,$B$2:B320))","v":""}]
[{"$f":"IF(B321=\"\",\"\",SUBTOTAL(3,$B$2:B321))","v":""}]
[{"$f":"IF(B322=\"\",\"\",SUBTOTAL(3,$B$2:B322))","v":""}]
[{"$f":"IF(B323=\"\",\"\",SUBTOTAL(3,$B$2:B323))","v":""}]
[{"$f":"IF(B324=\"\",\"\",SUBTOTAL(3,$B$2:B324))","v":""}]
[{"$f":"IF(B325=\"\",\"\",SUBTOTAL(3,$B$2:B325))","v":""}]
[{"$f":"IF(B326=\"\",\"\",SUBTOTAL(3,$B$2:B326))","v":""}]
[{"$f":"IF(B327=\"\",\"\",SUBTOTAL(3,$B$2:B327))","v":""}]
[{"$f":"IF(B328=\"\",\"\",SUBTOTAL(3,$B$2:B328))","v":""}]
[{"$f":"IF(B329=\"\",\"\",SUBTOTAL(3,$B$2:B329))","v":""}]
[{"$f":"IF(B330=\"\",\"\",SUBTOTAL(3,$B$2:B330))","v":""}]
[{"$f":"IF(B331=\"\",\"\",SUBTOTAL(3,$B$2:B331))","v":""}]
[{"$f":"IF(B332=\"\",\"\",SUBTOTAL(3,$B$2:B332))","v":""}]
[{"$f":"IF(B333=\"\",\"\",SUBTOTAL(3,$B$2:B333))","v":""}]
[{"$f":"IF(B334=\"\",\"\",SUBTOTAL(3,$B$2:B334))","v":""}]
[{"$f":"IF(B335=\"\",\"\",SUBTOTAL(3,$B$2:B335))","v":""}]
[{"$f":"IF(B336=\"\",\"\",SUBTOTAL(3,$B$2:B336))","v":""}]
[{"$f":"IF(B337=\"\",\"\",SUBTOTAL(3,$B$2:B337))","v":""}]
[{"$f":"IF(B338=\"\",\"\",SUBTOTAL(3,$B$2:B338))","v":""}]
[{"$f":"IF(B339=\"\",\"\",SUBTOTAL(3,$B$2:B339))","v":""}]
[{"$f":"IF(B340=\"\",\"\",SUBTOTAL(3,$B$2:B340))","v":""}]
[{"$f":"IF(B341=\"\",\"\",SUBTOTAL(3,$B$2:B341))","v":""}]
[{"$f":"IF(B342=\"\",\"\",SUBTOTAL(3,$B$2:B342))","v":""}]
[{"$f":"IF(B343=\"\",\"\",SUBTOTAL(3,$B$2:B343))","v":""}]
[{"$f":"IF(B344=\"\",\"\",SUBTOTAL(3,$B$2:B344))","v":""}]
[{"$f":"IF(B345=\"\",\"\",SUBTOTAL(3,$B$2:B345))","v":""}]
[{"$f":"IF(B346=\"\",\"\",SUBTOTAL(3,$B$2:B346))","v":""}]
[{"$f":"IF(B347=\"\",\"\",SUBTOTAL(3,$B$2:B347))","v":""}]
[{"$f":"IF(B348=\"\",\"\",SUBTOTAL(3,$B$2:B348))","v":""}]
[{"$f":"IF(B349=\"\",\"\",SUBTOTAL(3,$B$2:B349))","v":""}]
[{"$f":"IF(B350=\"\",\"\",SUBTOTAL(3,$B$2:B350))","v":""}]
[{"$f":"IF(B351=\"\",\"\",SUBTOTAL(3,$B$2:B351))","v":""}]
[{"$f":"IF(B352=\"\",\"\",SUBTOTAL(3,$B$2:B352))","v":""}]
[{"$f":"IF(B353=\"\",\"\",SUBTOTAL(3,$B$2:B353))","v":""}]
[{"$f":"IF(B354=\"\",\"\",SUBTOTAL(3,$B$2:B354))","v":""}]
[{"$f":"IF(B355=\"\",\"\",SUBTOTAL(3,$B$2:B355))","v":""}]
[{"$f":"IF(B356=\"\",\"\",SUBTOTAL(3,$B$2:B356))","v":""}]
[{"$f":"IF(B357=\"\",\"\",SUBTOTAL(3,$B$2:B357))","v":""}]
[{"$f":"IF(B358=\"\",\"\",SUBTOTAL(3,$B$2:B358))","v":""}]
[{"$f":"IF(B359=\"\",\"\",SUBTOTAL(3,$B$2:B359))","v":""}]

{"sheet":"Lists","index":1,"n_rows":34,"n_cols":16,"rows_kept":34,"cut":false,"hidden":true,"merged":[]}
[]
[]
[]
[null,"مستفيد","ذكر","l","n","مستفيد","مهارات الحياة","مسجل","مكاني 1",null,{"$f":"COUNTIF(Data!L:L,Lists!F4)","v":0},null,{"$f":"COUNTIF(Data!O:O,Lists!H4)","v":0},1,2015,1]
[null,"غير مستفيد","أنثى","o","t","غير مستفيد","حماية الطفل","غير مسجل","مكاني 2",null,{"$f":"COUNTIF(Data!M:M,Lists!F4)","v":0},null,{"$f":"COUNTIF(Data!P:P,Lists!H4)","v":0},2,2016,2]
[null,null,null,"s","r",null,"خدمات دعم التعليم",null,"مكاني 3",null,{"$f":"COUNTIF(Data!N:N,Lists!F4)","v":0},null,{"$f":"COUNTIF(Data!Q:Q,Lists!H4)","v":0},3,2017,3]
[null,null,null,null,null,null,null,null,null,null,{"$f":"SUM(K4:K6)","v":0},null,{"$f":"SUM(M4:M6)","v":0},4,2018,4]
[null,null,null,null,null,null,null,null,null,null,null,null,null,5,2019,5]
[null,null,null,null,null,null,null,null,null,null,null,null,null,6,null,6]
[null,null,null,null,null,null,null,null,null,null,null,null,null,7,null,7]
[null,null,null,null,null,null,null,null,null,null,null,null,null,8,null,8]
[null,null,null,null,null,null,null,null,null,null,null,null,null,9,null,9]
[null,null,null,null,null,null,null,null,null,null,null,null,null,10,null,10]
[null,null,null,null,null,null,null,null,null,null,null,null,null,11,null,11]
[null,null,null,null,null,null,null,null,null,null,null,null,null,12,null,12]
[null,null,null,null,null,null,null,null,null,null,null,null,null,null,null,13]
[null,null,null,null,null,null,null,null,null,null,null,null,null,null,null,14]
[null,null,null,null,null,null,null,null,null,null,null,null,null,null,null,15]
[null,null,null,null,null,null,null,null,null,null,null,null,null,null,null,16]
[null,null,null,null,null,null,null,null,null,null,null,null,null,null,null,17]
[null,null,null,null,null,null,null,null,null,null,null,null,null,null,null,18]
[null,null,null,null,null,null,null,null,null,null,null,null,null,null,null,19]
[null,null,null,null,null,null,null,null,null,null,null,null,null,null,null,20]
[null,null,null,null,null,null,null,null,null,null,null,null,null,null,null,21]
[null,null,null,null,null,null,null,null,null,null,null,null,null,null,null,22]
[null,null,null,null,null,null,null,null,null,null,null,null,null,null,null,23]
[null,null,null,null,null,null,null,null,null,null,null,null,null,null,null,24]
[null,null,null,null,null,null,null,null,null,null,null,null,null,null,null,25]
[null,null,null,null,null,null,null,null,null,null,null,null,null,null,null,26]
[null,null,null,null,null,null,null,null,null,null,null,null,null,null,null,27]
[null,null,null,null,null,null,null,null,null,null,null,null,null,null,null,28]
[null,null,null,null,null,null,null,null,null,null,null,null,null,null,null,29]
[null,null,null,null,null,null,null,null,null,null,null,null,null,null,null,30]
[null,null,null,null,null,null,null,null,null,null,null,null,null,null,null,31]

{"sheet":"Engine","index":2,"n_rows":5,"n_cols":3,"rows_kept":5,"cut":false,"hidden":true,"merged":[]}
[]
[]
[null,{"$f":"COUNTA(Data!D1:D9994)-1","v":0},"Total entries in database - maximum 10000"]
[null,"EDIT","Mode"]
[null,1,"Row Store"]

{"sheet":"مهارات الحياة","index":3,"n_rows":3,"n_cols":14,"rows_kept":3,"cut":false,"hidden":false,"merged":[[0,0,0,10]]}
["قاعدة الحشد / برنامج مهارات الحياة"]
["الرقم","الاسم","اسم الام","Full Name","تاريخ الميلاد","الجنس","رقم الاثبات","الجنسية","العنوان","الهاتف","البرنامج","المشروع","تاريخ التسجيل","المركز"]
[1,"أحمد سعيد","فوزية سليم","أحمد سعيد محمد لطفى","2006-01-01","ذكر",1001,"مصرى","القاهرة",1010606050,"مهارات الحياة",2,"2018-10-01","الرياض"]

{"sheet":"حماية الطفل","index":4,"n_rows":3,"n_cols":14,"rows_kept":3,"cut":false,"hidden":false,"merged":[[0,0,0,14]]}
["قاعدة الحشد / برنامج حماية الطفل "]
["الرقم","الاسم","اسم الام","Full Name","تاريخ الميلاد","الجنس","رقم الاثبات","الجنسية","العنوان","الهاتف","البرنامج","المشروع","تاريخ التسجيل","المركز"]
[2,"منى حسين","أمال السادات","منى حسين شعبان","2008-06-01","أنثى",5060,"مصرية","الجيزة",102063590,"حماية الطفل",1,"2018-11-01","فوكس"]